You are viewing a plain text version of this content. The canonical link for it is here.
Posted to builds@cassandra.apache.org by Apache Jenkins Server <je...@builds.apache.org> on 2022/02/09 21:50:55 UTC

Build complete: Cassandra-trunk #947 [UNSTABLE] 543608ba39d5803b963d14821abe193ff0796b4f

-------------------------------------------------------------------------------
Build Cassandra-trunk #947 Unstable
URL: https://ci-cassandra.apache.org/job/Cassandra-trunk/947/
-------------------------------------------------------------------------------
Changes:
[Yifan Cai] Instance failed to start up due to NPE in


-------------------------------------------------------------------------------
Failed Tests:
46 tests failed.
FAILED:  org.apache.cassandra.distributed.test.ring.BootstrapTest.readWriteDuringBootstrapTest
FAILED:  org.apache.cassandra.distributed.test.ring.BootstrapTest.readWriteDuringBootstrapTest
FAILED:  org.apache.cassandra.db.commitlog.GroupCommitLogTest.replayWithDiscard[3]-cdc
FAILED:  org.apache.cassandra.db.commitlog.GroupCommitLogTest.testRecoveryWithEmptyFinalLog[4]-cdc
FAILED:  org.apache.cassandra.db.commitlog.GroupCommitLogTest.testRecoveryWithEmptyLog[4]-cdc
FAILED:  org.apache.cassandra.db.commitlog.GroupCommitLogTest.testRecoveryWithNegativeSizeArgument[4]-cdc
FAILED:  org.apache.cassandra.db.commitlog.GroupCommitLogTest.testOutOfOrderFlushRecoveryWithCompaction[4]-cdc
FAILED:  org.apache.cassandra.db.commitlog.GroupCommitLogTest.testExceedRecordLimit[4]-cdc
FAILED:  org.apache.cassandra.db.commitlog.GroupCommitLogTest.testExceedRecordLimitWithMultiplePartitions[4]-cdc
FAILED:  org.apache.cassandra.db.commitlog.GroupCommitLogTest.testOutOfOrderFlushRecovery[4]-cdc
FAILED:  org.apache.cassandra.db.commitlog.GroupCommitLogTest.testRecoveryWithIdMismatch[4]-cdc
FAILED:  org.apache.cassandra.db.commitlog.GroupCommitLogTest.testTruncateWithoutSnapshotNonDurable[4]-cdc
FAILED:  org.apache.cassandra.db.commitlog.GroupCommitLogTest.testDeleteIfNotDirty[4]-cdc
FAILED:  org.apache.cassandra.db.commitlog.GroupCommitLogTest.testRecoveryWithCollectionClusteringKeysStatic[4]-cdc
FAILED:  org.apache.cassandra.db.commitlog.GroupCommitLogTest.testOutOfOrderLogDiscard[4]-cdc
FAILED:  org.apache.cassandra.db.commitlog.GroupCommitLogTest.testRecoveryWithShortMutationSize[4]-cdc
FAILED:  org.apache.cassandra.db.commitlog.GroupCommitLogTest.testTruncateWithoutSnapshot[4]-cdc
FAILED:  org.apache.cassandra.db.commitlog.GroupCommitLogTest.testOutOfOrderLogDiscardWithCompaction[4]-cdc
FAILED:  org.apache.cassandra.db.commitlog.GroupCommitLogTest.testDontDeleteIfDirty[4]-cdc
FAILED:  org.apache.cassandra.db.commitlog.GroupCommitLogTest.testRecoveryWithGarbageLog_fail[4]-cdc
FAILED:  org.apache.cassandra.db.commitlog.GroupCommitLogTest.replayWithBadSyncMarkerCRC[4]-cdc
FAILED:  org.apache.cassandra.db.commitlog.GroupCommitLogTest.testRecoveryWithEmptyFinalLog[5]-cdc
FAILED:  org.apache.cassandra.db.commitlog.GroupCommitLogTest.replaySimple[5]-cdc
FAILED:  org.apache.cassandra.db.commitlog.GroupCommitLogTest.testRecoveryWithEmptyLog[5]-cdc
FAILED:  org.apache.cassandra.db.commitlog.GroupCommitLogTest.testRecoveryWithNegativeSizeArgument[5]-cdc
FAILED:  org.apache.cassandra.db.commitlog.GroupCommitLogTest.testOutOfOrderFlushRecoveryWithCompaction[5]-cdc
FAILED:  org.apache.cassandra.db.commitlog.GroupCommitLogTest.testExceedRecordLimit[5]-cdc
FAILED:  org.apache.cassandra.db.commitlog.GroupCommitLogTest.testExceedRecordLimitWithMultiplePartitions[5]-cdc
FAILED:  org.apache.cassandra.db.commitlog.GroupCommitLogTest.testOutOfOrderFlushRecovery[5]-cdc
FAILED:  org.apache.cassandra.db.commitlog.GroupCommitLogTest.testRecoveryWithIdMismatch[5]-cdc
FAILED:  org.apache.cassandra.db.commitlog.GroupCommitLogTest.testTruncateWithoutSnapshotNonDurable[5]-cdc
FAILED:  org.apache.cassandra.db.commitlog.GroupCommitLogTest.testDeleteIfNotDirty[5]-cdc
FAILED:  org.apache.cassandra.db.commitlog.GroupCommitLogTest.testRecoveryWithCollectionClusteringKeysStatic[5]-cdc
FAILED:  org.apache.cassandra.db.commitlog.GroupCommitLogTest.testOutOfOrderLogDiscard[5]-cdc
FAILED:  org.apache.cassandra.db.commitlog.GroupCommitLogTest.testRecoveryWithShortMutationSize[5]-cdc
FAILED:  org.apache.cassandra.db.commitlog.GroupCommitLogTest.testTruncateWithoutSnapshot[5]-cdc
FAILED:  org.apache.cassandra.db.commitlog.GroupCommitLogTest.testOutOfOrderLogDiscardWithCompaction[5]-cdc
FAILED:  org.apache.cassandra.db.commitlog.GroupCommitLogTest.testDontDeleteIfDirty[5]-cdc
FAILED:  org.apache.cassandra.db.commitlog.GroupCommitLogTest.testRecoveryWithGarbageLog_fail[5]-cdc
FAILED:  org.apache.cassandra.db.commitlog.GroupCommitLogTest.replayWithBadSyncMarkerCRC[5]-cdc
FAILED:  org.apache.cassandra.db.lifecycle.LogTransactionTest.testGetTemporaryFilesSafeAfterObsoletion-compression
FAILED:  org.apache.cassandra.tools.BulkLoaderTest.testBulkLoader_WithArgs1-compression
FAILED:  org.apache.cassandra.db.commitlog.CommitLogSegmentManagerCDCTest.testNonblockingShouldMaintainSteadyDiskUsage
FAILED:  org.apache.cassandra.db.commitlog.CommitLogSegmentManagerCDCTest.testCDCIndexFileWriteOnSync
FAILED:  org.apache.cassandra.db.lifecycle.LogTransactionTest.testGetTemporaryFilesSafeAfterObsoletion
FAILED:  org.apache.cassandra.distributed.upgrade.CompactStorageUpgradeTest.compactStorageUpgradeTest

-------------------------------------------------------------------------------
For complete test report and logs see https://nightlies.apache.org/cassandra/Cassandra-trunk/947/