You are viewing a plain text version of this content. The canonical link for it is here.
Posted to common-dev@hadoop.apache.org by Apache Jenkins Server <je...@builds.apache.org> on 2015/10/26 21:32:25 UTC

Build failed in Jenkins: Hadoop-Common-trunk #1909

See <https://builds.apache.org/job/Hadoop-Common-trunk/1909/changes>

Changes:

[wheat9] HDFS-9304. Add HdfsClientConfigKeys class to

[jlowe] YARN-4284. condition for AM blacklisting is too narrow. Contributed by

------------------------------------------
[...truncated 5402 lines...]
Running org.apache.hadoop.security.TestNetgroupCache
Tests run: 3, Failures: 0, Errors: 0, Skipped: 0, Time elapsed: 0.094 sec - in org.apache.hadoop.security.TestNetgroupCache
Running org.apache.hadoop.security.TestUserFromEnv
Tests run: 1, Failures: 0, Errors: 0, Skipped: 0, Time elapsed: 0.73 sec - in org.apache.hadoop.security.TestUserFromEnv
Running org.apache.hadoop.security.TestGroupsCaching
Tests run: 10, Failures: 0, Errors: 0, Skipped: 0, Time elapsed: 2.039 sec - in org.apache.hadoop.security.TestGroupsCaching
Running org.apache.hadoop.security.ssl.TestSSLFactory
Tests run: 15, Failures: 0, Errors: 0, Skipped: 0, Time elapsed: 4.453 sec - in org.apache.hadoop.security.ssl.TestSSLFactory
Running org.apache.hadoop.security.ssl.TestReloadingX509TrustManager
Tests run: 5, Failures: 0, Errors: 0, Skipped: 0, Time elapsed: 2.924 sec - in org.apache.hadoop.security.ssl.TestReloadingX509TrustManager
Running org.apache.hadoop.security.TestUGILoginFromKeytab
Tests run: 1, Failures: 0, Errors: 0, Skipped: 0, Time elapsed: 6.493 sec - in org.apache.hadoop.security.TestUGILoginFromKeytab
Running org.apache.hadoop.security.TestUserGroupInformation
Tests run: 34, Failures: 0, Errors: 0, Skipped: 0, Time elapsed: 3.985 sec - in org.apache.hadoop.security.TestUserGroupInformation
Running org.apache.hadoop.security.TestUGIWithExternalKdc
Tests run: 1, Failures: 0, Errors: 0, Skipped: 1, Time elapsed: 0.089 sec - in org.apache.hadoop.security.TestUGIWithExternalKdc
Running org.apache.hadoop.security.http.TestCrossOriginFilter
Tests run: 9, Failures: 0, Errors: 0, Skipped: 0, Time elapsed: 0.536 sec - in org.apache.hadoop.security.http.TestCrossOriginFilter
Running org.apache.hadoop.security.TestProxyUserFromEnv
Tests run: 1, Failures: 0, Errors: 0, Skipped: 0, Time elapsed: 0.715 sec - in org.apache.hadoop.security.TestProxyUserFromEnv
Running org.apache.hadoop.security.authorize.TestProxyUsers
Tests run: 17, Failures: 0, Errors: 0, Skipped: 0, Time elapsed: 1.191 sec - in org.apache.hadoop.security.authorize.TestProxyUsers
Running org.apache.hadoop.security.authorize.TestProxyServers
Tests run: 1, Failures: 0, Errors: 0, Skipped: 0, Time elapsed: 0.527 sec - in org.apache.hadoop.security.authorize.TestProxyServers
Running org.apache.hadoop.security.authorize.TestServiceAuthorization
Tests run: 7, Failures: 0, Errors: 0, Skipped: 0, Time elapsed: 1.547 sec - in org.apache.hadoop.security.authorize.TestServiceAuthorization
Running org.apache.hadoop.security.authorize.TestAccessControlList
Tests run: 8, Failures: 0, Errors: 0, Skipped: 0, Time elapsed: 1.051 sec - in org.apache.hadoop.security.authorize.TestAccessControlList
Running org.apache.hadoop.security.alias.TestCredShell
Tests run: 9, Failures: 0, Errors: 0, Skipped: 0, Time elapsed: 1.543 sec - in org.apache.hadoop.security.alias.TestCredShell
Running org.apache.hadoop.security.alias.TestCredentialProviderFactory
Tests run: 6, Failures: 0, Errors: 0, Skipped: 0, Time elapsed: 1.543 sec - in org.apache.hadoop.security.alias.TestCredentialProviderFactory
Running org.apache.hadoop.security.alias.TestCredentialProvider
Tests run: 2, Failures: 0, Errors: 0, Skipped: 0, Time elapsed: 0.112 sec - in org.apache.hadoop.security.alias.TestCredentialProvider
Running org.apache.hadoop.security.TestAuthenticationFilter
Tests run: 1, Failures: 0, Errors: 0, Skipped: 0, Time elapsed: 0.675 sec - in org.apache.hadoop.security.TestAuthenticationFilter
Running org.apache.hadoop.security.TestLdapGroupsMapping
Tests run: 5, Failures: 0, Errors: 0, Skipped: 0, Time elapsed: 1.804 sec - in org.apache.hadoop.security.TestLdapGroupsMapping
Running org.apache.hadoop.security.token.TestToken
Tests run: 3, Failures: 0, Errors: 0, Skipped: 0, Time elapsed: 0.672 sec - in org.apache.hadoop.security.token.TestToken
Running org.apache.hadoop.security.token.delegation.TestDelegationToken
Tests run: 15, Failures: 0, Errors: 0, Skipped: 0, Time elapsed: 32.573 sec - in org.apache.hadoop.security.token.delegation.TestDelegationToken
Running org.apache.hadoop.security.token.delegation.web.TestDelegationTokenAuthenticationHandlerWithMocks
Tests run: 2, Failures: 0, Errors: 0, Skipped: 0, Time elapsed: 1.799 sec - in org.apache.hadoop.security.token.delegation.web.TestDelegationTokenAuthenticationHandlerWithMocks
Running org.apache.hadoop.security.token.delegation.web.TestDelegationTokenManager
Tests run: 2, Failures: 0, Errors: 0, Skipped: 0, Time elapsed: 0.995 sec - in org.apache.hadoop.security.token.delegation.web.TestDelegationTokenManager
Running org.apache.hadoop.security.token.delegation.web.TestWebDelegationToken
Tests run: 12, Failures: 0, Errors: 0, Skipped: 0, Time elapsed: 11.233 sec - in org.apache.hadoop.security.token.delegation.web.TestWebDelegationToken
Running org.apache.hadoop.security.token.delegation.TestZKDelegationTokenSecretManager
Tests run: 6, Failures: 0, Errors: 0, Skipped: 0, Time elapsed: 51.189 sec - in org.apache.hadoop.security.token.delegation.TestZKDelegationTokenSecretManager
Running org.apache.hadoop.security.TestShellBasedIdMapping
Tests run: 7, Failures: 0, Errors: 0, Skipped: 0, Time elapsed: 3.206 sec - in org.apache.hadoop.security.TestShellBasedIdMapping
Running org.apache.hadoop.security.TestCompositeGroupMapping
Tests run: 3, Failures: 0, Errors: 0, Skipped: 0, Time elapsed: 1.013 sec - in org.apache.hadoop.security.TestCompositeGroupMapping
Running org.apache.hadoop.security.TestSecurityUtil
Tests run: 17, Failures: 0, Errors: 0, Skipped: 0, Time elapsed: 1.135 sec - in org.apache.hadoop.security.TestSecurityUtil
Running org.apache.hadoop.security.TestHttpCrossOriginFilterInitializer
Tests run: 1, Failures: 0, Errors: 0, Skipped: 0, Time elapsed: 0.493 sec - in org.apache.hadoop.security.TestHttpCrossOriginFilterInitializer
Running org.apache.hadoop.security.TestJNIGroupsMapping
Tests run: 1, Failures: 0, Errors: 0, Skipped: 0, Time elapsed: 0.748 sec - in org.apache.hadoop.security.TestJNIGroupsMapping
Running org.apache.hadoop.security.TestLdapGroupsMappingWithPosixGroup
Tests run: 1, Failures: 0, Errors: 0, Skipped: 0, Time elapsed: 0.854 sec - in org.apache.hadoop.security.TestLdapGroupsMappingWithPosixGroup
Running org.apache.hadoop.security.TestDoAsEffectiveUser
Tests run: 9, Failures: 0, Errors: 0, Skipped: 0, Time elapsed: 1.887 sec - in org.apache.hadoop.security.TestDoAsEffectiveUser
Running org.apache.hadoop.security.TestUGIWithSecurityOn
Tests run: 2, Failures: 0, Errors: 0, Skipped: 2, Time elapsed: 0.121 sec - in org.apache.hadoop.security.TestUGIWithSecurityOn
Running org.apache.hadoop.security.TestWhitelistBasedResolver
Tests run: 3, Failures: 0, Errors: 0, Skipped: 0, Time elapsed: 0.705 sec - in org.apache.hadoop.security.TestWhitelistBasedResolver
Running org.apache.hadoop.security.TestCredentials
Tests run: 4, Failures: 0, Errors: 0, Skipped: 0, Time elapsed: 0.747 sec - in org.apache.hadoop.security.TestCredentials
Running org.apache.hadoop.security.TestGroupFallback
Tests run: 4, Failures: 0, Errors: 0, Skipped: 0, Time elapsed: 0.911 sec - in org.apache.hadoop.security.TestGroupFallback
Running org.apache.hadoop.util.TestLightWeightCache
Tests run: 1, Failures: 0, Errors: 0, Skipped: 0, Time elapsed: 14.556 sec - in org.apache.hadoop.util.TestLightWeightCache
Running org.apache.hadoop.util.TestHostsFileReader
Tests run: 7, Failures: 0, Errors: 0, Skipped: 0, Time elapsed: 0.242 sec - in org.apache.hadoop.util.TestHostsFileReader
Running org.apache.hadoop.util.TestDiskChecker
Tests run: 15, Failures: 0, Errors: 0, Skipped: 0, Time elapsed: 1.484 sec - in org.apache.hadoop.util.TestDiskChecker
Running org.apache.hadoop.util.TestProgress
Tests run: 1, Failures: 0, Errors: 0, Skipped: 0, Time elapsed: 0.202 sec - in org.apache.hadoop.util.TestProgress
Running org.apache.hadoop.util.TestGenericsUtil
Tests run: 6, Failures: 0, Errors: 0, Skipped: 0, Time elapsed: 0.437 sec - in org.apache.hadoop.util.TestGenericsUtil
Running org.apache.hadoop.util.TestChunkedArrayList
Tests run: 5, Failures: 0, Errors: 0, Skipped: 0, Time elapsed: 0.844 sec - in org.apache.hadoop.util.TestChunkedArrayList
Running org.apache.hadoop.util.TestVersionUtil
Tests run: 1, Failures: 0, Errors: 0, Skipped: 0, Time elapsed: 0.245 sec - in org.apache.hadoop.util.TestVersionUtil
Running org.apache.hadoop.util.TestProtoUtil
Tests run: 2, Failures: 0, Errors: 0, Skipped: 0, Time elapsed: 0.343 sec - in org.apache.hadoop.util.TestProtoUtil
Running org.apache.hadoop.util.TestLightWeightGSet
Tests run: 2, Failures: 0, Errors: 0, Skipped: 0, Time elapsed: 0.219 sec - in org.apache.hadoop.util.TestLightWeightGSet
Running org.apache.hadoop.util.TestGSet
Tests run: 7, Failures: 0, Errors: 0, Skipped: 0, Time elapsed: 2.422 sec - in org.apache.hadoop.util.TestGSet
Running org.apache.hadoop.util.TestStringInterner
Tests run: 3, Failures: 0, Errors: 0, Skipped: 0, Time elapsed: 0.132 sec - in org.apache.hadoop.util.TestStringInterner
Running org.apache.hadoop.util.TestZKUtil
Tests run: 9, Failures: 0, Errors: 0, Skipped: 0, Time elapsed: 0.148 sec - in org.apache.hadoop.util.TestZKUtil
Running org.apache.hadoop.util.TestStringUtils
Tests run: 14, Failures: 0, Errors: 0, Skipped: 0, Time elapsed: 0.389 sec - in org.apache.hadoop.util.TestStringUtils
Running org.apache.hadoop.util.TestFindClass
Tests run: 16, Failures: 0, Errors: 0, Skipped: 0, Time elapsed: 1.149 sec - in org.apache.hadoop.util.TestFindClass
Running org.apache.hadoop.util.TestGenericOptionsParser
Tests run: 7, Failures: 0, Errors: 0, Skipped: 0, Time elapsed: 1.386 sec - in org.apache.hadoop.util.TestGenericOptionsParser
Running org.apache.hadoop.util.TestRunJar
Tests run: 3, Failures: 0, Errors: 0, Skipped: 0, Time elapsed: 0.562 sec - in org.apache.hadoop.util.TestRunJar
Running org.apache.hadoop.util.TestSysInfoLinux
Tests run: 5, Failures: 0, Errors: 0, Skipped: 0, Time elapsed: 0.328 sec - in org.apache.hadoop.util.TestSysInfoLinux
Running org.apache.hadoop.util.TestDirectBufferPool
Tests run: 3, Failures: 0, Errors: 0, Skipped: 0, Time elapsed: 0.217 sec - in org.apache.hadoop.util.TestDirectBufferPool
Running org.apache.hadoop.util.TestFileBasedIPList
Tests run: 8, Failures: 0, Errors: 0, Skipped: 0, Time elapsed: 0.214 sec - in org.apache.hadoop.util.TestFileBasedIPList
Running org.apache.hadoop.util.TestIndexedSort
Tests run: 2, Failures: 0, Errors: 0, Skipped: 0, Time elapsed: 1.068 sec - in org.apache.hadoop.util.TestIndexedSort
Running org.apache.hadoop.util.TestIdentityHashStore
Tests run: 3, Failures: 0, Errors: 0, Skipped: 0, Time elapsed: 0.229 sec - in org.apache.hadoop.util.TestIdentityHashStore
Running org.apache.hadoop.util.TestMachineList
Tests run: 14, Failures: 0, Errors: 0, Skipped: 0, Time elapsed: 0.67 sec - in org.apache.hadoop.util.TestMachineList
Running org.apache.hadoop.util.TestWinUtils
Tests run: 11, Failures: 0, Errors: 0, Skipped: 11, Time elapsed: 0.257 sec - in org.apache.hadoop.util.TestWinUtils
Running org.apache.hadoop.util.hash.TestHash
Tests run: 1, Failures: 0, Errors: 0, Skipped: 0, Time elapsed: 0.585 sec - in org.apache.hadoop.util.hash.TestHash
Running org.apache.hadoop.util.TestSignalLogger
Tests run: 1, Failures: 0, Errors: 0, Skipped: 0, Time elapsed: 0.233 sec - in org.apache.hadoop.util.TestSignalLogger
Running org.apache.hadoop.util.TestApplicationClassLoader
Tests run: 4, Failures: 0, Errors: 0, Skipped: 0, Time elapsed: 0.341 sec - in org.apache.hadoop.util.TestApplicationClassLoader
Running org.apache.hadoop.util.TestNodeHealthScriptRunner
Tests run: 2, Failures: 0, Errors: 0, Skipped: 0, Time elapsed: 5.014 sec - in org.apache.hadoop.util.TestNodeHealthScriptRunner
Running org.apache.hadoop.util.TestCacheableIPList
Tests run: 4, Failures: 0, Errors: 0, Skipped: 0, Time elapsed: 1.337 sec - in org.apache.hadoop.util.TestCacheableIPList
Running org.apache.hadoop.util.TestSysInfoWindows
Tests run: 3, Failures: 0, Errors: 0, Skipped: 0, Time elapsed: 0.208 sec - in org.apache.hadoop.util.TestSysInfoWindows
Running org.apache.hadoop.util.TestClassUtil
Tests run: 1, Failures: 0, Errors: 0, Skipped: 0, Time elapsed: 0.089 sec - in org.apache.hadoop.util.TestClassUtil
Running org.apache.hadoop.util.TestOptions
Tests run: 2, Failures: 0, Errors: 0, Skipped: 0, Time elapsed: 0.093 sec - in org.apache.hadoop.util.TestOptions
Running org.apache.hadoop.util.TestShell
Tests run: 20, Failures: 0, Errors: 0, Skipped: 0, Time elapsed: 5.47 sec - in org.apache.hadoop.util.TestShell
Running org.apache.hadoop.util.TestAsyncDiskService
Tests run: 1, Failures: 0, Errors: 0, Skipped: 0, Time elapsed: 0.215 sec - in org.apache.hadoop.util.TestAsyncDiskService
Running org.apache.hadoop.util.TestPureJavaCrc32
Tests run: 1, Failures: 0, Errors: 0, Skipped: 0, Time elapsed: 0.781 sec - in org.apache.hadoop.util.TestPureJavaCrc32
Running org.apache.hadoop.util.TestDataChecksum
Tests run: 4, Failures: 0, Errors: 0, Skipped: 0, Time elapsed: 5.47 sec - in org.apache.hadoop.util.TestDataChecksum
Running org.apache.hadoop.util.TestShutdownThreadsHelper
Tests run: 2, Failures: 0, Errors: 0, Skipped: 0, Time elapsed: 3.216 sec - in org.apache.hadoop.util.TestShutdownThreadsHelper
Running org.apache.hadoop.util.TestHttpExceptionUtils
Tests run: 7, Failures: 0, Errors: 0, Skipped: 0, Time elapsed: 0.855 sec - in org.apache.hadoop.util.TestHttpExceptionUtils
Running org.apache.hadoop.util.TestNativeCodeLoader
Tests run: 1, Failures: 0, Errors: 0, Skipped: 0, Time elapsed: 0.2 sec - in org.apache.hadoop.util.TestNativeCodeLoader
Running org.apache.hadoop.util.TestReflectionUtils
Tests run: 5, Failures: 0, Errors: 0, Skipped: 0, Time elapsed: 0.873 sec - in org.apache.hadoop.util.TestReflectionUtils
Running org.apache.hadoop.util.TestNativeLibraryChecker
Tests run: 2, Failures: 0, Errors: 0, Skipped: 0, Time elapsed: 0.607 sec - in org.apache.hadoop.util.TestNativeLibraryChecker
Running org.apache.hadoop.util.TestShutdownHookManager
Tests run: 1, Failures: 0, Errors: 0, Skipped: 0, Time elapsed: 0.22 sec - in org.apache.hadoop.util.TestShutdownHookManager
Running org.apache.hadoop.util.TestClasspath
Tests run: 7, Failures: 0, Errors: 0, Skipped: 0, Time elapsed: 0.479 sec - in org.apache.hadoop.util.TestClasspath
Running org.apache.hadoop.util.TestLightWeightResizableGSet
Tests run: 2, Failures: 0, Errors: 0, Skipped: 0, Time elapsed: 0.621 sec - in org.apache.hadoop.util.TestLightWeightResizableGSet
Running org.apache.hadoop.util.bloom.TestBloomFilters
Tests run: 6, Failures: 0, Errors: 0, Skipped: 0, Time elapsed: 0.565 sec - in org.apache.hadoop.util.bloom.TestBloomFilters
Running org.apache.hadoop.util.TestConfTest
Tests run: 14, Failures: 0, Errors: 0, Skipped: 0, Time elapsed: 0.293 sec - in org.apache.hadoop.util.TestConfTest
Running org.apache.hadoop.util.TestStopWatch
Tests run: 3, Failures: 0, Errors: 0, Skipped: 0, Time elapsed: 0.094 sec - in org.apache.hadoop.util.TestStopWatch
Running org.apache.hadoop.util.TestJarFinder
Tests run: 4, Failures: 0, Errors: 0, Skipped: 0, Time elapsed: 0.925 sec - in org.apache.hadoop.util.TestJarFinder
Running org.apache.hadoop.util.curator.TestChildReaper
Tests run: 4, Failures: 0, Errors: 0, Skipped: 0, Time elapsed: 54.143 sec - in org.apache.hadoop.util.curator.TestChildReaper
Running org.apache.hadoop.util.TestLineReader
Tests run: 1, Failures: 0, Errors: 0, Skipped: 0, Time elapsed: 0.255 sec - in org.apache.hadoop.util.TestLineReader
Running org.apache.hadoop.util.TestNativeCrc32
Tests run: 22, Failures: 0, Errors: 0, Skipped: 0, Time elapsed: 1.236 sec - in org.apache.hadoop.util.TestNativeCrc32
Running org.apache.hadoop.log.TestLog4Json
Tests run: 5, Failures: 0, Errors: 0, Skipped: 0, Time elapsed: 0.497 sec - in org.apache.hadoop.log.TestLog4Json
Running org.apache.hadoop.log.TestLogLevel
Tests run: 1, Failures: 0, Errors: 0, Skipped: 0, Time elapsed: 0.878 sec - in org.apache.hadoop.log.TestLogLevel
Running org.apache.hadoop.conf.TestReconfiguration
Tests run: 5, Failures: 0, Errors: 0, Skipped: 0, Time elapsed: 2.665 sec - in org.apache.hadoop.conf.TestReconfiguration
Running org.apache.hadoop.conf.TestConfServlet
Tests run: 3, Failures: 0, Errors: 0, Skipped: 0, Time elapsed: 0.834 sec - in org.apache.hadoop.conf.TestConfServlet
Running org.apache.hadoop.conf.TestConfiguration
Tests run: 62, Failures: 0, Errors: 0, Skipped: 0, Time elapsed: 5.386 sec - in org.apache.hadoop.conf.TestConfiguration
Running org.apache.hadoop.conf.TestConfigurationSubclass
Tests run: 3, Failures: 0, Errors: 0, Skipped: 0, Time elapsed: 0.627 sec - in org.apache.hadoop.conf.TestConfigurationSubclass
Running org.apache.hadoop.conf.TestGetInstances
Tests run: 1, Failures: 0, Errors: 0, Skipped: 0, Time elapsed: 0.472 sec - in org.apache.hadoop.conf.TestGetInstances
Running org.apache.hadoop.conf.TestConfigurationDeprecation
Tests run: 9, Failures: 0, Errors: 0, Skipped: 0, Time elapsed: 11.705 sec - in org.apache.hadoop.conf.TestConfigurationDeprecation
Running org.apache.hadoop.conf.TestDeprecatedKeys
Tests run: 3, Failures: 0, Errors: 0, Skipped: 0, Time elapsed: 0.759 sec - in org.apache.hadoop.conf.TestDeprecatedKeys
Running org.apache.hadoop.tracing.TestTraceUtils
Tests run: 3, Failures: 0, Errors: 0, Skipped: 0, Time elapsed: 0.724 sec - in org.apache.hadoop.tracing.TestTraceUtils
Running org.apache.hadoop.cli.TestCLI
Tests run: 1, Failures: 0, Errors: 0, Skipped: 0, Time elapsed: 0.885 sec - in org.apache.hadoop.cli.TestCLI
Running org.apache.hadoop.metrics.ganglia.TestGangliaContext
Tests run: 5, Failures: 0, Errors: 0, Skipped: 0, Time elapsed: 0.232 sec - in org.apache.hadoop.metrics.ganglia.TestGangliaContext
Running org.apache.hadoop.metrics.spi.TestOutputRecord
Tests run: 1, Failures: 0, Errors: 0, Skipped: 0, Time elapsed: 0.079 sec - in org.apache.hadoop.metrics.spi.TestOutputRecord
Running org.apache.hadoop.metrics.TestMetricsServlet
Tests run: 3, Failures: 0, Errors: 0, Skipped: 0, Time elapsed: 0.102 sec - in org.apache.hadoop.metrics.TestMetricsServlet

Results :

Failed tests: 
  TestDNS.testLookupWithoutHostsFallback:225 
Expected: is "-DUMMY_HOSTNAME"
     but: was "localhost"

Tests run: 3192, Failures: 1, Errors: 0, Skipped: 86

[INFO] ------------------------------------------------------------------------
[INFO] Reactor Summary:
[INFO] 
[INFO] Apache Hadoop Annotations ......................... SUCCESS [  9.009 s]
[INFO] Apache Hadoop MiniKDC ............................. SUCCESS [ 23.528 s]
[INFO] Apache Hadoop Auth ................................ SUCCESS [05:49 min]
[INFO] Apache Hadoop Auth Examples ....................... SUCCESS [  4.389 s]
[INFO] Apache Hadoop Common .............................. FAILURE [25:23 min]
[INFO] Apache Hadoop NFS ................................. SKIPPED
[INFO] Apache Hadoop KMS ................................. SKIPPED
[INFO] Apache Hadoop Common Project ...................... SKIPPED
[INFO] ------------------------------------------------------------------------
[INFO] BUILD FAILURE
[INFO] ------------------------------------------------------------------------
[INFO] Total time: 31:51 min
[INFO] Finished at: 2015-10-26T20:33:13+00:00
[INFO] Final Memory: 81M/976M
[INFO] ------------------------------------------------------------------------
[ERROR] Failed to execute goal org.apache.maven.plugins:maven-surefire-plugin:2.17:test (default-test) on project hadoop-common: There are test failures.
[ERROR] 
[ERROR] Please refer to <https://builds.apache.org/job/Hadoop-Common-trunk/ws/hadoop-common-project/hadoop-common/target/surefire-reports> for the individual test results.
[ERROR] -> [Help 1]
[ERROR] 
[ERROR] To see the full stack trace of the errors, re-run Maven with the -e switch.
[ERROR] Re-run Maven using the -X switch to enable full debug logging.
[ERROR] 
[ERROR] For more information about the errors and possible solutions, please read the following articles:
[ERROR] [Help 1] http://cwiki.apache.org/confluence/display/MAVEN/MojoFailureException
[ERROR] 
[ERROR] After correcting the problems, you can resume the build with the command
[ERROR]   mvn <goals> -rf :hadoop-common
result: 1

################
# mvn -eaf test -Pclover -DcloverLicenseLocation=/home/jenkins/tools/clover/latest/lib/clover.license
################
Build step 'Execute shell' marked build as failure
Archiving artifacts
Recording test results

Jenkins build is back to normal : Hadoop-Common-trunk #1911

Posted by Apache Jenkins Server <je...@builds.apache.org>.
See <https://builds.apache.org/job/Hadoop-Common-trunk/1911/changes>


Build failed in Jenkins: Hadoop-Common-trunk #1910

Posted by Apache Jenkins Server <je...@builds.apache.org>.
See <https://builds.apache.org/job/Hadoop-Common-trunk/1910/changes>

Changes:

[wangda] YARN-4285. Display resource usage as percentage of queue and cluster in

[yzhang] HDFS-7284. Add more debug info to

[cmccabe] HDFS-9268. fuse_dfs chown crashes when uid is passed as -1 (cmccabe)

[jing9] HADOOP-12472. Make GenericTestUtils.assertExceptionContains robust.

[wang] HDFS-9284. fsck command should not print exception trace when file not

[lei] HDFS-9291. Fix TestInterDatanodeProtocol to be FsDataset-agnostic. (lei)

------------------------------------------
[...truncated 5404 lines...]
Tests run: 5, Failures: 0, Errors: 0, Skipped: 5, Time elapsed: 1.095 sec - in org.apache.hadoop.fs.contract.rawlocal.TestRawlocalContractAppend
Running org.apache.hadoop.fs.contract.rawlocal.TestRawlocalContractCreate
Tests run: 6, Failures: 0, Errors: 0, Skipped: 0, Time elapsed: 1.182 sec - in org.apache.hadoop.fs.contract.rawlocal.TestRawlocalContractCreate
Running org.apache.hadoop.fs.contract.ftp.TestFTPContractMkdir
Tests run: 5, Failures: 0, Errors: 0, Skipped: 5, Time elapsed: 0.742 sec - in org.apache.hadoop.fs.contract.ftp.TestFTPContractMkdir
Running org.apache.hadoop.fs.contract.ftp.TestFTPContractCreate
Tests run: 6, Failures: 0, Errors: 0, Skipped: 6, Time elapsed: 0.733 sec - in org.apache.hadoop.fs.contract.ftp.TestFTPContractCreate
Running org.apache.hadoop.fs.contract.ftp.TestFTPContractRename
Tests run: 6, Failures: 0, Errors: 0, Skipped: 6, Time elapsed: 0.793 sec - in org.apache.hadoop.fs.contract.ftp.TestFTPContractRename
Running org.apache.hadoop.fs.contract.ftp.TestFTPContractOpen
Tests run: 6, Failures: 0, Errors: 0, Skipped: 6, Time elapsed: 0.878 sec - in org.apache.hadoop.fs.contract.ftp.TestFTPContractOpen
Running org.apache.hadoop.fs.contract.ftp.TestFTPContractDelete
Tests run: 8, Failures: 0, Errors: 0, Skipped: 8, Time elapsed: 0.843 sec - in org.apache.hadoop.fs.contract.ftp.TestFTPContractDelete
Running org.apache.hadoop.fs.TestPath
Tests run: 21, Failures: 0, Errors: 0, Skipped: 0, Time elapsed: 1.403 sec - in org.apache.hadoop.fs.TestPath
Running org.apache.hadoop.fs.TestLocalFileSystem
Tests run: 20, Failures: 0, Errors: 0, Skipped: 1, Time elapsed: 2.229 sec - in org.apache.hadoop.fs.TestLocalFileSystem
Running org.apache.hadoop.fs.permission.TestAcl
Tests run: 6, Failures: 0, Errors: 0, Skipped: 0, Time elapsed: 0.298 sec - in org.apache.hadoop.fs.permission.TestAcl
Running org.apache.hadoop.fs.permission.TestFsPermission
Tests run: 8, Failures: 0, Errors: 0, Skipped: 0, Time elapsed: 0.736 sec - in org.apache.hadoop.fs.permission.TestFsPermission
Running org.apache.hadoop.fs.TestFilterFileSystem
Tests run: 12, Failures: 0, Errors: 0, Skipped: 0, Time elapsed: 1.19 sec - in org.apache.hadoop.fs.TestFilterFileSystem
Running org.apache.hadoop.fs.TestStat
Tests run: 5, Failures: 0, Errors: 0, Skipped: 0, Time elapsed: 1.098 sec - in org.apache.hadoop.fs.TestStat
Running org.apache.hadoop.fs.TestFsOptions
Tests run: 1, Failures: 0, Errors: 0, Skipped: 0, Time elapsed: 0.112 sec - in org.apache.hadoop.fs.TestFsOptions
Running org.apache.hadoop.fs.TestGlobExpander
Tests run: 2, Failures: 0, Errors: 0, Skipped: 0, Time elapsed: 0.062 sec - in org.apache.hadoop.fs.TestGlobExpander
Running org.apache.hadoop.fs.TestHarFileSystemBasics
Tests run: 12, Failures: 0, Errors: 0, Skipped: 0, Time elapsed: 2.796 sec - in org.apache.hadoop.fs.TestHarFileSystemBasics
Running org.apache.hadoop.fs.TestFileContextResolveAfs
Tests run: 1, Failures: 0, Errors: 0, Skipped: 0, Time elapsed: 1.096 sec - in org.apache.hadoop.fs.TestFileContextResolveAfs
Running org.apache.hadoop.fs.TestFileSystemCanonicalization
Tests run: 16, Failures: 0, Errors: 0, Skipped: 0, Time elapsed: 0.569 sec - in org.apache.hadoop.fs.TestFileSystemCanonicalization
Running org.apache.hadoop.fs.TestFsShellCopy
Tests run: 16, Failures: 0, Errors: 0, Skipped: 4, Time elapsed: 1.764 sec - in org.apache.hadoop.fs.TestFsShellCopy
Running org.apache.hadoop.fs.TestSymlinkLocalFSFileContext
Tests run: 63, Failures: 0, Errors: 0, Skipped: 3, Time elapsed: 3.636 sec - in org.apache.hadoop.fs.TestSymlinkLocalFSFileContext
Running org.apache.hadoop.fs.TestFileContext
Tests run: 1, Failures: 0, Errors: 0, Skipped: 0, Time elapsed: 0.51 sec - in org.apache.hadoop.fs.TestFileContext
Running org.apache.hadoop.fs.TestDelegationTokenRenewer
Tests run: 5, Failures: 0, Errors: 0, Skipped: 0, Time elapsed: 5.921 sec - in org.apache.hadoop.fs.TestDelegationTokenRenewer
Running org.apache.hadoop.fs.TestFileSystemCaching
Tests run: 13, Failures: 0, Errors: 0, Skipped: 0, Time elapsed: 1.551 sec - in org.apache.hadoop.fs.TestFileSystemCaching
Running org.apache.hadoop.fs.TestFcLocalFsUtil
Tests run: 2, Failures: 0, Errors: 0, Skipped: 0, Time elapsed: 1.115 sec - in org.apache.hadoop.fs.TestFcLocalFsUtil
Running org.apache.hadoop.fs.TestLocalFsFCStatistics
Tests run: 3, Failures: 0, Errors: 0, Skipped: 0, Time elapsed: 1.33 sec - in org.apache.hadoop.fs.TestLocalFsFCStatistics
Running org.apache.hadoop.fs.TestTruncatedInputBug
Tests run: 1, Failures: 0, Errors: 0, Skipped: 0, Time elapsed: 0.964 sec - in org.apache.hadoop.fs.TestTruncatedInputBug
Running org.apache.hadoop.fs.TestDU
Tests run: 3, Failures: 0, Errors: 0, Skipped: 0, Time elapsed: 10.689 sec - in org.apache.hadoop.fs.TestDU
Running org.apache.hadoop.fs.TestFsShell
Tests run: 3, Failures: 0, Errors: 0, Skipped: 0, Time elapsed: 1.634 sec - in org.apache.hadoop.fs.TestFsShell
Running org.apache.hadoop.fs.TestLocalDirAllocator
Tests run: 36, Failures: 0, Errors: 0, Skipped: 0, Time elapsed: 3.137 sec - in org.apache.hadoop.fs.TestLocalDirAllocator
Running org.apache.hadoop.fs.viewfs.TestChRootedFileSystem
Tests run: 18, Failures: 0, Errors: 0, Skipped: 0, Time elapsed: 3.002 sec - in org.apache.hadoop.fs.viewfs.TestChRootedFileSystem
Running org.apache.hadoop.fs.viewfs.TestViewFileSystemDelegationTokenSupport
Tests run: 4, Failures: 0, Errors: 0, Skipped: 0, Time elapsed: 1.844 sec - in org.apache.hadoop.fs.viewfs.TestViewFileSystemDelegationTokenSupport
Running org.apache.hadoop.fs.viewfs.TestViewFsWithAuthorityLocalFs
Tests run: 58, Failures: 0, Errors: 0, Skipped: 0, Time elapsed: 6.117 sec - in org.apache.hadoop.fs.viewfs.TestViewFsWithAuthorityLocalFs
Running org.apache.hadoop.fs.viewfs.TestViewFileSystemDelegation
Tests run: 3, Failures: 0, Errors: 0, Skipped: 0, Time elapsed: 1.691 sec - in org.apache.hadoop.fs.viewfs.TestViewFileSystemDelegation
Running org.apache.hadoop.fs.viewfs.TestViewFsConfig
Tests run: 1, Failures: 0, Errors: 0, Skipped: 0, Time elapsed: 0.779 sec - in org.apache.hadoop.fs.viewfs.TestViewFsConfig
Running org.apache.hadoop.fs.viewfs.TestViewFileSystemLocalFileSystem
Tests run: 60, Failures: 0, Errors: 0, Skipped: 0, Time elapsed: 3.672 sec - in org.apache.hadoop.fs.viewfs.TestViewFileSystemLocalFileSystem
Running org.apache.hadoop.fs.viewfs.TestFcPermissionsLocalFs
Tests run: 4, Failures: 0, Errors: 0, Skipped: 0, Time elapsed: 1.537 sec - in org.apache.hadoop.fs.viewfs.TestFcPermissionsLocalFs
Running org.apache.hadoop.fs.viewfs.TestFSMainOperationsLocalFileSystem
Tests run: 49, Failures: 0, Errors: 0, Skipped: 0, Time elapsed: 3.055 sec - in org.apache.hadoop.fs.viewfs.TestFSMainOperationsLocalFileSystem
Running org.apache.hadoop.fs.viewfs.TestViewFsURIs
Tests run: 1, Failures: 0, Errors: 0, Skipped: 0, Time elapsed: 0.916 sec - in org.apache.hadoop.fs.viewfs.TestViewFsURIs
Running org.apache.hadoop.fs.viewfs.TestViewFsTrash
Tests run: 1, Failures: 0, Errors: 0, Skipped: 0, Time elapsed: 1.878 sec - in org.apache.hadoop.fs.viewfs.TestViewFsTrash
Running org.apache.hadoop.fs.viewfs.TestViewFsLocalFs
Tests run: 58, Failures: 0, Errors: 0, Skipped: 0, Time elapsed: 3.862 sec - in org.apache.hadoop.fs.viewfs.TestViewFsLocalFs
Running org.apache.hadoop.fs.viewfs.TestViewFileSystemWithAuthorityLocalFileSystem
Tests run: 60, Failures: 0, Errors: 0, Skipped: 0, Time elapsed: 5.099 sec - in org.apache.hadoop.fs.viewfs.TestViewFileSystemWithAuthorityLocalFileSystem
Running org.apache.hadoop.fs.viewfs.TestViewfsFileStatus
Tests run: 2, Failures: 0, Errors: 0, Skipped: 0, Time elapsed: 1.38 sec - in org.apache.hadoop.fs.viewfs.TestViewfsFileStatus
Running org.apache.hadoop.fs.viewfs.TestFcCreateMkdirLocalFs
Tests run: 8, Failures: 0, Errors: 0, Skipped: 0, Time elapsed: 1.757 sec - in org.apache.hadoop.fs.viewfs.TestFcCreateMkdirLocalFs
Running org.apache.hadoop.fs.viewfs.TestChRootedFs
Tests run: 14, Failures: 0, Errors: 0, Skipped: 0, Time elapsed: 1.895 sec - in org.apache.hadoop.fs.viewfs.TestChRootedFs
Running org.apache.hadoop.fs.viewfs.TestFcMainOperationsLocalFs
Tests run: 60, Failures: 0, Errors: 0, Skipped: 0, Time elapsed: 3.852 sec - in org.apache.hadoop.fs.viewfs.TestFcMainOperationsLocalFs
Running org.apache.hadoop.fs.TestFSMainOperationsLocalFileSystem
Tests run: 49, Failures: 0, Errors: 0, Skipped: 0, Time elapsed: 2.309 sec - in org.apache.hadoop.fs.TestFSMainOperationsLocalFileSystem
Running org.apache.hadoop.fs.TestFcLocalFsPermission
Tests run: 4, Failures: 0, Errors: 0, Skipped: 0, Time elapsed: 1.238 sec - in org.apache.hadoop.fs.TestFcLocalFsPermission
Running org.apache.hadoop.fs.TestAfsCheckPath
Tests run: 4, Failures: 0, Errors: 0, Skipped: 0, Time elapsed: 0.219 sec - in org.apache.hadoop.fs.TestAfsCheckPath
Running org.apache.hadoop.fs.TestFileUtil
Tests run: 27, Failures: 0, Errors: 0, Skipped: 0, Time elapsed: 8.619 sec - in org.apache.hadoop.fs.TestFileUtil
Running org.apache.hadoop.fs.TestGlobPattern
Tests run: 3, Failures: 0, Errors: 0, Skipped: 0, Time elapsed: 0.262 sec - in org.apache.hadoop.fs.TestGlobPattern
Running org.apache.hadoop.fs.TestDFVariations
Tests run: 5, Failures: 0, Errors: 0, Skipped: 0, Time elapsed: 0.476 sec - in org.apache.hadoop.fs.TestDFVariations
Running org.apache.hadoop.fs.TestBlockLocation
Tests run: 2, Failures: 0, Errors: 0, Skipped: 0, Time elapsed: 0.159 sec - in org.apache.hadoop.fs.TestBlockLocation
Running org.apache.hadoop.fs.shell.TestCopy
Tests run: 5, Failures: 0, Errors: 0, Skipped: 0, Time elapsed: 1.543 sec - in org.apache.hadoop.fs.shell.TestCopy
Running org.apache.hadoop.fs.shell.TestCopyPreserveFlag
Tests run: 8, Failures: 0, Errors: 0, Skipped: 0, Time elapsed: 1.237 sec - in org.apache.hadoop.fs.shell.TestCopyPreserveFlag
Running org.apache.hadoop.fs.shell.TestPathExceptions
Tests run: 4, Failures: 0, Errors: 0, Skipped: 0, Time elapsed: 0.107 sec - in org.apache.hadoop.fs.shell.TestPathExceptions
Running org.apache.hadoop.fs.shell.TestAclCommands
Tests run: 7, Failures: 0, Errors: 0, Skipped: 0, Time elapsed: 1.376 sec - in org.apache.hadoop.fs.shell.TestAclCommands
Running org.apache.hadoop.fs.shell.TestLs
Tests run: 33, Failures: 0, Errors: 0, Skipped: 0, Time elapsed: 1.8 sec - in org.apache.hadoop.fs.shell.TestLs
Running org.apache.hadoop.fs.shell.TestTextCommand
Tests run: 4, Failures: 0, Errors: 0, Skipped: 0, Time elapsed: 1.739 sec - in org.apache.hadoop.fs.shell.TestTextCommand
Running org.apache.hadoop.fs.shell.TestMove
Tests run: 1, Failures: 0, Errors: 0, Skipped: 0, Time elapsed: 1.386 sec - in org.apache.hadoop.fs.shell.TestMove
Running org.apache.hadoop.fs.shell.TestPathData
Tests run: 11, Failures: 0, Errors: 0, Skipped: 0, Time elapsed: 1.586 sec - in org.apache.hadoop.fs.shell.TestPathData
Running org.apache.hadoop.fs.shell.TestCommandFactory
Tests run: 2, Failures: 0, Errors: 0, Skipped: 0, Time elapsed: 0.245 sec - in org.apache.hadoop.fs.shell.TestCommandFactory
Running org.apache.hadoop.fs.shell.TestCount
Tests run: 22, Failures: 0, Errors: 0, Skipped: 0, Time elapsed: 1.427 sec - in org.apache.hadoop.fs.shell.TestCount
Running org.apache.hadoop.fs.shell.TestXAttrCommands
Tests run: 2, Failures: 0, Errors: 0, Skipped: 0, Time elapsed: 0.8 sec - in org.apache.hadoop.fs.shell.TestXAttrCommands
Running org.apache.hadoop.fs.shell.find.TestPrint0
Tests run: 1, Failures: 0, Errors: 0, Skipped: 0, Time elapsed: 1.233 sec - in org.apache.hadoop.fs.shell.find.TestPrint0
Running org.apache.hadoop.fs.shell.find.TestResult
Tests run: 18, Failures: 0, Errors: 0, Skipped: 0, Time elapsed: 0.171 sec - in org.apache.hadoop.fs.shell.find.TestResult
Running org.apache.hadoop.fs.shell.find.TestAnd
Tests run: 10, Failures: 0, Errors: 0, Skipped: 0, Time elapsed: 0.531 sec - in org.apache.hadoop.fs.shell.find.TestAnd
Running org.apache.hadoop.fs.shell.find.TestName
Tests run: 6, Failures: 0, Errors: 0, Skipped: 0, Time elapsed: 1.558 sec - in org.apache.hadoop.fs.shell.find.TestName
Running org.apache.hadoop.fs.shell.find.TestFilterExpression
Tests run: 11, Failures: 0, Errors: 0, Skipped: 0, Time elapsed: 0.467 sec - in org.apache.hadoop.fs.shell.find.TestFilterExpression
Running org.apache.hadoop.fs.shell.find.TestFind
Tests run: 24, Failures: 0, Errors: 0, Skipped: 0, Time elapsed: 2.585 sec - in org.apache.hadoop.fs.shell.find.TestFind
Running org.apache.hadoop.fs.shell.find.TestIname
Tests run: 6, Failures: 0, Errors: 0, Skipped: 0, Time elapsed: 1.702 sec - in org.apache.hadoop.fs.shell.find.TestIname
Running org.apache.hadoop.fs.shell.find.TestPrint
Tests run: 1, Failures: 0, Errors: 0, Skipped: 0, Time elapsed: 1.741 sec - in org.apache.hadoop.fs.shell.find.TestPrint
Running org.apache.hadoop.fs.TestFileSystemInitialization
Tests run: 1, Failures: 0, Errors: 0, Skipped: 0, Time elapsed: 1.463 sec - in org.apache.hadoop.fs.TestFileSystemInitialization
Running org.apache.hadoop.fs.TestHarFileSystem
Tests run: 4, Failures: 0, Errors: 0, Skipped: 0, Time elapsed: 1.562 sec - in org.apache.hadoop.fs.TestHarFileSystem
Running org.apache.hadoop.fs.TestFileSystemTokens
Tests run: 10, Failures: 0, Errors: 0, Skipped: 0, Time elapsed: 0.985 sec - in org.apache.hadoop.fs.TestFileSystemTokens
Running org.apache.hadoop.fs.TestGetFileBlockLocations
Tests run: 3, Failures: 0, Errors: 0, Skipped: 0, Time elapsed: 1.51 sec - in org.apache.hadoop.fs.TestGetFileBlockLocations
Running org.apache.hadoop.fs.TestLocalFSFileContextCreateMkdir
Tests run: 8, Failures: 0, Errors: 0, Skipped: 0, Time elapsed: 1.604 sec - in org.apache.hadoop.fs.TestLocalFSFileContextCreateMkdir
Running org.apache.hadoop.fs.sftp.TestSFTPFileSystem
Tests run: 9, Failures: 0, Errors: 0, Skipped: 0, Time elapsed: 7.357 sec - in org.apache.hadoop.fs.sftp.TestSFTPFileSystem
Running org.apache.hadoop.fs.TestAvroFSInput
Tests run: 1, Failures: 0, Errors: 0, Skipped: 0, Time elapsed: 1.405 sec - in org.apache.hadoop.fs.TestAvroFSInput
Running org.apache.hadoop.fs.TestFilterFs
Tests run: 1, Failures: 0, Errors: 0, Skipped: 0, Time elapsed: 0.31 sec - in org.apache.hadoop.fs.TestFilterFs
Running org.apache.hadoop.fs.TestLocalFSFileContextMainOperations
Tests run: 62, Failures: 0, Errors: 0, Skipped: 0, Time elapsed: 3.521 sec - in org.apache.hadoop.fs.TestLocalFSFileContextMainOperations
Running org.apache.hadoop.fs.TestSymlinkLocalFSFileSystem
Tests run: 63, Failures: 0, Errors: 0, Skipped: 7, Time elapsed: 7.666 sec - in org.apache.hadoop.fs.TestSymlinkLocalFSFileSystem
Running org.apache.hadoop.fs.TestS3_LocalFileContextURI
Tests run: 17, Failures: 0, Errors: 0, Skipped: 0, Time elapsed: 2.203 sec - in org.apache.hadoop.fs.TestS3_LocalFileContextURI
Running org.apache.hadoop.fs.TestFsShellReturnCode
Tests run: 10, Failures: 0, Errors: 0, Skipped: 0, Time elapsed: 2.741 sec - in org.apache.hadoop.fs.TestFsShellReturnCode
Running org.apache.hadoop.fs.ftp.TestFTPFileSystem
Tests run: 1, Failures: 0, Errors: 0, Skipped: 0, Time elapsed: 0.283 sec - in org.apache.hadoop.fs.ftp.TestFTPFileSystem
Running org.apache.hadoop.fs.TestHardLink
Tests run: 5, Failures: 0, Errors: 0, Skipped: 0, Time elapsed: 0.445 sec - in org.apache.hadoop.fs.TestHardLink
Running org.apache.hadoop.fs.TestListFiles
Tests run: 2, Failures: 0, Errors: 0, Skipped: 0, Time elapsed: 1.513 sec - in org.apache.hadoop.fs.TestListFiles
Running org.apache.hadoop.fs.TestLocal_S3FileContextURI
Tests run: 17, Failures: 0, Errors: 0, Skipped: 0, Time elapsed: 3.361 sec - in org.apache.hadoop.fs.TestLocal_S3FileContextURI
Running org.apache.hadoop.fs.TestDelegateToFileSystem
Tests run: 2, Failures: 0, Errors: 0, Skipped: 0, Time elapsed: 0.978 sec - in org.apache.hadoop.fs.TestDelegateToFileSystem
Running org.apache.hadoop.ha.TestZKFailoverControllerStress
Tests run: 3, Failures: 0, Errors: 0, Skipped: 0, Time elapsed: 96.633 sec - in org.apache.hadoop.ha.TestZKFailoverControllerStress
Running org.apache.hadoop.ha.TestShellCommandFencer
Tests run: 9, Failures: 0, Errors: 0, Skipped: 0, Time elapsed: 1.468 sec - in org.apache.hadoop.ha.TestShellCommandFencer
Running org.apache.hadoop.ha.TestFailoverController
Tests run: 17, Failures: 0, Errors: 0, Skipped: 0, Time elapsed: 2.384 sec - in org.apache.hadoop.ha.TestFailoverController
Running org.apache.hadoop.ha.TestNodeFencer
Tests run: 9, Failures: 0, Errors: 0, Skipped: 0, Time elapsed: 1.024 sec - in org.apache.hadoop.ha.TestNodeFencer
Running org.apache.hadoop.ha.TestActiveStandbyElectorRealZK
Tests run: 4, Failures: 0, Errors: 0, Skipped: 0, Time elapsed: 11.799 sec - in org.apache.hadoop.ha.TestActiveStandbyElectorRealZK
Running org.apache.hadoop.ha.TestSshFenceByTcpPort
Tests run: 4, Failures: 0, Errors: 0, Skipped: 1, Time elapsed: 3.855 sec - in org.apache.hadoop.ha.TestSshFenceByTcpPort
Running org.apache.hadoop.ha.TestZKFailoverController
Tests run: 20, Failures: 0, Errors: 0, Skipped: 0, Time elapsed: 59.111 sec - in org.apache.hadoop.ha.TestZKFailoverController
Running org.apache.hadoop.ha.TestActiveStandbyElector
Tests run: 23, Failures: 0, Errors: 0, Skipped: 0, Time elapsed: 2.996 sec - in org.apache.hadoop.ha.TestActiveStandbyElector
Running org.apache.hadoop.ha.TestHAAdmin
Tests run: 2, Failures: 0, Errors: 0, Skipped: 0, Time elapsed: 0.504 sec - in org.apache.hadoop.ha.TestHAAdmin
Running org.apache.hadoop.ha.TestHealthMonitor
Exception: java.lang.RuntimeException thrown from the UncaughtExceptionHandler in thread "Health Monitor for DummyHAService #3"
Tests run: 3, Failures: 0, Errors: 0, Skipped: 0, Time elapsed: 2.233 sec - in org.apache.hadoop.ha.TestHealthMonitor
Running org.apache.hadoop.service.TestGlobalStateChangeListener
Tests run: 5, Failures: 0, Errors: 0, Skipped: 0, Time elapsed: 0.259 sec - in org.apache.hadoop.service.TestGlobalStateChangeListener
Running org.apache.hadoop.service.TestServiceLifecycle
Tests run: 18, Failures: 0, Errors: 0, Skipped: 0, Time elapsed: 2.47 sec - in org.apache.hadoop.service.TestServiceLifecycle
Running org.apache.hadoop.service.TestCompositeService
Tests run: 18, Failures: 0, Errors: 0, Skipped: 0, Time elapsed: 0.276 sec - in org.apache.hadoop.service.TestCompositeService

Results :

Failed tests: 
  TestReloadingX509TrustManager.testReload:112 expected:<2> but was:<1>

Tests run: 3196, Failures: 1, Errors: 0, Skipped: 86

[INFO] ------------------------------------------------------------------------
[INFO] Reactor Summary:
[INFO] 
[INFO] Apache Hadoop Annotations ......................... SUCCESS [  9.743 s]
[INFO] Apache Hadoop MiniKDC ............................. SUCCESS [01:42 min]
[INFO] Apache Hadoop Auth ................................ SUCCESS [15:13 min]
[INFO] Apache Hadoop Auth Examples ....................... SUCCESS [  4.280 s]
[INFO] Apache Hadoop Common .............................. FAILURE [35:10 min]
[INFO] Apache Hadoop NFS ................................. SKIPPED
[INFO] Apache Hadoop KMS ................................. SKIPPED
[INFO] Apache Hadoop Common Project ...................... SKIPPED
[INFO] ------------------------------------------------------------------------
[INFO] BUILD FAILURE
[INFO] ------------------------------------------------------------------------
[INFO] Total time: 52:20 min
[INFO] Finished at: 2015-10-26T23:38:09+00:00
[INFO] Final Memory: 78M/905M
[INFO] ------------------------------------------------------------------------
[ERROR] Failed to execute goal org.apache.maven.plugins:maven-surefire-plugin:2.17:test (default-test) on project hadoop-common: There are test failures.
[ERROR] 
[ERROR] Please refer to <https://builds.apache.org/job/Hadoop-Common-trunk/ws/hadoop-common-project/hadoop-common/target/surefire-reports> for the individual test results.
[ERROR] -> [Help 1]
[ERROR] 
[ERROR] To see the full stack trace of the errors, re-run Maven with the -e switch.
[ERROR] Re-run Maven using the -X switch to enable full debug logging.
[ERROR] 
[ERROR] For more information about the errors and possible solutions, please read the following articles:
[ERROR] [Help 1] http://cwiki.apache.org/confluence/display/MAVEN/MojoFailureException
[ERROR] 
[ERROR] After correcting the problems, you can resume the build with the command
[ERROR]   mvn <goals> -rf :hadoop-common
result: 1

################
# mvn -eaf test -Pclover -DcloverLicenseLocation=/home/jenkins/tools/clover/latest/lib/clover.license
################
Build step 'Execute shell' marked build as failure
Archiving artifacts
Recording test results