You are viewing a plain text version of this content. The canonical link for it is here.
Posted to dev@lucene.apache.org by Policeman Jenkins Server <je...@thetaphi.de> on 2016/06/19 11:12:44 UTC
[JENKINS] Lucene-Solr-6.x-Windows (32bit/jdk1.8.0_92) - Build # 258
- Failure!
Build: http://jenkins.thetaphi.de/job/Lucene-Solr-6.x-Windows/258/
Java: 32bit/jdk1.8.0_92 -server -XX:+UseConcMarkSweepGC
1 tests failed.
FAILED: junit.framework.TestSuite.org.apache.solr.rest.schema.TestBulkSchemaAPI
Error Message:
Could not remove the following files (in the order of attempts): C:\Users\jenkins\workspace\Lucene-Solr-6.x-Windows\solr\build\solr-core\test\J0\temp\solr.rest.schema.TestBulkSchemaAPI_437FE9807A472571-001\tempDir-016\collection1: java.nio.file.DirectoryNotEmptyException: C:\Users\jenkins\workspace\Lucene-Solr-6.x-Windows\solr\build\solr-core\test\J0\temp\solr.rest.schema.TestBulkSchemaAPI_437FE9807A472571-001\tempDir-016\collection1 C:\Users\jenkins\workspace\Lucene-Solr-6.x-Windows\solr\build\solr-core\test\J0\temp\solr.rest.schema.TestBulkSchemaAPI_437FE9807A472571-001\tempDir-016: java.nio.file.DirectoryNotEmptyException: C:\Users\jenkins\workspace\Lucene-Solr-6.x-Windows\solr\build\solr-core\test\J0\temp\solr.rest.schema.TestBulkSchemaAPI_437FE9807A472571-001\tempDir-016
Stack Trace:
java.io.IOException: Could not remove the following files (in the order of attempts):
C:\Users\jenkins\workspace\Lucene-Solr-6.x-Windows\solr\build\solr-core\test\J0\temp\solr.rest.schema.TestBulkSchemaAPI_437FE9807A472571-001\tempDir-016\collection1: java.nio.file.DirectoryNotEmptyException: C:\Users\jenkins\workspace\Lucene-Solr-6.x-Windows\solr\build\solr-core\test\J0\temp\solr.rest.schema.TestBulkSchemaAPI_437FE9807A472571-001\tempDir-016\collection1
C:\Users\jenkins\workspace\Lucene-Solr-6.x-Windows\solr\build\solr-core\test\J0\temp\solr.rest.schema.TestBulkSchemaAPI_437FE9807A472571-001\tempDir-016: java.nio.file.DirectoryNotEmptyException: C:\Users\jenkins\workspace\Lucene-Solr-6.x-Windows\solr\build\solr-core\test\J0\temp\solr.rest.schema.TestBulkSchemaAPI_437FE9807A472571-001\tempDir-016
at __randomizedtesting.SeedInfo.seed([437FE9807A472571]:0)
at org.apache.lucene.util.IOUtils.rm(IOUtils.java:323)
at org.apache.lucene.util.TestRuleTemporaryFilesCleanup.afterAlways(TestRuleTemporaryFilesCleanup.java:216)
at com.carrotsearch.randomizedtesting.rules.TestRuleAdapter$1.afterAlways(TestRuleAdapter.java:31)
at com.carrotsearch.randomizedtesting.rules.StatementAdapter.evaluate(StatementAdapter.java:43)
at com.carrotsearch.randomizedtesting.rules.StatementAdapter.evaluate(StatementAdapter.java:36)
at org.apache.lucene.util.TestRuleAssertionsRequired$1.evaluate(TestRuleAssertionsRequired.java:53)
at org.apache.lucene.util.TestRuleMarkFailure$1.evaluate(TestRuleMarkFailure.java:47)
at org.apache.lucene.util.TestRuleIgnoreAfterMaxFailures$1.evaluate(TestRuleIgnoreAfterMaxFailures.java:64)
at org.apache.lucene.util.TestRuleIgnoreTestSuites$1.evaluate(TestRuleIgnoreTestSuites.java:54)
at com.carrotsearch.randomizedtesting.rules.StatementAdapter.evaluate(StatementAdapter.java:36)
at com.carrotsearch.randomizedtesting.ThreadLeakControl$StatementRunner.run(ThreadLeakControl.java:367)
at java.lang.Thread.run(Thread.java:745)
Build Log:
[...truncated 12290 lines...]
[junit4] Suite: org.apache.solr.rest.schema.TestBulkSchemaAPI
[junit4] 2> Creating dataDir: C:\Users\jenkins\workspace\Lucene-Solr-6.x-Windows\solr\build\solr-core\test\J0\temp\solr.rest.schema.TestBulkSchemaAPI_437FE9807A472571-001\init-core-data-001
[junit4] 2> 3131555 INFO (SUITE-TestBulkSchemaAPI-seed#[437FE9807A472571]-worker) [ ] o.a.s.SolrTestCaseJ4 Randomized ssl (false) and clientAuth (false) via: @org.apache.solr.util.RandomizeSSL(reason=, value=NaN, ssl=NaN, clientAuth=NaN)
[junit4] 2> 3131558 INFO (TEST-TestBulkSchemaAPI.testAddFieldMatchingExistingDynamicField-seed#[437FE9807A472571]) [ ] o.a.s.SolrTestCaseJ4 ###Starting testAddFieldMatchingExistingDynamicField
[junit4] 2> 3132373 INFO (TEST-TestBulkSchemaAPI.testAddFieldMatchingExistingDynamicField-seed#[437FE9807A472571]) [ ] o.a.s.SolrTestCaseJ4 ####initCore
[junit4] 2> 3132374 INFO (TEST-TestBulkSchemaAPI.testAddFieldMatchingExistingDynamicField-seed#[437FE9807A472571]) [ ] o.a.s.SolrTestCaseJ4 ####initCore end
[junit4] 2> 3132376 INFO (TEST-TestBulkSchemaAPI.testAddFieldMatchingExistingDynamicField-seed#[437FE9807A472571]) [ ] o.a.s.SolrTestCaseJ4 Writing core.properties file to C:\Users\jenkins\workspace\Lucene-Solr-6.x-Windows\solr\build\solr-core\test\J0\temp\solr.rest.schema.TestBulkSchemaAPI_437FE9807A472571-001\tempDir-003\cores\core
[junit4] 2> 3132381 INFO (TEST-TestBulkSchemaAPI.testAddFieldMatchingExistingDynamicField-seed#[437FE9807A472571]) [ ] o.e.j.s.Server jetty-9.3.8.v20160314
[junit4] 2> 3132383 INFO (TEST-TestBulkSchemaAPI.testAddFieldMatchingExistingDynamicField-seed#[437FE9807A472571]) [ ] o.e.j.s.h.ContextHandler Started o.e.j.s.ServletContextHandler@b7dab6{/solr,null,AVAILABLE}
[junit4] 2> 3132385 INFO (TEST-TestBulkSchemaAPI.testAddFieldMatchingExistingDynamicField-seed#[437FE9807A472571]) [ ] o.e.j.s.ServerConnector Started ServerConnector@13d4335{HTTP/1.1,[http/1.1]}{127.0.0.1:61021}
[junit4] 2> 3132385 INFO (TEST-TestBulkSchemaAPI.testAddFieldMatchingExistingDynamicField-seed#[437FE9807A472571]) [ ] o.e.j.s.Server Started @3138770ms
[junit4] 2> 3132386 INFO (TEST-TestBulkSchemaAPI.testAddFieldMatchingExistingDynamicField-seed#[437FE9807A472571]) [ ] o.a.s.c.s.e.JettySolrRunner Jetty properties: {hostContext=/solr, hostPort=61021, configSetBaseDir=C:\Users\jenkins\workspace\Lucene-Solr-6.x-Windows\solr\build\solr-core\test\J0\temp\solr.rest.schema.TestBulkSchemaAPI_437FE9807A472571-001\tempDir-001, coreRootDirectory=C:\Users\jenkins\workspace\Lucene-Solr-6.x-Windows\solr\build\solr-core\test\J0\temp\solr.rest.schema.TestBulkSchemaAPI_437FE9807A472571-001\tempDir-003\cores}
[junit4] 2> 3132386 INFO (TEST-TestBulkSchemaAPI.testAddFieldMatchingExistingDynamicField-seed#[437FE9807A472571]) [ ] o.a.s.s.SolrDispatchFilter SolrDispatchFilter.init(): sun.misc.Launcher$AppClassLoader@1d16e93
[junit4] 2> 3132386 INFO (TEST-TestBulkSchemaAPI.testAddFieldMatchingExistingDynamicField-seed#[437FE9807A472571]) [ ] o.a.s.c.SolrResourceLoader new SolrResourceLoader for directory: 'C:\Users\jenkins\workspace\Lucene-Solr-6.x-Windows\solr\build\solr-core\test\J0\temp\solr.rest.schema.TestBulkSchemaAPI_437FE9807A472571-001\tempDir-001'
[junit4] 2> 3132386 INFO (TEST-TestBulkSchemaAPI.testAddFieldMatchingExistingDynamicField-seed#[437FE9807A472571]) [ ] o.a.s.c.SolrResourceLoader JNDI not configured for solr (NoInitialContextEx)
[junit4] 2> 3132386 INFO (TEST-TestBulkSchemaAPI.testAddFieldMatchingExistingDynamicField-seed#[437FE9807A472571]) [ ] o.a.s.c.SolrResourceLoader using system property solr.solr.home: C:\Users\jenkins\workspace\Lucene-Solr-6.x-Windows\solr\build\solr-core\test\J0\temp\solr.rest.schema.TestBulkSchemaAPI_437FE9807A472571-001\tempDir-001
[junit4] 2> 3132386 INFO (TEST-TestBulkSchemaAPI.testAddFieldMatchingExistingDynamicField-seed#[437FE9807A472571]) [ ] o.a.s.c.SolrXmlConfig Loading container configuration from C:\Users\jenkins\workspace\Lucene-Solr-6.x-Windows\solr\build\solr-core\test\J0\temp\solr.rest.schema.TestBulkSchemaAPI_437FE9807A472571-001\tempDir-001\solr.xml
[junit4] 2> 3132403 INFO (TEST-TestBulkSchemaAPI.testAddFieldMatchingExistingDynamicField-seed#[437FE9807A472571]) [ ] o.a.s.c.CorePropertiesLocator Config-defined core root directory: C:\Users\jenkins\workspace\Lucene-Solr-6.x-Windows\solr\build\solr-core\test\J0\temp\solr.rest.schema.TestBulkSchemaAPI_437FE9807A472571-001\tempDir-003\cores
[junit4] 2> 3132403 INFO (TEST-TestBulkSchemaAPI.testAddFieldMatchingExistingDynamicField-seed#[437FE9807A472571]) [ ] o.a.s.c.CoreContainer New CoreContainer 9602019
[junit4] 2> 3132403 INFO (TEST-TestBulkSchemaAPI.testAddFieldMatchingExistingDynamicField-seed#[437FE9807A472571]) [ ] o.a.s.c.CoreContainer Loading cores into CoreContainer [instanceDir=C:\Users\jenkins\workspace\Lucene-Solr-6.x-Windows\solr\build\solr-core\test\J0\temp\solr.rest.schema.TestBulkSchemaAPI_437FE9807A472571-001\tempDir-001]
[junit4] 2> 3132404 WARN (TEST-TestBulkSchemaAPI.testAddFieldMatchingExistingDynamicField-seed#[437FE9807A472571]) [ ] o.a.s.c.CoreContainer Couldn't add files from C:\Users\jenkins\workspace\Lucene-Solr-6.x-Windows\solr\build\solr-core\test\J0\temp\solr.rest.schema.TestBulkSchemaAPI_437FE9807A472571-001\tempDir-001\lib to classpath: C:\Users\jenkins\workspace\Lucene-Solr-6.x-Windows\solr\build\solr-core\test\J0\temp\solr.rest.schema.TestBulkSchemaAPI_437FE9807A472571-001\tempDir-001\lib
[junit4] 2> 3132405 INFO (TEST-TestBulkSchemaAPI.testAddFieldMatchingExistingDynamicField-seed#[437FE9807A472571]) [ ] o.a.s.h.c.HttpShardHandlerFactory created with socketTimeout : 90000,urlScheme : ,connTimeout : 15000,maxConnectionsPerHost : 20,maxConnections : 10000,corePoolSize : 0,maximumPoolSize : 2147483647,maxThreadIdleTime : 5,sizeOfQueue : -1,fairnessPolicy : false,useRetries : false,
[junit4] 2> 3132411 INFO (TEST-TestBulkSchemaAPI.testAddFieldMatchingExistingDynamicField-seed#[437FE9807A472571]) [ ] o.a.s.u.UpdateShardHandler Creating UpdateShardHandler HTTP client with params: socketTimeout=340000&connTimeout=45000&retry=true
[junit4] 2> 3132412 INFO (TEST-TestBulkSchemaAPI.testAddFieldMatchingExistingDynamicField-seed#[437FE9807A472571]) [ ] o.a.s.l.LogWatcher SLF4J impl is org.slf4j.impl.Log4jLoggerFactory
[junit4] 2> 3132413 INFO (TEST-TestBulkSchemaAPI.testAddFieldMatchingExistingDynamicField-seed#[437FE9807A472571]) [ ] o.a.s.l.LogWatcher Registering Log Listener [Log4j (org.slf4j.impl.Log4jLoggerFactory)]
[junit4] 2> 3132413 INFO (TEST-TestBulkSchemaAPI.testAddFieldMatchingExistingDynamicField-seed#[437FE9807A472571]) [ ] o.a.s.c.CoreContainer Security conf doesn't exist. Skipping setup for authorization module.
[junit4] 2> 3132413 INFO (TEST-TestBulkSchemaAPI.testAddFieldMatchingExistingDynamicField-seed#[437FE9807A472571]) [ ] o.a.s.c.CoreContainer No authentication plugin used.
[junit4] 2> 3132414 INFO (TEST-TestBulkSchemaAPI.testAddFieldMatchingExistingDynamicField-seed#[437FE9807A472571]) [ ] o.a.s.c.CorePropertiesLocator Looking for core definitions underneath C:\Users\jenkins\workspace\Lucene-Solr-6.x-Windows\solr\build\solr-core\test\J0\temp\solr.rest.schema.TestBulkSchemaAPI_437FE9807A472571-001\tempDir-003\cores
[junit4] 2> 3132417 INFO (TEST-TestBulkSchemaAPI.testAddFieldMatchingExistingDynamicField-seed#[437FE9807A472571]) [ ] o.a.s.c.CoreDescriptor Created CoreDescriptor: {name=collection1, config=solrconfig-managed-schema.xml, loadOnStartup=true, schema=schema-rest.xml, configSetProperties=configsetprops.json, transient=false, dataDir=data\, configSet=collection1}
[junit4] 2> 3132417 INFO (TEST-TestBulkSchemaAPI.testAddFieldMatchingExistingDynamicField-seed#[437FE9807A472571]) [ ] o.a.s.c.CorePropertiesLocator Found core collection1 in C:\Users\jenkins\workspace\Lucene-Solr-6.x-Windows\solr\build\solr-core\test\J0\temp\solr.rest.schema.TestBulkSchemaAPI_437FE9807A472571-001\tempDir-003\cores\core
[junit4] 2> 3132417 INFO (TEST-TestBulkSchemaAPI.testAddFieldMatchingExistingDynamicField-seed#[437FE9807A472571]) [ ] o.a.s.c.CorePropertiesLocator Found 1 core definitions
[junit4] 2> 3132418 INFO (TEST-TestBulkSchemaAPI.testAddFieldMatchingExistingDynamicField-seed#[437FE9807A472571]) [ ] o.a.s.s.SolrDispatchFilter user.dir=C:\Users\jenkins\workspace\Lucene-Solr-6.x-Windows\solr\build\solr-core\test\J0
[junit4] 2> 3132418 INFO (TEST-TestBulkSchemaAPI.testAddFieldMatchingExistingDynamicField-seed#[437FE9807A472571]) [ ] o.a.s.s.SolrDispatchFilter SolrDispatchFilter.init() done
[junit4] 2> 3132419 INFO (coreLoadExecutor-10151-thread-1) [ ] o.a.s.c.SolrResourceLoader new SolrResourceLoader for directory: 'C:\Users\jenkins\workspace\Lucene-Solr-6.x-Windows\solr\build\solr-core\test\J0\temp\solr.rest.schema.TestBulkSchemaAPI_437FE9807A472571-001\tempDir-001\collection1'
[junit4] 2> 3132419 INFO (coreLoadExecutor-10151-thread-1) [ ] o.a.s.c.SolrResourceLoader JNDI not configured for solr (NoInitialContextEx)
[junit4] 2> 3132419 INFO (coreLoadExecutor-10151-thread-1) [ ] o.a.s.c.SolrResourceLoader using system property solr.solr.home: C:\Users\jenkins\workspace\Lucene-Solr-6.x-Windows\solr\build\solr-core\test\J0\temp\solr.rest.schema.TestBulkSchemaAPI_437FE9807A472571-001\tempDir-001
[junit4] 2> 3132420 INFO (coreLoadExecutor-10151-thread-1) [ ] o.a.s.c.SolrResourceLoader Adding 'file:/C:/Users/jenkins/workspace/Lucene-Solr-6.x-Windows/solr/build/solr-core/test/J0/temp/solr.rest.schema.TestBulkSchemaAPI_437FE9807A472571-001/tempDir-001/collection1/lib/classes/' to classloader
[junit4] 2> 3132420 INFO (coreLoadExecutor-10151-thread-1) [ ] o.a.s.c.SolrResourceLoader Adding 'file:/C:/Users/jenkins/workspace/Lucene-Solr-6.x-Windows/solr/build/solr-core/test/J0/temp/solr.rest.schema.TestBulkSchemaAPI_437FE9807A472571-001/tempDir-001/collection1/lib/README' to classloader
[junit4] 2> 3132515 INFO (coreLoadExecutor-10151-thread-1) [ ] o.a.s.c.SolrConfig current version of requestparams : -1
[junit4] 2> 3132533 INFO (coreLoadExecutor-10151-thread-1) [ ] o.a.s.c.SolrConfig Using Lucene MatchVersion: 6.2.0
[junit4] 2> 3132540 INFO (coreLoadExecutor-10151-thread-1) [ ] o.a.s.c.SolrConfig Loaded SolrConfig: solrconfig-managed-schema.xml
[junit4] 2> 3132557 INFO (coreLoadExecutor-10151-thread-1) [ ] o.a.s.s.ManagedIndexSchemaFactory The schema is configured as managed, but managed schema resource managed-schema not found - loading non-managed schema schema-rest.xml instead
[junit4] 2> 3132566 INFO (coreLoadExecutor-10151-thread-1) [ ] o.a.s.s.IndexSchema [collection1] Schema name=test-rest
[junit4] 2> 3132680 INFO (coreLoadExecutor-10151-thread-1) [ ] o.a.s.s.IndexSchema default search field in schema is text
[junit4] 2> 3132681 INFO (coreLoadExecutor-10151-thread-1) [ ] o.a.s.s.IndexSchema query parser default operator is OR
[junit4] 2> 3132681 INFO (coreLoadExecutor-10151-thread-1) [ ] o.a.s.s.IndexSchema unique key field: id
[junit4] 2> 3132682 WARN (coreLoadExecutor-10151-thread-1) [ ] o.a.s.s.IndexSchema Field title is not multivalued and destination for multiple copyFields (3)
[junit4] 2> 3132686 INFO (coreLoadExecutor-10151-thread-1) [ ] o.a.s.r.RestManager Registered ManagedResource impl org.apache.solr.rest.schema.analysis.ManagedWordSetResource for path /schema/analysis/stopwords/german
[junit4] 2> 3132686 INFO (coreLoadExecutor-10151-thread-1) [ ] o.a.s.r.RestManager Registered ManagedResource impl org.apache.solr.rest.schema.analysis.ManagedSynonymFilterFactory$SynonymManager for path /schema/analysis/synonyms/german
[junit4] 2> 3132693 INFO (coreLoadExecutor-10151-thread-1) [ ] o.a.s.r.RestManager Registered ManagedResource impl org.apache.solr.rest.schema.analysis.ManagedWordSetResource for path /schema/analysis/stopwords/english
[junit4] 2> 3132694 INFO (coreLoadExecutor-10151-thread-1) [ ] o.a.s.r.RestManager Registered ManagedResource impl org.apache.solr.rest.schema.analysis.ManagedSynonymFilterFactory$SynonymManager for path /schema/analysis/synonyms/english
[junit4] 2> 3132702 INFO (coreLoadExecutor-10151-thread-1) [ ] o.a.s.r.RestManager Added observer of type org.apache.solr.rest.schema.analysis.ManagedStopFilterFactory to existing ManagedResource /schema/analysis/stopwords/english
[junit4] 2> 3132703 INFO (coreLoadExecutor-10151-thread-1) [ ] o.a.s.r.RestManager Added observer of type org.apache.solr.rest.schema.analysis.ManagedSynonymFilterFactory to existing ManagedResource /schema/analysis/synonyms/english
[junit4] 2> 3132703 INFO (coreLoadExecutor-10151-thread-1) [ ] o.a.s.r.RestManager Added observer of type org.apache.solr.rest.schema.analysis.ManagedStopFilterFactory to existing ManagedResource /schema/analysis/stopwords/german
[junit4] 2> 3132703 INFO (coreLoadExecutor-10151-thread-1) [ ] o.a.s.r.RestManager Added observer of type org.apache.solr.rest.schema.analysis.ManagedSynonymFilterFactory to existing ManagedResource /schema/analysis/synonyms/german
[junit4] 2> 3132708 INFO (coreLoadExecutor-10151-thread-1) [ ] o.a.s.s.ManagedIndexSchema Upgraded to managed schema at C:\Users\jenkins\workspace\Lucene-Solr-6.x-Windows\solr\build\solr-core\test\J0\temp\solr.rest.schema.TestBulkSchemaAPI_437FE9807A472571-001\tempDir-001\collection1\conf\managed-schema
[junit4] 2> 3132712 INFO (coreLoadExecutor-10151-thread-1) [ ] o.a.s.s.ManagedIndexSchemaFactory After upgrading to managed schema, renamed the non-managed schema C:\Users\jenkins\workspace\Lucene-Solr-6.x-Windows\solr\build\solr-core\test\J0\temp\solr.rest.schema.TestBulkSchemaAPI_437FE9807A472571-001\tempDir-001\collection1\conf\schema-rest.xml to C:\Users\jenkins\workspace\Lucene-Solr-6.x-Windows\solr\build\solr-core\test\J0\temp\solr.rest.schema.TestBulkSchemaAPI_437FE9807A472571-001\tempDir-001\collection1\conf\schema-rest.xml.bak
[junit4] 2> 3132726 INFO (coreLoadExecutor-10151-thread-1) [ ] o.a.s.c.ConfigSetProperties Did not find ConfigSet properties, assuming default properties: Can't find resource 'configsetprops.json' in classpath or 'C:\Users\jenkins\workspace\Lucene-Solr-6.x-Windows\solr\build\solr-core\test\J0\temp\solr.rest.schema.TestBulkSchemaAPI_437FE9807A472571-001\tempDir-001\collection1'
[junit4] 2> 3132726 INFO (coreLoadExecutor-10151-thread-1) [ ] o.a.s.c.CoreContainer Creating SolrCore 'collection1' using configuration from configset C:\Users\jenkins\workspace\Lucene-Solr-6.x-Windows\solr\build\solr-core\test\J0\temp\solr.rest.schema.TestBulkSchemaAPI_437FE9807A472571-001\tempDir-001\collection1
[junit4] 2> 3132727 INFO (coreLoadExecutor-10151-thread-1) [ x:collection1] o.a.s.c.SolrCore solr.NRTCachingDirectoryFactory
[junit4] 2> 3132727 INFO (coreLoadExecutor-10151-thread-1) [ x:collection1] o.a.s.c.SolrCore [[collection1] ] Opening new SolrCore at [C:\Users\jenkins\workspace\Lucene-Solr-6.x-Windows\solr\build\solr-core\test\J0\temp\solr.rest.schema.TestBulkSchemaAPI_437FE9807A472571-001\tempDir-001\collection1], dataDir=[C:\Users\jenkins\workspace\Lucene-Solr-6.x-Windows\solr\build\solr-core\test\J0\temp\solr.rest.schema.TestBulkSchemaAPI_437FE9807A472571-001\tempDir-003\cores\core\data\]
[junit4] 2> 3132727 INFO (coreLoadExecutor-10151-thread-1) [ x:collection1] o.a.s.c.SolrCore JMX monitoring not detected for core: collection1
[junit4] 2> 3132728 INFO (coreLoadExecutor-10151-thread-1) [ x:collection1] o.a.s.c.SchemaCodecFactory Using default compressionMode: BEST_SPEED
[junit4] 2> 3132730 INFO (coreLoadExecutor-10151-thread-1) [ x:collection1] o.a.s.c.CachingDirectoryFactory return new directory for C:\Users\jenkins\workspace\Lucene-Solr-6.x-Windows\solr\build\solr-core\test\J0\temp\solr.rest.schema.TestBulkSchemaAPI_437FE9807A472571-001\tempDir-003\cores\core\data
[junit4] 2> 3132731 INFO (coreLoadExecutor-10151-thread-1) [ x:collection1] o.a.s.c.SolrCore New index directory detected: old=null new=C:\Users\jenkins\workspace\Lucene-Solr-6.x-Windows\solr\build\solr-core\test\J0\temp\solr.rest.schema.TestBulkSchemaAPI_437FE9807A472571-001\tempDir-003\cores\core\data\index/
[junit4] 2> 3132733 WARN (coreLoadExecutor-10151-thread-1) [ x:collection1] o.a.s.c.SolrCore [collection1] Solr index directory 'C:\Users\jenkins\workspace\Lucene-Solr-6.x-Windows\solr\build\solr-core\test\J0\temp\solr.rest.schema.TestBulkSchemaAPI_437FE9807A472571-001\tempDir-003\cores\core\data\index' doesn't exist. Creating new index...
[junit4] 2> 3132735 INFO (coreLoadExecutor-10151-thread-1) [ x:collection1] o.a.s.c.CachingDirectoryFactory return new directory for C:\Users\jenkins\workspace\Lucene-Solr-6.x-Windows\solr\build\solr-core\test\J0\temp\solr.rest.schema.TestBulkSchemaAPI_437FE9807A472571-001\tempDir-003\cores\core\data\index
[junit4] 2> 3132736 INFO (coreLoadExecutor-10151-thread-1) [ x:collection1] o.a.s.u.RandomMergePolicy RandomMergePolicy wrapping class org.apache.lucene.index.LogDocMergePolicy: [LogDocMergePolicy: minMergeSize=1000, mergeFactor=47, maxMergeSize=9223372036854775807, maxMergeSizeForForcedMerge=9223372036854775807, calibrateSizeByDeletes=false, maxMergeDocs=2147483647, maxCFSSegmentSizeMB=8.796093022207999E12, noCFSRatio=0.1432578154339459]
[junit4] 2> 3132747 INFO (coreLoadExecutor-10151-thread-1) [ x:collection1] o.a.s.c.SolrDeletionPolicy SolrDeletionPolicy.onCommit: commits: num=1
[junit4] 2> commit{dir=NRTCachingDirectory(SimpleFSDirectory@C:\Users\jenkins\workspace\Lucene-Solr-6.x-Windows\solr\build\solr-core\test\J0\temp\solr.rest.schema.TestBulkSchemaAPI_437FE9807A472571-001\tempDir-003\cores\core\data\index lockFactory=org.apache.lucene.store.SingleInstanceLockFactory@74f241; maxCacheMB=48.0 maxMergeSizeMB=4.0),segFN=segments_1,generation=1}
[junit4] 2> 3132747 INFO (coreLoadExecutor-10151-thread-1) [ x:collection1] o.a.s.c.SolrDeletionPolicy newest commit generation = 1
[junit4] 2> 3132748 INFO (OldIndexDirectoryCleanupThreadForCore-collection1) [ x:collection1] o.a.s.c.SolrCore Looking for old index directories to cleanup for core collection1 in C:\Users\jenkins\workspace\Lucene-Solr-6.x-Windows\solr\build\solr-core\test\J0\temp\solr.rest.schema.TestBulkSchemaAPI_437FE9807A472571-001\tempDir-003\cores\core\data\
[junit4] 2> 3132750 INFO (coreLoadExecutor-10151-thread-1) [ x:collection1] o.a.s.c.SolrCore no updateRequestProcessorChain defined as default, creating implicit default
[junit4] 2> 3132750 WARN (coreLoadExecutor-10151-thread-1) [ x:collection1] o.a.s.c.RequestHandlers INVALID paramSet a in requestHandler {type = requestHandler,name = /dump,class = DumpRequestHandler,args = {defaults={a=A,b=B}}}
[junit4] 2> 3132763 INFO (coreLoadExecutor-10151-thread-1) [ x:collection1] o.a.s.h.l.XMLLoader xsltCacheLifetimeSeconds=60
[junit4] 2> 3132765 INFO (coreLoadExecutor-10151-thread-1) [ x:collection1] o.a.s.h.l.XMLLoader xsltCacheLifetimeSeconds=60
[junit4] 2> 3132767 INFO (coreLoadExecutor-10151-thread-1) [ x:collection1] o.a.s.h.l.XMLLoader xsltCacheLifetimeSeconds=60
[junit4] 2> 3132769 INFO (coreLoadExecutor-10151-thread-1) [ x:collection1] o.a.s.h.l.XMLLoader xsltCacheLifetimeSeconds=60
[junit4] 2> 3132772 INFO (coreLoadExecutor-10151-thread-1) [ x:collection1] o.a.s.c.RequestHandlers Registered paths: /admin/mbeans,standard,/update/json/docs,/admin/luke,/export,/get,/admin/properties,/update/json,/admin/threads,/dump,/update/csv,/sql,/graph,/admin/segments,/admin/system,/replication,/config,/stream,/schema,/admin/plugins,/admin/logging,/admin/ping,/update,/admin/file
[junit4] 2> 3132772 INFO (coreLoadExecutor-10151-thread-1) [ x:collection1] o.a.s.c.SolrCore Using default statsCache cache: org.apache.solr.search.stats.LocalStatsCache
[junit4] 2> 3132773 INFO (coreLoadExecutor-10151-thread-1) [ x:collection1] o.a.s.u.CommitTracker Hard AutoCommit: disabled
[junit4] 2> 3132773 INFO (coreLoadExecutor-10151-thread-1) [ x:collection1] o.a.s.u.CommitTracker Soft AutoCommit: disabled
[junit4] 2> 3132773 INFO (coreLoadExecutor-10151-thread-1) [ x:collection1] o.a.s.u.RandomMergePolicy RandomMergePolicy wrapping class org.apache.lucene.index.TieredMergePolicy: [TieredMergePolicy: maxMergeAtOnce=15, maxMergeAtOnceExplicit=46, maxMergedSegmentMB=88.197265625, floorSegmentMB=1.732421875, forceMergeDeletesPctAllowed=9.831774096364292, segmentsPerTier=29.0, maxCFSSegmentSizeMB=8.796093022207999E12, noCFSRatio=0.6628539267006628
[junit4] 2> 3132774 INFO (coreLoadExecutor-10151-thread-1) [ x:collection1] o.a.s.c.SolrDeletionPolicy SolrDeletionPolicy.onInit: commits: num=1
[junit4] 2> commit{dir=NRTCachingDirectory(SimpleFSDirectory@C:\Users\jenkins\workspace\Lucene-Solr-6.x-Windows\solr\build\solr-core\test\J0\temp\solr.rest.schema.TestBulkSchemaAPI_437FE9807A472571-001\tempDir-003\cores\core\data\index lockFactory=org.apache.lucene.store.SingleInstanceLockFactory@74f241; maxCacheMB=48.0 maxMergeSizeMB=4.0),segFN=segments_1,generation=1}
[junit4] 2> 3132774 INFO (coreLoadExecutor-10151-thread-1) [ x:collection1] o.a.s.c.SolrDeletionPolicy newest commit generation = 1
[junit4] 2> 3132774 INFO (coreLoadExecutor-10151-thread-1) [ x:collection1] o.a.s.s.SolrIndexSearcher Opening [Searcher@16a53b[collection1] main]
[junit4] 2> 3132776 INFO (coreLoadExecutor-10151-thread-1) [ x:collection1] o.a.s.r.ManagedResourceStorage File-based storage initialized to use dir: C:\Users\jenkins\workspace\Lucene-Solr-6.x-Windows\solr\build\solr-core\test\J0\temp\solr.rest.schema.TestBulkSchemaAPI_437FE9807A472571-001\tempDir-001\collection1\conf
[junit4] 2> 3132776 INFO (coreLoadExecutor-10151-thread-1) [ x:collection1] o.a.s.r.RestManager Initializing RestManager with initArgs: {storageDir=C:\Users\jenkins\workspace\Lucene-Solr-6.x-Windows\solr\build\solr-core\test\J0\temp\solr.rest.schema.TestBulkSchemaAPI_437FE9807A472571-001\tempDir-001\collection1\conf}
[junit4] 2> 3132776 INFO (coreLoadExecutor-10151-thread-1) [ x:collection1] o.a.s.r.ManagedResourceStorage Reading _rest_managed.json using file:dir=C:\Users\jenkins\workspace\Lucene-Solr-6.x-Windows\solr\build\solr-core\test\J0\temp\solr.rest.schema.TestBulkSchemaAPI_437FE9807A472571-001\tempDir-001\collection1\conf
[junit4] 2> 3132777 INFO (coreLoadExecutor-10151-thread-1) [ x:collection1] o.a.s.r.RestManager Initializing 4 registered ManagedResources
[junit4] 2> 3132777 INFO (coreLoadExecutor-10151-thread-1) [ x:collection1] o.a.s.r.ManagedResourceStorage Reading _schema_analysis_stopwords_english.json using file:dir=C:\Users\jenkins\workspace\Lucene-Solr-6.x-Windows\solr\build\solr-core\test\J0\temp\solr.rest.schema.TestBulkSchemaAPI_437FE9807A472571-001\tempDir-001\collection1\conf
[junit4] 2> 3132778 WARN (coreLoadExecutor-10151-thread-1) [ x:collection1] o.a.s.r.ManagedResource No stored data found for /schema/analysis/stopwords/english
[junit4] 2> 3132780 INFO (coreLoadExecutor-10151-thread-1) [ x:collection1] o.a.s.r.ManagedResourceStorage Saved JSON object to path _schema_analysis_stopwords_english.json using file:dir=C:\Users\jenkins\workspace\Lucene-Solr-6.x-Windows\solr\build\solr-core\test\J0\temp\solr.rest.schema.TestBulkSchemaAPI_437FE9807A472571-001\tempDir-001\collection1\conf
[junit4] 2> 3132780 INFO (coreLoadExecutor-10151-thread-1) [ x:collection1] o.a.s.r.s.a.ManagedWordSetResource Loaded 0 words for /schema/analysis/stopwords/english
[junit4] 2> 3132780 INFO (coreLoadExecutor-10151-thread-1) [ x:collection1] o.a.s.r.ManagedResource Notified 2 observers of /schema/analysis/stopwords/english
[junit4] 2> 3132780 INFO (coreLoadExecutor-10151-thread-1) [ x:collection1] o.a.s.r.ManagedResourceStorage Reading _schema_analysis_stopwords_german.json using file:dir=C:\Users\jenkins\workspace\Lucene-Solr-6.x-Windows\solr\build\solr-core\test\J0\temp\solr.rest.schema.TestBulkSchemaAPI_437FE9807A472571-001\tempDir-001\collection1\conf
[junit4] 2> 3132781 WARN (coreLoadExecutor-10151-thread-1) [ x:collection1] o.a.s.r.ManagedResource No stored data found for /schema/analysis/stopwords/german
[junit4] 2> 3132783 INFO (coreLoadExecutor-10151-thread-1) [ x:collection1] o.a.s.r.ManagedResourceStorage Saved JSON object to path _schema_analysis_stopwords_german.json using file:dir=C:\Users\jenkins\workspace\Lucene-Solr-6.x-Windows\solr\build\solr-core\test\J0\temp\solr.rest.schema.TestBulkSchemaAPI_437FE9807A472571-001\tempDir-001\collection1\conf
[junit4] 2> 3132783 INFO (coreLoadExecutor-10151-thread-1) [ x:collection1] o.a.s.r.s.a.ManagedWordSetResource Loaded 0 words for /schema/analysis/stopwords/german
[junit4] 2> 3132783 INFO (coreLoadExecutor-10151-thread-1) [ x:collection1] o.a.s.r.ManagedResource Notified 2 observers of /schema/analysis/stopwords/german
[junit4] 2> 3132783 INFO (coreLoadExecutor-10151-thread-1) [ x:collection1] o.a.s.r.ManagedResourceStorage Reading _schema_analysis_synonyms_english.json using file:dir=C:\Users\jenkins\workspace\Lucene-Solr-6.x-Windows\solr\build\solr-core\test\J0\temp\solr.rest.schema.TestBulkSchemaAPI_437FE9807A472571-001\tempDir-001\collection1\conf
[junit4] 2> 3132784 WARN (coreLoadExecutor-10151-thread-1) [ x:collection1] o.a.s.r.ManagedResource No stored data found for /schema/analysis/synonyms/english
[junit4] 2> 3132785 INFO (coreLoadExecutor-10151-thread-1) [ x:collection1] o.a.s.r.s.a.ManagedSynonymFilterFactory Loaded 0 synonym mappings for /schema/analysis/synonyms/english
[junit4] 2> 3132785 INFO (coreLoadExecutor-10151-thread-1) [ x:collection1] o.a.s.r.ManagedResource Notified 2 observers of /schema/analysis/synonyms/english
[junit4] 2> 3132785 INFO (coreLoadExecutor-10151-thread-1) [ x:collection1] o.a.s.r.ManagedResourceStorage Reading _schema_analysis_synonyms_german.json using file:dir=C:\Users\jenkins\workspace\Lucene-Solr-6.x-Windows\solr\build\solr-core\test\J0\temp\solr.rest.schema.TestBulkSchemaAPI_437FE9807A472571-001\tempDir-001\collection1\conf
[junit4] 2> 3132786 WARN (coreLoadExecutor-10151-thread-1) [ x:collection1] o.a.s.r.ManagedResource No stored data found for /schema/analysis/synonyms/german
[junit4] 2> 3132786 INFO (coreLoadExecutor-10151-thread-1) [ x:collection1] o.a.s.r.s.a.ManagedSynonymFilterFactory Loaded 0 synonym mappings for /schema/analysis/synonyms/german
[junit4] 2> 3132786 INFO (coreLoadExecutor-10151-thread-1) [ x:collection1] o.a.s.r.ManagedResource Notified 2 observers of /schema/analysis/synonyms/german
[junit4] 2> 3132787 INFO (coreLoadExecutor-10151-thread-1) [ x:collection1] o.a.s.h.ReplicationHandler Commits will be reserved for 10000
[junit4] 2> 3132787 INFO (searcherExecutor-10152-thread-1-processing-x:collection1) [ x:collection1] o.a.s.c.SolrCore [collection1] Registered new searcher Searcher@16a53b[collection1] main{ExitableDirectoryReader(UninvertingDirectoryReader())}
[junit4] 2> 3132787 INFO (coreLoadExecutor-10151-thread-1) [ x:collection1] o.a.s.c.CoreContainer registering core: collection1
[junit4] 2> 3132920 INFO (TEST-TestBulkSchemaAPI.testAddFieldMatchingExistingDynamicField-seed#[437FE9807A472571]) [ ] o.a.s.SolrJettyTestBase Jetty Assigned Port#61021
[junit4] 2> 3132932 INFO (qtp2974111-40412) [ x:collection1] o.a.s.c.S.Request [collection1] webapp=/solr path=/schema params={wt=json} status=0 QTime=1
[junit4] 2> 3132939 INFO (qtp2974111-40413) [ x:collection1] o.a.s.c.S.Request [collection1] webapp=/solr path=/schema params={wt=json} status=0 QTime=1
[junit4] 2> 3132945 INFO (qtp2974111-40414) [ x:collection1] o.a.s.c.S.Request [collection1] webapp=/solr path=/schema params={wt=json} status=0 QTime=0
[junit4] 2> 3132956 INFO (qtp2974111-40415) [ x:collection1] o.a.s.r.RestManager Added observer of type org.apache.solr.rest.schema.analysis.ManagedStopFilterFactory to existing ManagedResource /schema/analysis/stopwords/german
[junit4] 2> 3132956 INFO (qtp2974111-40415) [ x:collection1] o.a.s.r.ManagedResourceStorage Reading _schema_analysis_stopwords_german.json using file:dir=C:\Users\jenkins\workspace\Lucene-Solr-6.x-Windows\solr\build\solr-core\test\J0\temp\solr.rest.schema.TestBulkSchemaAPI_437FE9807A472571-001\tempDir-001\collection1\conf
[junit4] 2> 3132957 INFO (qtp2974111-40415) [ x:collection1] o.a.s.r.ManagedResourceStorage Loaded LinkedHashMap at path _schema_analysis_stopwords_german.json using file:dir=C:\Users\jenkins\workspace\Lucene-Solr-6.x-Windows\solr\build\solr-core\test\J0\temp\solr.rest.schema.TestBulkSchemaAPI_437FE9807A472571-001\tempDir-001\collection1\conf
[junit4] 2> 3132957 INFO (qtp2974111-40415) [ x:collection1] o.a.s.r.ManagedResource Loaded initArgs {ignoreCase=false} for /schema/analysis/stopwords/german
[junit4] 2> 3132960 INFO (qtp2974111-40415) [ x:collection1] o.a.s.r.s.a.ManagedWordSetResource Loaded 0 words for /schema/analysis/stopwords/german
[junit4] 2> 3132961 INFO (qtp2974111-40415) [ x:collection1] o.a.s.r.ManagedResource Notified 3 observers of /schema/analysis/stopwords/german
[junit4] 2> 3132961 INFO (qtp2974111-40415) [ x:collection1] o.a.s.r.RestManager Registered new managed resource /schema/analysis/stopwords/german
[junit4] 2> 3132961 INFO (qtp2974111-40415) [ x:collection1] o.a.s.r.RestManager Added observer of type org.apache.solr.rest.schema.analysis.ManagedSynonymFilterFactory to existing ManagedResource /schema/analysis/synonyms/german
[junit4] 2> 3132961 INFO (qtp2974111-40415) [ x:collection1] o.a.s.r.ManagedResourceStorage Reading _schema_analysis_synonyms_german.json using file:dir=C:\Users\jenkins\workspace\Lucene-Solr-6.x-Windows\solr\build\solr-core\test\J0\temp\solr.rest.schema.TestBulkSchemaAPI_437FE9807A472571-001\tempDir-001\collection1\conf
[junit4] 2> 3132961 WARN (qtp2974111-40415) [ x:collection1] o.a.s.r.ManagedResource No stored data found for /schema/analysis/synonyms/german
[junit4] 2> 3132962 INFO (qtp2974111-40415) [ x:collection1] o.a.s.r.s.a.ManagedSynonymFilterFactory Loaded 0 synonym mappings for /schema/analysis/synonyms/german
[junit4] 2> 3132962 INFO (qtp2974111-40415) [ x:collection1] o.a.s.r.ManagedResource Notified 3 observers of /schema/analysis/synonyms/german
[junit4] 2> 3132962 INFO (qtp2974111-40415) [ x:collection1] o.a.s.r.RestManager Registered new managed resource /schema/analysis/synonyms/german
[junit4] 2> 3132971 INFO (qtp2974111-40415) [ x:collection1] o.a.s.r.RestManager Added observer of type org.apache.solr.rest.schema.analysis.ManagedStopFilterFactory to existing ManagedResource /schema/analysis/stopwords/english
[junit4] 2> 3132971 INFO (qtp2974111-40415) [ x:collection1] o.a.s.r.ManagedResourceStorage Reading _schema_analysis_stopwords_english.json using file:dir=C:\Users\jenkins\workspace\Lucene-Solr-6.x-Windows\solr\build\solr-core\test\J0\temp\solr.rest.schema.TestBulkSchemaAPI_437FE9807A472571-001\tempDir-001\collection1\conf
[junit4] 2> 3132971 INFO (qtp2974111-40415) [ x:collection1] o.a.s.r.ManagedResourceStorage Loaded LinkedHashMap at path _schema_analysis_stopwords_english.json using file:dir=C:\Users\jenkins\workspace\Lucene-Solr-6.x-Windows\solr\build\solr-core\test\J0\temp\solr.rest.schema.TestBulkSchemaAPI_437FE9807A472571-001\tempDir-001\collection1\conf
[junit4] 2> 3132971 INFO (qtp2974111-40415) [ x:collection1] o.a.s.r.ManagedResource Loaded initArgs {ignoreCase=false} for /schema/analysis/stopwords/english
[junit4] 2> 3132971 INFO (qtp2974111-40415) [ x:collection1] o.a.s.r.s.a.ManagedWordSetResource Loaded 0 words for /schema/analysis/stopwords/english
[junit4] 2> 3132971 INFO (qtp2974111-40415) [ x:collection1] o.a.s.r.ManagedResource Notified 3 observers of /schema/analysis/stopwords/english
[junit4] 2> 3132971 INFO (qtp2974111-40415) [ x:collection1] o.a.s.r.RestManager Registered new managed resource /schema/analysis/stopwords/english
[junit4] 2> 3132971 INFO (qtp2974111-40415) [ x:collection1] o.a.s.r.RestManager Added observer of type org.apache.solr.rest.schema.analysis.ManagedSynonymFilterFactory to existing ManagedResource /schema/analysis/synonyms/english
[junit4] 2> 3132972 INFO (qtp2974111-40415) [ x:collection1] o.a.s.r.ManagedResourceStorage Reading _schema_analysis_synonyms_english.json using file:dir=C:\Users\jenkins\workspace\Lucene-Solr-6.x-Windows\solr\build\solr-core\test\J0\temp\solr.rest.schema.TestBulkSchemaAPI_437FE9807A472571-001\tempDir-001\collection1\conf
[junit4] 2> 3132972 WARN (qtp2974111-40415) [ x:collection1] o.a.s.r.ManagedResource No stored data found for /schema/analysis/synonyms/english
[junit4] 2> 3132972 INFO (qtp2974111-40415) [ x:collection1] o.a.s.r.s.a.ManagedSynonymFilterFactory Loaded 0 synonym mappings for /schema/analysis/synonyms/english
[junit4] 2> 3132972 INFO (qtp2974111-40415) [ x:collection1] o.a.s.r.ManagedResource Notified 3 observers of /schema/analysis/synonyms/english
[junit4] 2> 3132973 INFO (qtp2974111-40415) [ x:collection1] o.a.s.r.RestManager Registered new managed resource /schema/analysis/synonyms/english
[junit4] 2> 3132975 INFO (qtp2974111-40415) [ x:collection1] o.a.s.s.ManagedIndexSchema Upgraded to managed schema at C:\Users\jenkins\workspace\Lucene-Solr-6.x-Windows\solr\build\solr-core\test\J0\temp\solr.rest.schema.TestBulkSchemaAPI_437FE9807A472571-001\tempDir-001\collection1\conf\managed-schema
[junit4] 2> 3132977 INFO (qtp2974111-40415) [ x:collection1] o.a.s.c.S.Request [collection1] webapp=/solr path=/schema params={wt=json} status=0 QTime=26
[junit4] 2> 3132981 INFO (qtp2974111-40416) [ x:collection1] o.a.s.c.S.Request [collection1] webapp=/solr path=/schema params={wt=json} status=0 QTime=0
[junit4] 2> 3132984 INFO (TEST-TestBulkSchemaAPI.testAddFieldMatchingExistingDynamicField-seed#[437FE9807A472571]) [ ] o.e.j.s.ServerConnector Stopped ServerConnector@13d4335{HTTP/1.1,[http/1.1]}{127.0.0.1:0}
[junit4] 2> 3132984 INFO (TEST-TestBulkSchemaAPI.testAddFieldMatchingExistingDynamicField-seed#[437FE9807A472571]) [ ] o.a.s.c.CoreContainer Shutting down CoreContainer instance=9602019
[junit4] 2> 3132986 INFO (coreCloseExecutor-10156-thread-1) [ x:collection1] o.a.s.c.SolrCore [collection1] CLOSING SolrCore org.apache.solr.core.SolrCore@1afafe8
[junit4] 2> 3132986 INFO (coreCloseExecutor-10156-thread-1) [ x:collection1] o.a.s.u.DirectUpdateHandler2 closing DirectUpdateHandler2{commits=0,autocommits=0,soft autocommits=0,optimizes=0,rollbacks=0,expungeDeletes=0,docsPending=0,adds=0,deletesById=0,deletesByQuery=0,errors=0,cumulative_adds=0,cumulative_deletesById=0,cumulative_deletesByQuery=0,cumulative_errors=0}
[junit4] 2> 3132986 INFO (coreCloseExecutor-10156-thread-1) [ x:collection1] o.a.s.u.SolrCoreState Closing SolrCoreState
[junit4] 2> 3132986 INFO (coreCloseExecutor-10156-thread-1) [ x:collection1] o.a.s.u.DefaultSolrCoreState SolrCoreState ref count has reached 0 - closing IndexWriter
[junit4] 2> 3132986 INFO (coreCloseExecutor-10156-thread-1) [ x:collection1] o.a.s.u.DefaultSolrCoreState closing IndexWriter with IndexWriterCloser
[junit4] 2> 3132989 INFO (coreCloseExecutor-10156-thread-1) [ x:collection1] o.a.s.c.SolrCore [collection1] Closing main searcher on request.
[junit4] 2> 3132989 INFO (coreCloseExecutor-10156-thread-1) [ x:collection1] o.a.s.c.CachingDirectoryFactory Closing NRTCachingDirectoryFactory - 2 directories currently being tracked
[junit4] 2> 3132989 INFO (coreCloseExecutor-10156-thread-1) [ x:collection1] o.a.s.c.CachingDirectoryFactory looking to close C:\Users\jenkins\workspace\Lucene-Solr-6.x-Windows\solr\build\solr-core\test\J0\temp\solr.rest.schema.TestBulkSchemaAPI_437FE9807A472571-001\tempDir-003\cores\core\data [CachedDir<<refCount=0;path=C:\Users\jenkins\workspace\Lucene-Solr-6.x-Windows\solr\build\solr-core\test\J0\temp\solr.rest.schema.TestBulkSchemaAPI_437FE9807A472571-001\tempDir-003\cores\core\data;done=false>>]
[junit4] 2> 3132989 INFO (coreCloseExecutor-10156-thread-1) [ x:collection1] o.a.s.c.CachingDirectoryFactory Closing directory, CoreContainer#isShutdown=true
[junit4] 2> 3132989 INFO (coreCloseExecutor-10156-thread-1) [ x:collection1] o.a.s.c.CachingDirectoryFactory Closing directory: C:\Users\jenkins\workspace\Lucene-Solr-6.x-Windows\solr\build\solr-core\test\J0\temp\solr.rest.schema.TestBulkSchemaAPI_437FE9807A472571-001\tempDir-003\cores\core\data
[junit4] 2> 3132990 INFO (coreCloseExecutor-10156-thread-1) [ x:collection1] o.a.s.c.CachingDirectoryFactory looking to close C:\Users\jenkins\workspace\Lucene-Solr-6.x-Windows\solr\build\solr-core\test\J0\temp\solr.rest.schema.TestBulkSchemaAPI_437FE9807A472571-001\tempDir-003\cores\core\data\index [CachedDir<<refCount=0;path=C:\Users\jenkins\workspace\Lucene-Solr-6.x-Windows\solr\build\solr-core\test\J0\temp\solr.rest.schema.TestBulkSchemaAPI_437FE9807A472571-001\tempDir-003\cores\core\data\index;done=false>>]
[junit4] 2> 3132990 INFO (coreCloseExecutor-10156-thread-1) [ x:collection1] o.a.s.c.CachingDirectoryFactory Closing directory, CoreContainer#isShutdown=true
[junit4] 2> 3132990 INFO (coreCloseExecutor-10156-thread-1) [ x:collection1] o.a.s.c.CachingDirectoryFactory Closing directory: C:\Users\jenkins\workspace\Lucene-Solr-6.x-Windows\solr\build\solr-core\test\J0\temp\solr.rest.schema.TestBulkSchemaAPI_437FE9807A472571-001\tempDir-003\cores\core\data\index
[junit4] 2> 3132990 INFO (TEST-TestBulkSchemaAPI.testAddFieldMatchingExistingDynamicField-seed#[437FE9807A472571]) [ ] o.e.j.s.h.ContextHandler Stopped o.e.j.s.ServletContextHandler@b7dab6{/solr,null,UNAVAILABLE}
[junit4] 2> 3132997 INFO (TEST-TestBulkSchemaAPI.testAddFieldMatchingExistingDynamicField-seed#[437FE9807A472571]) [ ] o.a.s.SolrTestCaseJ4 ###Ending testAddFieldMatchingExistingDynamicField
[junit4] 2> 3133000 INFO (TEST-TestBulkSchemaAPI.testAddFieldWithExistingCatchallDynamicField-seed#[437FE9807A472571]) [ ] o.a.s.SolrTestCaseJ4 ###Starting testAddFieldWithExistingCatchallDynamicField
[junit4] 2> 3133777 INFO (TEST-TestBulkSchemaAPI.testAddFieldWithExistingCatchallDynamicField-seed#[437FE9807A472571]) [ ] o.a.s.SolrTestCaseJ4 ####initCore
[junit4] 2> 3133777 INFO (TEST-TestBulkSchemaAPI.testAddFieldWithExistingCatchallDynamicField-seed#[437FE9807A472571]) [ ] o.a.s.SolrTestCaseJ4 ####initCore end
[junit4] 2> 3133779 INFO (TEST-TestBulkSchemaAPI.testAddFieldWithExistingCatchallDynamicField-seed#[437FE9807A472571]) [ ] o.a.s.SolrTestCaseJ4 Writing core.properties file to C:\Users\jenkins\workspace\Lucene-Solr-6.x-Windows\solr\build\solr-core\test\J0\temp\solr.rest.schema.TestBulkSchemaAPI_437FE9807A472571-001\tempDir-006\cores\core
[junit4] 2> 3133784 INFO (TEST-TestBulkSchemaAPI.testAddFieldWithExistingCatchallDynamicField-seed#[437FE9807A472571]) [ ] o.e.j.s.Server jetty-9.3.8.v20160314
[junit4] 2> 3133785 INFO (TEST-TestBulkSchemaAPI.testAddFieldWithExistingCatchallDynamicField-seed#[437FE9807A472571]) [ ] o.e.j.s.h.ContextHandler Started o.e.j.s.ServletContextHandler@128ff1{/solr,null,AVAILABLE}
[junit4] 2> 3133787 INFO (TEST-TestBulkSchemaAPI.testAddFieldWithExistingCatchallDynamicField-seed#[437FE9807A472571]) [ ] o.e.j.s.ServerConnector Started ServerConnector@1ce5288{HTTP/1.1,[http/1.1]}{127.0.0.1:61025}
[junit4] 2> 3133787 INFO (TEST-TestBulkSchemaAPI.testAddFieldWithExistingCatchallDynamicField-seed#[437FE9807A472571]) [ ] o.e.j.s.Server Started @3140171ms
[junit4] 2> 3133787 INFO (TEST-TestBulkSchemaAPI.testAddFieldWithExistingCatchallDynamicField-seed#[437FE9807A472571]) [ ] o.a.s.c.s.e.JettySolrRunner Jetty properties: {hostContext=/solr, hostPort=61025, configSetBaseDir=C:\Users\jenkins\workspace\Lucene-Solr-6.x-Windows\solr\build\solr-core\test\J0\temp\solr.rest.schema.TestBulkSchemaAPI_437FE9807A472571-001\tempDir-004, coreRootDirectory=C:\Users\jenkins\workspace\Lucene-Solr-6.x-Windows\solr\build\solr-core\test\J0\temp\solr.rest.schema.TestBulkSchemaAPI_437FE9807A472571-001\tempDir-006\cores}
[junit4] 2> 3133787 INFO (TEST-TestBulkSchemaAPI.testAddFieldWithExistingCatchallDynamicField-seed#[437FE9807A472571]) [ ] o.a.s.s.SolrDispatchFilter SolrDispatchFilter.init(): sun.misc.Launcher$AppClassLoader@1d16e93
[junit4] 2> 3133787 INFO (TEST-TestBulkSchemaAPI.testAddFieldWithExistingCatchallDynamicField-seed#[437FE9807A472571]) [ ] o.a.s.c.SolrResourceLoader new SolrResourceLoader for directory: 'C:\Users\jenkins\workspace\Lucene-Solr-6.x-Windows\solr\build\solr-core\test\J0\temp\solr.rest.schema.TestBulkSchemaAPI_437FE9807A472571-001\tempDir-004'
[junit4] 2> 3133788 INFO (TEST-TestBulkSchemaAPI.testAddFieldWithExistingCatchallDynamicField-seed#[437FE9807A472571]) [ ] o.a.s.c.SolrResourceLoader JNDI not configured for solr (NoInitialContextEx)
[junit4] 2> 3133788 INFO (TEST-TestBulkSchemaAPI.testAddFieldWithExistingCatchallDynamicField-seed#[437FE9807A472571]) [ ] o.a.s.c.SolrResourceLoader using system property solr.solr.home: C:\Users\jenkins\workspace\Lucene-Solr-6.x-Windows\solr\build\solr-core\test\J0\temp\solr.rest.schema.TestBulkSchemaAPI_437FE9807A472571-001\tempDir-004
[junit4] 2> 3133788 INFO (TEST-TestBulkSchemaAPI.testAddFieldWithExistingCatchallDynamicField-seed#[437FE9807A472571]) [ ] o.a.s.c.SolrXmlConfig Loading container configuration from C:\Users\jenkins\workspace\Lucene-Solr-6.x-Windows\solr\build\solr-core\test\J0\temp\solr.rest.schema.TestBulkSchemaAPI_437FE9807A472571-001\tempDir-004\solr.xml
[junit4] 2> 3133814 INFO (TEST-TestBulkSchemaAPI.testAddFieldWithExistingCatchallDynamicField-seed#[437FE9807A472571]) [ ] o.a.s.c.CorePropertiesLocator Config-defined core root directory: C:\Users\jenkins\workspace\Lucene-Solr-6.x-Windows\solr\build\solr-core\test\J0\temp\solr.rest.schema.TestBulkSchemaAPI_437FE9807A472571-001\tempDir-006\cores
[junit4] 2> 3133814 INFO (TEST-TestBulkSchemaAPI.testAddFieldWithExistingCatchallDynamicField-seed#[437FE9807A472571]) [ ] o.a.s.c.CoreContainer New CoreContainer 7042419
[junit4] 2> 3133814 INFO (TEST-TestBulkSchemaAPI.testAddFieldWithExistingCatchallDynamicField-seed#[437FE9807A472571]) [ ] o.a.s.c.CoreContainer Loading cores into CoreContainer [instanceDir=C:\Users\jenkins\workspace\Lucene-Solr-6.x-Windows\solr\build\solr-core\test\J0\temp\solr.rest.schema.TestBulkSchemaAPI_437FE9807A472571-001\tempDir-004]
[junit4] 2> 3133816 WARN (TEST-TestBulkSchemaAPI.testAddFieldWithExistingCatchallDynamicField-seed#[437FE9807A472571]) [ ] o.a.s.c.CoreContainer Couldn't add files from C:\Users\jenkins\workspace\Lucene-Solr-6.x-Windows\solr\build\solr-core\test\J0\temp\solr.rest.schema.TestBulkSchemaAPI_437FE9807A472571-001\tempDir-004\lib to classpath: C:\Users\jenkins\workspace\Lucene-Solr-6.x-Windows\solr\build\solr-core\test\J0\temp\solr.rest.schema.TestBulkSchemaAPI_437FE9807A472571-001\tempDir-004\lib
[junit4] 2> 3133816 INFO (TEST-TestBulkSchemaAPI.testAddFieldWithExistingCatchallDynamicField-seed#[437FE9807A472571]) [ ] o.a.s.h.c.HttpShardHandlerFactory created with socketTimeout : 90000,urlScheme : ,connTimeout : 15000,maxConnectionsPerHost : 20,maxConnections : 10000,corePoolSize : 0,maximumPoolSize : 2147483647,maxThreadIdleTime : 5,sizeOfQueue : -1,fairnessPolicy : false,useRetries : false,
[junit4] 2> 3133823 INFO (TEST-TestBulkSchemaAPI.testAddFieldWithExistingCatchallDynamicField-seed#[437FE9807A472571]) [ ] o.a.s.u.UpdateShardHandler Creating UpdateShardHandler HTTP client with params: socketTimeout=340000&connTimeout=45000&retry=true
[junit4] 2> 3133825 INFO (TEST-TestBulkSchemaAPI.testAddFieldWithExistingCatchallDynamicField-seed#[437FE9807A472571]) [ ] o.a.s.l.LogWatcher SLF4J impl is org.slf4j.impl.Log4jLoggerFactory
[junit4] 2> 3133825 INFO (TEST-TestBulkSchemaAPI.testAddFieldWithExistingCatchallDynamicField-seed#[437FE9807A472571]) [ ] o.a.s.l.LogWatcher Registering Log Listener [Log4j (org.slf4j.impl.Log4jLoggerFactory)]
[junit4] 2> 3133825 INFO (TEST-TestBulkSchemaAPI.testAddFieldWithExistingCatchallDynamicField-seed#[437FE9807A472571]) [ ] o.a.s.c.CoreContainer Security conf doesn't exist. Skipping setup for authorization module.
[junit4] 2> 3133825 INFO (TEST-TestBulkSchemaAPI.testAddFieldWithExistingCatchallDynamicField-seed#[437FE9807A472571]) [ ] o.a.s.c.CoreContainer No authentication plugin used.
[junit4] 2> 3133825 INFO (TEST-TestBulkSchemaAPI.testAddFieldWithExistingCatchallDynamicField-seed#[437FE9807A472571]) [ ] o.a.s.c.CorePropertiesLocator Looking for core definitions underneath C:\Users\jenkins\workspace\Lucene-Solr-6.x-Windows\solr\build\solr-core\test\J0\temp\solr.rest.schema.TestBulkSchemaAPI_437FE9807A472571-001\tempDir-006\cores
[junit4] 2> 3133828 INFO (TEST-TestBulkSchemaAPI.testAddFieldWithExistingCatchallDynamicField-seed#[437FE9807A472571]) [ ] o.a.s.c.CoreDescriptor Created CoreDescriptor: {name=collection1, config=solrconfig-managed-schema.xml, loadOnStartup=true, schema=schema-rest.xml, configSetProperties=configsetprops.json, transient=false, dataDir=data\, configSet=collection1}
[junit4] 2> 3133828 INFO (TEST-TestBulkSchemaAPI.testAddFieldWithExistingCatchallDynamicField-seed#[437FE9807A472571]) [ ] o.a.s.c.CorePropertiesLocator Found core collection1 in C:\Users\jenkins\workspace\Lucene-Solr-6.x-Windows\solr\build\solr-core\test\J0\temp\solr.rest.schema.TestBulkSchemaAPI_437FE9807A472571-001\tempDir-006\cores\core
[junit4] 2> 3133828 INFO (TEST-TestBulkSchemaAPI.testAddFieldWithExistingCatchallDynamicField-seed#[437FE9807A472571]) [ ] o.a.s.c.CorePropertiesLocator Found 1 core definitions
[junit4] 2> 3133828 INFO (TEST-TestBulkSchemaAPI.testAddFieldWithExistingCatchallDynamicField-seed#[437FE9807A472571]) [ ] o.a.s.s.SolrDispatchFilter user.dir=C:\Users\jenkins\workspace\Lucene-Solr-6.x-Windows\solr\build\solr-core\test\J0
[junit4] 2> 3133830 INFO (TEST-TestBulkSchemaAPI.testAddFieldWithExistingCatchallDynamicField-seed#[437FE9807A472571]) [ ] o.a.s.s.SolrDispatchFilter SolrDispatchFilter.init() done
[junit4] 2> 3133830 INFO (coreLoadExecutor-10163-thread-1) [ ] o.a.s.c.SolrResourceLoader new SolrResourceLoader for directory: 'C:\Users\jenkins\workspace\Lucene-Solr-6.x-Windows\solr\build\solr-core\test\J0\temp\solr.rest.schema.TestBulkSchemaAPI_437FE9807A472571-001\tempDir-004\collection1'
[junit4] 2> 3133830 INFO (coreLoadExecutor-10163-thread-1) [ ] o.a.s.c.SolrResourceLoader JNDI not configured for solr (NoInitialContextEx)
[junit4] 2> 3133830 INFO (coreLoadExecutor-10163-thread-1) [ ] o.a.s.c.SolrResourceLoader using system property solr.solr.home: C:\Users\jenkins\workspace\Lucene-Solr-6.x-Windows\solr\build\solr-core\test\J0\temp\solr.rest.schema.TestBulkSchemaAPI_437FE9807A472571-001\tempDir-004
[junit4] 2> 3133831 INFO (coreLoadExecutor-10163-thread-1) [ ] o.a.s.c.SolrResourceLoader Adding 'file:/C:/Users/jenkins/workspace/Lucene-Solr-6.x-Windows/solr/build/solr-core/test/J0/temp/solr.rest.schema.TestBulkSchemaAPI_437FE9807A472571-001/tempDir-004/collection1/lib/classes/' to classloader
[junit4] 2> 3133831 INFO (coreLoadExecutor-10163-thread-1) [ ] o.a.s.c.SolrResourceLoader Adding 'file:/C:/Users/jenkins/workspace/Lucene-Solr-6.x-Windows/solr/build/solr-core/test/J0/temp/solr.rest.schema.TestBulkSchemaAPI_437FE9807A472571-001/tempDir-004/collection1/lib/README' to classloader
[junit4] 2> 3133922 INFO (coreLoadExecutor-10163-thread-1) [ ] o.a.s.c.SolrConfig current version of requestparams : -1
[junit4] 2> 3133926 INFO (coreLoadExecutor-10163-thread-1) [ ] o.a.s.c.SolrConfig Using Lucene MatchVersion: 6.2.0
[junit4] 2> 3133933 INFO (coreLoadExecutor-10163-thread-1) [ ] o.a.s.c.SolrConfig Loaded SolrConfig: solrconfig-managed-schema.xml
[junit4] 2> 3133949 INFO (coreLoadExecutor-10163-thread-1) [ ] o.a.s.s.ManagedIndexSchemaFactory The schema is configured as managed, but managed schema resource managed-schema not found - loading non-managed schema schema-rest.xml instead
[junit4] 2> 3133957 INFO (coreLoadExecutor-10163-thread-1) [ ] o.a.s.s.IndexSchema [collection1] Schema name=test-rest
[junit4] 2> 3134096 INFO (coreLoadExecutor-10163-thread-1) [ ] o.a.s.s.IndexSchema default search field in schema is text
[junit4] 2> 3134096 INFO (coreLoadExecutor-10163-thread-1) [ ] o.a.s.s.IndexSchema query parser default operator is OR
[junit4] 2> 3134097 INFO (coreLoadExecutor-10163-thread-1) [ ] o.a.s.s.IndexSchema unique key field: id
[junit4] 2> 3134099 WARN (coreLoadExecutor-10163-thread-1) [ ] o.a.s.s.IndexSchema Field title is not multivalued and destination for multiple copyFields (3)
[junit4] 2> 3134104 INFO (coreLoadExecutor-10163-thread-1) [ ] o.a.s.r.RestManager Registered ManagedResource impl org.apache.solr.rest.schema.analysis.ManagedWordSetResource for path /schema/analysis/stopwords/german
[junit4] 2> 3134104 INFO (coreLoadExecutor-10163-thread-1) [ ] o.a.s.r.RestManager Registered ManagedResource impl org.apache.solr.rest.schema.analysis.ManagedSynonymFilterFactory$SynonymManager for path /schema/analysis/synonyms/german
[junit4] 2> 3134114 INFO (coreLoadExecutor-10163-thread-1) [ ] o.a.s.r.RestManager Registered ManagedResource impl org.apache.solr.rest.schema.analysis.ManagedWordSetResource for path /schema/analysis/stopwords/english
[junit4] 2> 3134114 INFO (coreLoadExecutor-10163-thread-1) [ ] o.a.s.r.RestManager Registered ManagedResource impl org.apache.solr.rest.schema.analysis.ManagedSynonymFilterFactory$SynonymManager for path /schema/analysis/synonyms/english
[junit4] 2> 3134126 INFO (coreLoadExecutor-10163-thread-1) [ ] o.a.s.r.RestManager Added observer of type org.apache.solr.rest.schema.analysis.ManagedStopFilterFactory to existing ManagedResource /schema/analysis/stopwords/english
[junit4] 2> 3134126 INFO (coreLoadExecutor-10163-thread-1) [ ] o.a.s.r.RestManager Added observer of type org.apache.solr.rest.schema.analysis.ManagedSynonymFilterFactory to existing ManagedResource /schema/analysis/synonyms/english
[junit4] 2> 3134126 INFO (coreLoadExecutor-10163-thread-1) [ ] o.a.s.r.RestManager Added observer of type org.apache.solr.rest.schema.analysis.ManagedStopFilterFactory to existing ManagedResource /schema/analysis/stopwords/german
[junit4] 2> 3134126 INFO (coreLoadExecutor-10163-thread-1) [ ] o.a.s.r.RestManager Added observer of type org.apache.solr.rest.schema.analysis.ManagedSynonymFilterFactory to existing ManagedResource /schema/analysis/synonyms/german
[junit4] 2> 3134130 INFO (coreLoadExecutor-10163-thread-1) [ ] o.a.s.s.ManagedIndexSchema Upgraded to managed schema at C:\Users\jenkins\workspace\Lucene-Solr-6.x-Windows\solr\build\solr-core\test\J0\temp\solr.rest.schema.TestBulkSchemaAPI_437FE9807A472571-001\tempDir-004\collection1\conf\managed-schema
[junit4] 2> 3134156 INFO (coreLoadExecutor-10163-thread-1) [ ] o.a.s.s.ManagedIndexSchemaFactory After upgrading to managed schema, renamed the non-managed schema C:\Users\jenkins\workspace\Lucene-Solr-6.x-Windows\solr\build\solr-core\test\J0\temp\solr.rest.schema.TestBulkSchemaAPI_437FE9807A472571-001\tempDir-004\collection1\conf\schema-rest.xml to C:\Users\jenkins\workspace\Lucene-Solr-6.x-Windows\solr\build\solr-core\test\J0\temp\solr.rest.schema.TestBulkSchemaAPI_437FE9807A472571-001\tempDir-004\collection1\conf\schema-rest.xml.bak
[junit4] 2> 3134170 INFO (coreLoadExecutor-10163-thread-1) [ ] o.a.s.c.ConfigSetProperties Did not find ConfigSet properties, assuming default properties: Can't find resource 'configsetprops.json' in classpath or 'C:\Users\jenkins\workspace\Lucene-Solr-6.x-Windows\solr\build\solr-core\test\J0\temp\solr.rest.schema.TestBulkSchemaAPI_437FE9807A472571-001\tempDir-004\collection1'
[junit4] 2> 3134171 INFO (coreLoadExecutor-10163-thread-1) [ ] o.a.s.c.CoreContainer Creating SolrCore 'collection1' using configuration from configset C:\Users\jenkins\workspace\Lucene-Solr-6.x-Windows\solr\build\solr-core\test\J0\temp\solr.rest.schema.TestBulkSchemaAPI_437FE9807A472571-001\tempDir-004\collection1
[junit4] 2> 3134171 INFO (coreLoadExecutor-10163-thread-1) [ x:collection1] o.a.s.c.SolrCore solr.NRTCachingDirectoryFactory
[junit4] 2> 3134171 INFO (coreLoadExecutor-10163-thread-1) [ x:collection1] o.a.s.c.SolrCore [[collection1] ] Opening new SolrCore at [C:\Users\jenkins\workspace\Lucene-Solr-6.x-Windows\solr\build\solr-core\test\J0\temp\solr.rest.schema.TestBulkSchemaAPI_437FE9807A472571-001\tempDir-004\collection1], dataDir=[C:\Users\jenkins\workspace\Lucene-Solr-6.x-Windows\solr\build\solr-core\test\J0\temp\solr.rest.schema.TestBulkSchemaAPI_437FE9807A472571-001\tempDir-006\cores\core\data\]
[junit4] 2> 3134171 INFO (coreLoadExecutor-10163-thread-1) [ x:collection1] o.a.s.c.SolrCore JMX monitoring not detected for core: collection1
[junit4] 2> 3134171 INFO (coreLoadExecutor-10163-thread-1) [ x:collection1] o.a.s.c.SchemaCodecFactory Using default compressionMode: BEST_SPEED
[junit4] 2> 3134174 INFO (coreLoadExecutor-10163-thread-1) [ x:collection1] o.a.s.c.CachingDirectoryFactory return new directory for C:\Users\jenkins\workspace\Lucene-Solr-6.x-Windows\solr\build\solr-core\test\J0\temp\solr.rest.schema.TestBulkSchemaAPI_437FE9807A472571-001\tempDir-006\cores\core\data
[junit4] 2> 3134176 INFO (coreLoadExecutor-10163-thread-1) [ x:collection1] o.a.s.c.SolrCore New index directory detected: old=null new=C:\Users\jenkins\workspace\Lucene-Solr-6.x-Windows\solr\build\solr-core\test\J0\temp\solr.rest.schema.TestBulkSchemaAPI_437FE9807A472571-001\tempDir-006\cores\core\data\index/
[junit4] 2> 3134177 WARN (coreLoadExecutor-10163-thread-1) [ x:collection1] o.a.s.c.SolrCore [collection1] Solr index directory 'C:\Users\jenkins\workspace\Lucene-Solr-6.x-Windows\solr\build\solr-core\test\J0\temp\solr.rest.schema.TestBulkSchemaAPI_437FE9807A472571-001\tempDir-006\cores\core\data\index' doesn't exist. Creating new index...
[junit4] 2> 3134180 INFO (coreLoadExecutor-10163-thread-1) [ x:collection1] o.a.s.c.CachingDirectoryFactory return new directory for C:\Users\jenkins\workspace\Lucene-Solr-6.x-Windows\solr\build\solr-core\test\J0\temp\solr.rest.schema.TestBulkSchemaAPI_437FE9807A472571-001\tempDir-006\cores\core\data\index
[junit4] 2> 3134180 INFO (coreLoadExecutor-10163-thread-1) [ x:collection1] o.a.s.u.RandomMergePolicy RandomMergePolicy wrapping class org.apache.lucene.index.LogDocMergePolicy: [LogDocMergePolicy: minMergeSize=1000, mergeFactor=47, maxMergeSize=9223372036854775807, maxMergeSizeForForcedMerge=9223372036854775807, calibrateSizeByDeletes=false, maxMergeDocs=2147483647, maxCFSSegmentSizeMB=8.796093022207999E12, noCFSRatio=0.1432578154339459]
[junit4] 2> 3134206 INFO (coreLoadExecutor-10163-thread-1) [ x:collection1] o.a.s.c.SolrDeletionPolicy SolrDeletionPolicy.onCommit: commits: num=1
[junit4] 2> commit{dir=NRTCachingDirectory(SimpleFSDirectory@C:\Users\jenkins\workspace\Lucene-Solr-6.x-Windows\solr\build\solr-core\test\J0\temp\solr.rest.schema.TestBulkSchemaAPI_437FE9807A472571-001\tempDir-006\cores\core\data\index lockFactory=org.apache.lucene.store.SingleInstanceLockFactory@12580b4; maxCacheMB=48.0 maxMergeSizeMB=4.0),segFN=segments_1,generation=1}
[junit4] 2> 3134206 INFO (coreLoadExecutor-10163-thread-1) [ x:collection1] o.a.s.c.SolrDeletionPolicy newest commit generation = 1
[junit4] 2> 3134209 INFO (coreLoadExecutor-10163-thread-1) [ x:collection1] o.a.s.c.SolrCore no updateRequestProcessorChain defined as default, creating implicit default
[junit4] 2> 3134209 WARN (coreLoadExecutor-10163-thread-1) [ x:collection1] o.a.s.c.RequestHandlers INVALID paramSet a in requestHandler {type = requestHandler,name = /dump,class = DumpRequestHandler,args = {defaults={a=A,b=B}}}
[junit4] 2> 3134224 INFO (coreLoadExecutor-10163-thread-1) [ x:collection1] o.a.s.h.l.XMLLoader xsltCacheLifetimeSeconds=60
[junit4] 2> 3134227 INFO (coreLoadExecutor-10163-thread-1) [ x:collection1] o.a.s.h.l.XMLLoader xsltCacheLifetimeSeconds=60
[junit4] 2> 3134229 INFO (coreLoadExecutor-10163-thread-1) [ x:collection1] o.a.s.h.l.XMLLoader xsltCacheLifetimeSeconds=60
[junit4] 2> 3134231 INFO (coreLoadExecutor-10163-thread-1) [ x:collection1] o.a.s.h.l.XMLLoader xsltCacheLifetimeSeconds=60
[junit4] 2> 3134235 INFO (coreLoadExecutor-10163-thread-1) [ x:collection1] o.a.s.c.RequestHandlers Registered paths: /admin/mbeans,standard,/update/json/docs,/admin/luke,/export,/get,/admin/properties,/update/json,/admin/threads,/dump,/update/csv,/sql,/graph,/admin/segments,/admin/system,/replication,/config,/stream,/schema,/admin/plugins,/admin/logging,/admin/ping,/update,/admin/file
[junit4] 2> 3134236 INFO (coreLoadExecutor-10163-thread-1) [ x:collection1] o.a.s.c.SolrCore Using default statsCache cache: org.apache.solr.search.stats.LocalStatsCache
[junit4] 2> 3134236 INFO (coreLoadExecutor-10163-thread-1) [ x:collection1] o.a.s.u.CommitTracker Hard AutoCommit: disabled
[junit4] 2> 3134236 INFO (coreLoadExecutor-10163-thread-1) [ x:collection1] o.a.s.u.CommitTracker Soft AutoCommit: disabled
[junit4] 2> 3134237 INFO (coreLoadExecutor-10163-thread-1) [ x:collection1] o.a.s.u.RandomMergePolicy RandomMergePolicy wrapping class org.apache.lucene.index.TieredMergePolicy: [TieredMergePolicy: maxMergeAtOnce=15, maxMergeAtOnceExplicit=46, maxMergedSegmentMB=88.197265625, floorSegmentMB=1.732421875, forceMergeDeletesPctAllowed=9.831774096364292, segmentsPerTier=29.0, maxCFSSegmentSizeMB=8.796093022207999E12, noCFSRatio=0.6628539267006628
[junit4] 2> 3134238 INFO (coreLoadExecutor-10163-thread-1) [ x:collection1] o.a.s.c.SolrDeletionPolicy SolrDeletionPolicy.onInit: commits: num=1
[junit4] 2> commit{dir=NRTCachingDirectory(SimpleFSDirectory@C:\Users\jenkins\workspace\Lucene-Solr-6.x-Windows\solr\build\solr-core\test\J0\temp\solr.rest.schema.TestBulkSchemaAPI_437FE9807A472571-001\tempDir-006\cores\core\data\index lockFactory=org.apache.lucene.store.SingleInstanceLockFactory@12580b4; maxCacheMB=48.0 maxMergeSizeMB=4.0),segFN=segments_1,generation=1}
[junit4] 2> 3134238 INFO (coreLoadExecutor-10163-thread-1) [ x:collection1] o.a.s.c.SolrDeletionPolicy newest commit generation = 1
[junit4] 2> 3134238 INFO (coreLoadExecutor-10163-thread-1) [ x:collection1] o.a.s.s.SolrIndexSearcher Opening [Searcher@1ffca86[collection1] main]
[junit4] 2> 3134240 INFO (coreLoadExecutor-10163-thread-1) [ x:collection1] o.a.s.r.ManagedResourceStorage File-based storage initialized to use dir: C:\Users\jenkins\workspace\Lucene-Solr-6.x-Windows\solr\build\solr-core\test\J0\temp\solr.rest.schema.TestBulkSchemaAPI_437FE9807A472571-001\tempDir-004\collection1\conf
[junit4] 2> 3134240 INFO (coreLoadExecutor-10163-thread-1) [ x:collection1] o.a.s.r.RestManager Initializing RestManager with initArgs: {storageDir=C:\Users\jenkins\workspace\Lucene-Solr-6.x-Windows\solr\build\solr-core\test\J0\temp\solr.rest.schema.TestBulkSchemaAPI_437FE9807A472571-001\tempDir-004\collection1\conf}
[junit4] 2> 3134240 INFO (coreLoadExecutor-10163-thread-1) [ x:collection1] o.a.s.r.ManagedResourceStorage Reading _rest_managed.json using file:dir=C:\Users\jenkins\workspace\Lucene-Solr-6.x-Windows\solr\build\solr-core\test\J0\temp\solr.rest.schema.TestBulkSchemaAPI_437FE9807A472571-001\tempDir-004\collection1\conf
[junit4] 2> 3134241 INFO (coreLoadExecutor-10163-thread-1) [ x:collection1] o.a.s.r.RestManager Initializing 4 registered ManagedResources
[junit4] 2> 3134242 INFO (coreLoadExecutor-10163-thread-1) [ x:collection1] o.a.s.r.ManagedResourceStorage Reading _schema_analysis_stopwords_english.json using file:dir=C:\Users\jenkins\workspace\Lucene-Solr-6.x-Windows\solr\build\solr-core\test\J0\temp\solr.rest.schema.TestBulkSchemaAPI_437FE9807A472571-001\tempDir-004\collection1\conf
[junit4] 2> 3134243 WARN (coreLoadExecutor-10163-thread-1) [ x:collection1] o.a.s.r.ManagedResource No stored data found for /schema/analysis/stopwords/english
[junit4] 2> 3134244 INFO (coreLoadExecutor-10163-thread-1) [ x:collection1] o.a.s.r.ManagedResourceStorage Saved JSON object to path _schema_analysis_stopwords_english.json using file:dir=C:\Users\jenkins\workspace\Lucene-Solr-6.x-Windows\solr\build\solr-core\test\J0\temp\solr.rest.schema.TestBulkSchemaAPI_437FE9807A472571-001\tempDir-004\collection1\conf
[junit4] 2> 3134244 INFO (coreLoadExecutor-10163-thread-1) [ x:collection1] o.a.s.r.s.a.ManagedWordSetResource Loaded 0 words for /schema/analysis/stopwords/english
[junit4] 2> 3134244 INFO (coreLoadExecutor-10163-thread-1) [ x:collection1] o.a.s.r.ManagedResource Notified 2 observers of /schema/analysis/stopwords/english
[junit4] 2> 3134244 INFO (coreLoadExecutor-10163-thread-1) [ x:collection1] o.a.s.r.ManagedResourceStorage Reading _schema_analysis_stopwords_german.json using file:dir=C:\Users\jenkins\workspace\Lucene-Solr-6.x-Windows\solr\build\solr-core\test\J0\temp\solr.rest.schema.TestBulkSchemaAPI_437FE9807A472571-001\tempDir-004\collection1\conf
[junit4] 2> 3134246 WARN (coreLoadExecutor-10163-thread-1) [ x:collection1] o.a.s.r.ManagedResource No stored data found for /schema/analysis/stopwords/german
[junit4] 2> 3134247 INFO (coreLoadExecutor-10163-thread-1) [ x:collection1] o.a.s.r.ManagedResourceStorage Saved JSON object to path _schema_analysis_stopwords_german.json using file:dir=C:\Users\jenkins\workspace\Lucene-Solr-6.x-Windows\solr\build\solr-core\test\J0\temp\solr.rest.schema.TestBulkSchemaAPI_437FE9807A472571-001\tempDir-004\collection1\conf
[junit4] 2> 3134247 INFO (coreLoadExecutor-10163-thread-1) [ x:collection1] o.a.s.r.s.a.ManagedWordSetResource Loaded 0 words for /schema/analysis/stopwords/german
[junit4] 2> 3134247 INFO (coreLoadExecutor-10163-thread-1) [ x:collection1] o.a.s.r.ManagedResource Notified 2 observers of /schema/analysis/stopwords/german
[junit4] 2> 3134247 INFO (coreLoadExecutor-10163-thread-1) [ x:collection1] o.a.s.r.ManagedResourceStorage Reading _schema_analysis_synonyms_english.json using file:dir=C:\Users\jenkins\workspace\Lucene-Solr-6.x-Windows\solr\build\solr-core\test\J0\temp\solr.rest.schema.TestBulkSchemaAPI_437FE9807A472571-001\tempDir-004\collection1\conf
[junit4] 2> 3134249 WARN (coreLoadExecutor-10163-thread-1) [ x:collection1] o.a.s.r.ManagedResource No stored data found for /schema/analysis/synonyms/english
[junit4] 2> 3134250 INFO (coreLoadExecutor-10163-thread-1) [ x:collection1] o.a.s.r.s.a.ManagedSynonymFilterFactory Loaded 0 synonym mappings for /schema/analysis/synonyms/english
[junit4] 2> 3134250 INFO (coreLoadExecutor-10163-thread-1) [ x:collection1] o.a.s.r.ManagedResource Notified 2 observers of /schema/analysis/synonyms/english
[junit4] 2> 3134250 INFO (coreLoadExecutor-10163-thread-1) [ x:collection1] o.a.s.r.ManagedResourceStorage Reading _schema_analysis_synonyms_german.json using file:dir=C:\Users\jenkins\workspace\Lucene-Solr-6.x-Windows\solr\build\solr-core\test\J0\temp\solr.rest.schema.TestBulkSchemaAPI_437FE9807A472571-001\tempDir-004\collection1\conf
[junit4] 2> 3134254 WARN (coreLoadExecutor-10163-thread-1) [ x:collection1] o.a.s.r.ManagedResource No stored data found for /schema/analysis/synonyms/german
[junit4] 2> 3134255 INFO (coreLoadExecutor-10163-thread-1) [ x:collection1] o.a.s.r.s.a.ManagedSynonymFilterFactory Loaded 0 synonym mappings for /schema/analysis/synonyms/german
[junit4] 2> 3134255 INFO (coreLoadExecutor-10163-thread-1) [ x:collection1] o.a.s.r.ManagedResource Notified 2 observers of /schema/analysis/synonyms/german
[junit4] 2> 3134255 INFO (coreLoadExecutor-10163-thread-1) [ x:collection1] o.a.s.h.ReplicationHandler Commits will be reserved for 10000
[junit4] 2> 3134255 INFO (coreLoadExecutor-10163-thread-1) [ x:collection1] o.a.s.c.CoreContainer registering core: collection1
[junit4] 2> 3134260 INFO (OldIndexDirectoryCleanupThreadForCore-collection1) [ x:collection1] o.a.s.c.SolrCore Looking for old index directories to cleanup for core collection1 in C:\Users\jenkins\workspace\Lucene-Solr-6.x-Windows\solr\build\solr-core\test\J0\temp\solr.rest.schema.TestBulkSchemaAPI_437FE9807A472571-001\tempDir-006\cores\core\data\
[junit4] 2> 3134262 INFO (searcherExecutor-10164-thread-1-processing-x:collection1) [ x:collection1] o.a.s.c.SolrCore [collection1] Registered new searcher Searcher@1ffca86[collection1] main{ExitableDirectoryReader(UninvertingDirectoryReader())}
[junit4] 2> 3134331 INFO (TEST-TestBulkSchemaAPI.testAddFieldWithExistingCatchallDynamicField-seed#[437FE9807A472571]) [ ] o.a.s.SolrJettyTestBase Jetty Assigned Port#61025
[junit4] 2> 3134344 INFO (qtp18951308-40431) [ x:collection1] o.a.s.c.S.Request [collection1] webapp=/solr path=/schema params={wt=json} status=0 QTime=0
[junit4] 2> 3134349 INFO (qtp18951308-40432) [ x:collection1] o.a.s.c.S.Request [collection1] webapp=/solr path=/schema params={wt=json} status=0 QTime=0
[junit4] 2> 3134355 INFO (qtp18951308-40430) [ x:collection1] o.a.s.c.S.Request [collection1] webapp=/solr path=/schema params={wt=json} status=0 QTime=0
[junit4] 2> 3134361 INFO (qtp18951308-40434) [ x:collection1] o.a.s.c.S.Request [collection1] webapp=/solr path=/schema params={wt=json} status=0 QTime=0
[junit4] 2> 3134370 INFO (qtp18951308-40435) [ x:collection1] o.a.s.r.RestManager Added observer of type org.apache.solr.rest.schema.analysis.ManagedStopFilterFactory to existing ManagedResource /schema/analysis/stopwords/german
[junit4] 2> 3134370 INFO (qtp18951308-40435) [ x:collection1] o.a.s.r.ManagedResourceStorage Reading _schema_analysis_stopwords_german.json using file:dir=C:\Users\jenkins\workspace\Lucene-Solr-6.x-Windows\solr\build\solr-core\test\J0\temp\solr.rest.schema.TestBulkSchemaAPI_437FE9807A472571-001\tempDir-004\collection1\conf
[junit4] 2> 3134371 INFO (qtp18951308-40435) [ x:collection1] o.a.s.r.ManagedResourceStorage Loaded LinkedHashMap at path _schema_analysis_stopwords_german.json using file:dir=C:\Users\jenkins\workspace\Lucene-Solr-6.x-Windows\solr\build\solr-core\test\J0\temp\solr.rest.schema.TestBulkSchemaAPI_437FE9807A472571-001\tempDir-004\collection1\conf
[junit4] 2> 3134371 INFO (qtp18951308-40435) [ x:collection1] o.a.s.r.ManagedResource Loaded initArgs {ignoreCase=false} for /schema/analysis/stopwords/german
[junit4] 2> 3134371 INFO (qtp18951308-40435) [ x:collection1] o.a.s.r.s.a.ManagedWordSetResource Loaded 0 words for /schema/analysis/stopwords/german
[junit4] 2> 3134371 INFO (qtp18951308-40435) [ x:collection1] o.a.s.r.ManagedResource Notified 3 observers of /schema/analysis/stopwords/german
[junit4] 2> 3134371 INFO (qtp18951308-40435) [ x:collection1] o.a.s.r.RestManager Registered new managed resource /schema/analysis/stopwords/german
[junit4] 2> 3134371 INFO (qtp18951308-40435) [ x:collection1] o.a.s.r.RestManager Added observer of type org.apache.solr.rest.schema.analysis.ManagedSynonymFilterFactory to existing ManagedResource /schema/analysis/synonyms/german
[junit4] 2> 3134371 INFO (qtp18951308-40435) [ x:collection1] o.a.s.r.ManagedResourceStorage Reading _schema_analysis_synonyms_german.json using file:dir=C:\Users\jenkins\workspace\Lucene-Solr-6.x-Windows\solr\build\solr-core\test\J0\temp\solr.rest.schema.TestBulkSchemaAPI_437FE9807A472571-001\tempDir-004\collection1\conf
[junit4] 2> 3134371 WARN (qtp18951308-40435) [ x:collection1] o.a.s.r.ManagedResource No stored data found for /schema/analysis/synonyms/german
[junit4] 2> 3134372 INFO (qtp18951308-40435) [ x:collection1] o.a.s.r.s.a.ManagedSynonymFilterFactory Loaded 0 synonym mappings for /schema/analysis/synonyms/german
[junit4] 2> 3134372 INFO (qtp18951308-40435) [ x:collection1] o.a.s.r.ManagedResource Notified 3 observers of /schema/analysis/synonyms/german
[junit4] 2> 3134372 INFO (qtp18951308-40435) [ x:collection1] o.a.s.r.RestManager Registered new managed resource /schema/analysis/synonyms/german
[junit4] 2> 3134381 INFO (qtp18951308-40435) [ x:collection1] o.a.s.r.RestManager Added observer of type org.apache.solr.rest.schema.analysis.ManagedStopFilterFactory to existing ManagedResource /schema/analysis/stopwords/english
[junit4] 2> 3134381 INFO (qtp18951308-40435) [ x:collection1] o.a.s.r.ManagedResourceStorage Reading _schema_analysis_stopwords_english.json using file:dir=C:\Users\jenkins\workspace\Lucene-Solr-6.x-Windows\solr\build\solr-core\test\J0\temp\solr.rest.schema.TestBulkSchemaAPI_437FE9807A472571-001\tempDir-004\collection1\conf
[junit4] 2> 3134382 INFO (qtp18951308-40435) [ x:collection1] o.a.s.r.ManagedResourceStorage Loaded LinkedHashMap at path _schema_analysis_stopwords_english.json using file:dir=C:\Users\jenkins\workspace\Lucene-Solr-6.x-Windows\solr\build\solr-core\test\J0\temp\solr.rest.schema.TestBulkSchemaAPI_437FE9807A472571-001\tempDir-004\collection1\conf
[junit4] 2> 3134382 INFO (qtp18951308-40435) [ x:collection1] o.a.s.r.ManagedResource Loaded initArgs {ignoreCase=false} for /schema/analysis/stopwords/english
[junit4] 2> 3134382 INFO (qtp18951308-40435) [ x:collection1] o.a.s.r.s.a.ManagedWordSetResource Loaded 0 words for /schema/analysis/stopwords/english
[junit4] 2> 3134382 INFO (qtp18951308-40435) [ x:collection1] o.a.s.r.ManagedResource Notified 3 observers of /schema/analysis/stopwords/english
[junit4] 2> 3134382 INFO (qtp18951308-40435) [ x:collection1] o.a.s.r.RestManager Registered new managed resource /schema/analysis/stopwords/english
[junit4] 2> 3134382 INFO (qtp18951308-40435) [ x:collection1] o.a.s.r.RestManager Added observer of type org.apache.solr.rest.schema.analysis.ManagedSynonymFilterFactory to existing ManagedResource /schema/analysis/synonyms/english
[junit4] 2> 3134382 INFO (qtp18951308-40435) [ x:collection1] o.a.s.r.ManagedResourceStorage Reading _schema_analysis_synonyms_english.json using file:dir=C:\Users\jenkins\workspace\Lucene-Solr-6.x-Windows\solr\build\solr-core\test\J0\temp\solr.rest.schema.TestBulkSchemaAPI_437FE9807A472571-001\tempDir-004\collection1\conf
[junit4] 2> 3134383 WARN (qtp18951308-40435) [ x:collection1] o.a.s.r.ManagedResource No stored data found for /schema/analysis/synonyms/english
[junit4] 2> 3134383 INFO (qtp18951308-40435) [ x:collection1] o.a.s.r.s.a.ManagedSynonymFilterFactory Loaded 0 synonym mappings for /schema/analysis/synonyms/english
[junit4] 2> 3134383 INFO (qtp18951308-40435) [ x:collection1] o.a.s.r.ManagedResource Notified 3 observers of /schema/analysis/synonyms/english
[junit4] 2> 3134383 INFO (qtp18951308-40435) [ x:collection1] o.a.s.r.RestManager Registered new managed resource /schema/analysis/synonyms/english
[junit4] 2> 3134385 INFO (qtp18951308-40435) [ x:collection1] o.a.s.s.ManagedIndexSchema Upgraded to managed schema at C:\Users\jenkins\workspace\Lucene-Solr-6.x-Windows\solr\build\solr-core\test\J0\temp\solr.rest.schema.TestBulkSchemaAPI_437FE9807A472571-001\tempDir-004\collection1\conf\managed-schema
[junit4] 2> 3134387 INFO (qtp18951308-40435) [ x:collection1] o.a.s.c.S.Request [collection1] webapp=/solr path=/schema params={wt=json} status=0 QTime=22
[junit4] 2> 3134390 INFO (qtp18951308-40436) [ x:collection1] o.a.s.c.S.Request [collection1] webapp=/solr path=/schema params={wt=json} status=0 QTime=0
[junit4] 2> 3134397 INFO (qtp18951308-40429) [ x:collection1] o.a.s.r.RestManager Added observer of type org.apache.solr.rest.schema.analysis.ManagedStopFilterFactory to existing ManagedResource /schema/analysis/stopwords/german
[junit4] 2> 3134402 INFO (qtp18951308-40429) [ x:collection1] o.a.s.r.ManagedResourceStorage Reading _schema_analysis_stopwords_german.json using file:dir=C:\Users\jenkins\workspace\Lucene-Solr-6.x-Windows\solr\build\solr-core\test\J0\temp\solr.rest.schema.TestBulkSchemaAPI_437FE9807A472571-001\tempDir-004\collection1\conf
[junit4] 2> 3134403 INFO (qtp18951308-40429) [ x:collection1] o.a.s.r.ManagedResourceStorage Loaded LinkedHashMap at path _schema_analysis_stopwords_german.json using file:dir=C:\Users\jenkins\workspace\Lucene-Solr-6.x-Windows\solr\build\solr-core\test\J0\temp\solr.rest.schema.TestBulkSchemaAPI_437FE9807A472571-001\tempDir-004\collection1\conf
[junit4] 2> 3134403 INFO (qtp18951308-40429) [ x:collection1] o.a.s.r.ManagedResource Loaded initArgs {ignoreCase=false} for /schema/analysis/stopwords/german
[junit4] 2> 3134403 INFO (qtp18951308-40429) [ x:collection1] o.a.s.r.s.a.ManagedWordSetResource Loaded 0 words for /schema/analysis/stopwords/german
[junit4] 2> 3134403 INFO (qtp18951308-40429) [ x:collection1] o.a.s.r.ManagedResource Notified 4 observers of /schema/analysis/stopwords/german
[junit4] 2> 3134403 INFO (qtp18951308-40429) [ x:collection1] o.a.s.r.RestManager Registered new managed resource /schema/analysis/stopwords/german
[junit4] 2> 3134404 INFO (qtp18951308-40429) [ x:collection1] o.a.s.r.RestManager Added observer of type org.apache.solr.rest.schema.analysis.ManagedSynonymFilterFactory to existing ManagedResource /schema/analysis/synonyms/german
[junit4] 2> 3134404 INFO (qtp18951308-40429) [ x:collection1] o.a.s.r.ManagedResourceStorage Reading _schema_analysis_synonyms_german.json using file:dir=C:\Users\jenkins\workspace\Lucene-Solr-6.x-Windows\solr\build\solr-core\test\J0\temp\solr.rest.schema.TestBulkSchemaAPI_437FE9807A472571-001\tempDir-004\collection1\conf
[junit4] 2> 3134404 WARN (qtp18951308-40429) [ x:collection1] o.a.s.r.ManagedResource No stored data found for /schema/analysis/synonyms/german
[junit4] 2> 3134405 INFO (qtp18951308-40429) [ x:collection1] o.a.s.r.s.a.ManagedSynonymFilterFactory Loaded 0 synonym mappings for /schema/analysis/synonyms/german
[junit4] 2> 3134405 INFO (qtp18951308-40429) [ x:collection1] o.a.s.r.ManagedResource Notified 4 observers of /schema/analysis/synonyms/german
[junit4] 2> 3134405 INFO (qtp18951308-40429) [ x:collection1] o.a.s.r.RestManager Registered new managed resource /schema/analysis/synonyms/german
[junit4] 2> 3134421 INFO (qtp18951308-40429) [ x:collection1] o.a.s.r.RestManager Added observer of type org.apache.solr.rest.schema.analysis.ManagedStopFilterFactory to existing ManagedResource /schema/analysis/stopwords/english
[junit4] 2> 3134421 INFO (qtp18951308-40429) [ x:collection1] o.a.s.r.ManagedResourceStorage Reading _schema_analysis_stopwords_english.json using file:dir=C:\Users\jenkins\workspace\Lucene-Solr-6.x-Windows\solr\build\solr-core\test\J0\temp\solr.rest.schema.TestBulkSchemaAPI_437FE9807A472571-001\tempDir-004\collection1\conf
[junit4] 2> 3134421 INFO (qtp18951308-40429) [ x:collection1] o.a.s.r.ManagedResourceStorage Loaded LinkedHashMap at path _schema_analysis_stopwords_english.json using file:dir=C:\Users\jenkins\workspace\Lucene-Solr-6.x-Windows\solr\build\solr-core\test\J0\temp\solr.rest.schema.TestBulkSchemaAPI_437FE9807A472571-001\tempDir-004\collection1\conf
[junit4] 2> 3134422 INFO (qtp18951308-40429) [ x:collection1] o.a.s.r.ManagedResource Loaded initArgs {ignoreCase=false} for /schema/analysis/stopwords/english
[junit4] 2> 3134422 INFO (qtp18951308-40429) [ x:collection1] o.a.s.r.s.a.ManagedWordSetResource Loaded 0 words for /schema/analysis/stopwords/english
[junit4] 2> 3134422 INFO (qtp18951308-40429) [ x:collection1] o.a.s.r.ManagedResource Notified 4 observers of /schema/analysis/stopwords/english
[junit4] 2> 3134422 INFO (qtp18951308-40429) [ x:collection1] o.a.s.r.RestManager Registered new managed resource /schema/analysis/stopwords/english
[junit4] 2> 3134422 INFO (qtp18951308-40429) [ x:collection1] o.a.s.r.RestManager Added observer of type org.apache.solr.rest.schema.analysis.ManagedSynonymFilterFactory to existing ManagedResource /schema/analysis/synonyms/english
[junit4] 2> 3134422 INFO (qtp18951308-40429) [ x:collection1] o.a.s.r.ManagedResourceStorage Reading _schema_analysis_synonyms_english.json using file:dir=C:\Users\jenkins\workspace\Lucene-Solr-6.x-Windows\solr\build\solr-core\test\J0\temp\solr.rest.schema.TestBulkSchemaAPI_437FE9807A472571-001\tempDir-004\collection1\conf
[junit4] 2> 3134422 WARN (qtp18951308-40429) [ x:collection1] o.a.s.r.ManagedResource No stored data found for /schema/analysis/synonyms/english
[junit4] 2> 3134423 INFO (qtp18951308-40429) [ x:collection1] o.a.s.r.s.a.ManagedSynonymFilterFactory Loaded 0 synonym mappings for /schema/analysis/synonyms/english
[junit4] 2> 3134423 INFO (qtp18951308-40429) [ x:collection1] o.a.s.r.ManagedResource Notified 4 observers of /schema/analysis/synonyms/english
[junit4] 2> 3134423 INFO (qtp18951308-40429) [ x:collection1] o.a.s.r.RestManager Registered new managed resource /schema/analysis/synonyms/english
[junit4] 2> 3134424 INFO (qtp18951308-40429) [ x:collection1] o.a.s.s.ManagedIndexSchema Upgraded to managed schema at C:\Users\jenkins\workspace\Lucene-Solr-6.x-Windows\solr\build\solr-core\test\J0\temp\solr.rest.schema.TestBulkSchemaAPI_437FE9807A472571-001\tempDir-004\collection1\conf\managed-schema
[junit4] 2> 3134427 INFO (qtp18951308-40429) [ x:collection1] o.a.s.c.S.Request [collection1] webapp=/solr path=/schema params={wt=json} status=0 QTime=33
[junit4] 2> 3134430 INFO (qtp18951308-40431) [ x:collection1] o.a.s.c.S.Request [collection1] webapp=/solr path=/schema params={wt=json} status=0 QTime=0
[junit4] 2> 3134433 INFO (TEST-TestBulkSchemaAPI.testAddFieldWithExistingCatchallDynamicField-seed#[437FE9807A472571]) [ ] o.e.j.s.ServerConnector Stopped ServerConnector@1ce5288{HTTP/1.1,[http/1.1]}{127.0.0.1:0}
[junit4] 2> 3134434 INFO (TEST-TestBulkSchemaAPI.testAddFieldWithExistingCatchallDynamicField-seed#[437FE9807A472571]) [ ] o.a.s.c.CoreContainer Shutting down CoreContainer instance=7042419
[junit4] 2> 3134438 INFO (coreCloseExecutor-10168-thread-1) [ x:collection1] o.a.s.c.SolrCore [collection1] CLOSING SolrCore org.apache.solr.core.SolrCore@1b68cf5
[junit4] 2> 3134438 INFO (coreCloseExecutor-10168-thread-1) [ x:collection1] o.a.s.u.DirectUpdateHandler2 closing DirectUpdateHandler2{commits=0,autocommits=0,soft autocommits=0,optimizes=0,rollbacks=0,expungeDeletes=0,docsPending=0,adds=0,deletesById=0,deletesByQuery=0,errors=0,cumulative_adds=0,cumulative_deletesById=0,cumulative_deletesByQuery=0,cumulative_errors=0}
[junit4] 2> 3134438 INFO (coreCloseExecutor-10168-thread-1) [ x:collection1] o.a.s.u.SolrCoreState Closing SolrCoreState
[junit4] 2> 3134439 INFO (coreCloseExecutor-10168-thread-1) [ x:collection1] o.a.s.u.DefaultSolrCoreState SolrCoreState ref count has reached 0 - closing IndexWriter
[junit4] 2> 3134439 INFO (coreCloseExecutor-10168-thread-1) [ x:collection1] o.a.s.u.DefaultSolrCoreState closing IndexWriter with IndexWriterCloser
[junit4] 2> 3134440 INFO (coreCloseExecutor-10168-thread-1) [ x:collection1] o.a.s.c.SolrCore [collection1] Closing main searcher on request.
[junit4] 2> 3134440 INFO (coreCloseExecutor-10168-thread-1) [ x:collection1] o.a.s.c.CachingDirectoryFactory Closing NRTCachingDirectoryFactory - 2 directories currently being tracked
[junit4] 2> 3134440 INFO (coreCloseExecutor-10168-thread-1) [ x:collection1] o.a.s.c.CachingDirectoryFactory looking to close C:\Users\jenkins\workspace\Lucene-Solr-6.x-Windows\solr\build\solr-core\test\J0\temp\solr.rest.schema.TestBulkSchemaAPI_437FE9807A472571-001\tempDir-006\cores\core\data\index [CachedDir<<refCount=0;path=C:\Users\jenkins\workspace\Lucene-Solr-6.x-Windows\solr\build\solr-core\test\J0\temp\solr.rest.schema.TestBulkSchemaAPI_437FE9807A472571-001\tempDir-006\cores\core\data\index;done=false>>]
[junit4] 2> 3134441 INFO (coreCloseExecutor-10168-thread-1) [ x:collection1] o.a.s.c.CachingDirectoryFactory Closing directory, CoreContainer#isShutdown=true
[junit4] 2> 3134441 INFO (coreCloseExecutor-10168-thread-1) [ x:collection1] o.a.s.c.CachingDirectoryFactory Closing directory: C:\Users\jenkins\workspace\Lucene-Solr-6.x-Windows\solr\build\solr-core\test\J0\temp\solr.rest.schema.TestBulkSchemaAPI_437FE9807A472571-001\tempDir-006\cores\core\data\index
[junit4] 2> 3134441 INFO (coreCloseExecutor-10168-thread-1) [ x:collection1] o.a.s.c.CachingDirectoryFactory looking to close C:\Users\jenkins\workspace\Lucene-Solr-6.x-Windows\solr\build\solr-core\test\J0\temp\solr.rest.schema.TestBulkSchemaAPI_437FE9807A472571-001\tempDir-006\cores\core\data [CachedDir<<refCount=0;path=C:\Users\jenkins\workspace\Lucene-Solr-6.x-Windows\solr\build\solr-core\test\J0\temp\solr.rest.schema.TestBulkSchemaAPI_437FE9807A472571-001\tempDir-006\cores\core\data;done=false>>]
[junit4] 2> 3134442 INFO (coreCloseExecutor-10168-thread-1) [ x:collection1] o.a.s.c.CachingDirectoryFactory Closing directory, CoreContainer#isShutdown=true
[junit4] 2> 3134442 INFO (coreCloseExecutor-10168-thread-1) [ x:collection1] o.a.s.c.CachingDirectoryFactory Closing directory: C:\Users\jenkins\workspace\Lucene-Solr-6.x-Windows\solr\build\solr-core\test\J0\temp\solr.rest.schema.TestBulkSchemaAPI_437FE9807A472571-001\tempDir-006\cores\core\data
[junit4] 2> 3134442 INFO (TEST-TestBulkSchemaAPI.testAddFieldWithExistingCatchallDynamicField-seed#[437FE9807A472571]) [ ] o.e.j.s.h.ContextHandler Stopped o.e.j.s.ServletContextHandler@128ff1{/solr,null,UNAVAILABLE}
[junit4] 2> 3134448 INFO (TEST-TestBulkSchemaAPI.testAddFieldWithExistingCatchallDynamicField-seed#[437FE9807A472571]) [ ] o.a.s.SolrTestCaseJ4 ###Ending testAddFieldWithExistingCatchallDynamicField
[junit4] 2> 3134452 INFO (TEST-TestBulkSchemaAPI.testMultipleAddFieldWithErrors-seed#[437FE9807A472571]) [ ] o.a.s.SolrTestCaseJ4 ###Starting testMultipleAddFieldWithErrors
[junit4] 2> 3135299 INFO (TEST-TestBulkSchemaAPI.testMultipleAddFieldWithErrors-seed#[437FE9807A472571]) [ ] o.a.s.SolrTestCaseJ4 ####initCore
[junit4] 2> 3135299 INFO (TEST-TestBulkSchemaAPI.testMultipleAddFieldWithErrors-seed#[437FE9807A472571]) [ ] o.a.s.SolrTestCaseJ4 ####initCore end
[junit4] 2> 3135300 INFO (TEST-TestBulkSchemaAPI.testMultipleAddFieldWithErrors-seed#[437FE9807A472571]) [ ] o.a.s.SolrTestCaseJ4 Writing core.properties file to C:\Users\jenkins\workspace\Lucene-Solr-6.x-Windows\solr\build\solr-core\test\J0\temp\solr.rest.schema.TestBulkSchemaAPI_437FE9807A472571-001\tempDir-009\cores\core
[junit4] 2> 3135300 INFO (TEST-TestBulkSchemaAPI.testMultipleAddFieldWithErrors-seed#[437FE9807A472571]) [ ] o.e.j.s.Server jetty-9.3.8.v20160314
[junit4] 2> 3135320 INFO (TEST-TestBulkSchemaAPI.testMultipleAddFieldWithErrors-seed#[437FE9807A472571]) [ ] o.e.j.s.h.ContextHandler Started o.e.j.s.ServletContextHandler@1d17c5c{/solr,null,AVAILABLE}
[junit4] 2> 3135322 INFO (TEST-TestBulkSchemaAPI.testMultipleAddFieldWithErrors-seed#[437FE9807A472571]) [ ] o.e.j.s.ServerConnector Started ServerConnector@5551b9{HTTP/1.1,[http/1.1]}{127.0.0.1:61029}
[junit4] 2> 3135322 INFO (TEST-TestBulkSchemaAPI.testMultipleAddFieldWithErrors-seed#[437FE9807A472571]) [ ] o.e.j.s.Server Started @3141707ms
[junit4] 2> 3135322 INFO (TEST-TestBulkSchemaAPI.testMultipleAddFieldWithErrors-seed#[437FE9807A472571]) [ ] o.a.s.c.s.e.JettySolrRunner Jetty properties: {hostContext=/solr, hostPort=61029, configSetBaseDir=C:\Users\jenkins\workspace\Lucene-Solr-6.x-Windows\solr\build\solr-core\test\J0\temp\solr.rest.schema.TestBulkSchemaAPI_437FE9807A472571-001\tempDir-007, coreRootDirectory=C:\Users\jenkins\workspace\Lucene-Solr-6.x-Windows\solr\build\solr-core\test\J0\temp\solr.rest.schema.TestBulkSchemaAPI_437FE9807A472571-001\tempDir-009\cores}
[junit4] 2> 3135322 INFO (TEST-TestBulkSchemaAPI.testMultipleAddFieldWithErrors-seed#[437FE9807A472571]) [ ] o.a.s.s.SolrDispatchFilter SolrDispatchFilter.init(): sun.misc.Launcher$AppClassLoader@1d16e93
[junit4] 2> 3135322 INFO (TEST-TestBulkSchemaAPI.testMultipleAddFieldWithErrors-seed#[437FE9807A472571]) [ ] o.a.s.c.SolrResourceLoader new SolrResourceLoader for directory: 'C:\Users\jenkins\workspace\Lucene-Solr-6.x-Windows\solr\build\solr-core\test\J0\temp\solr.rest.schema.TestBulkSchemaAPI_437FE9807A472571-001\tempDir-007'
[junit4] 2> 3135323 INFO (TEST-TestBulkSchemaAPI.testMultipleAddFieldWithErrors-seed#[437FE9807A472571]) [ ] o.a.s.c.SolrResourceLoader JNDI not configured for solr (NoInitialContextEx)
[junit4] 2> 3135323 INFO (TEST-TestBulkSchemaAPI.testMultipleAddFieldWithErrors-seed#[437FE9807A472571]) [ ] o.a.s.c.SolrResourceLoader using system property solr.solr.home: C:\Users\jenkins\workspace\Lucene-Solr-6.x-Windows\solr\build\solr-core\test\J0\temp\solr.rest.schema.TestBulkSchemaAPI_437FE9807A472571-001\tempDir-007
[junit4] 2> 3135324 INFO (TEST-TestBulkSchemaAPI.testMultipleAddFieldWithErrors-seed#[437FE9807A472571]) [ ] o.a.s.c.SolrXmlConfig Loading container configuration from C:\Users\jenkins\workspace\Lucene-
[...truncated too long message...]
oreCloseExecutor-10216-thread-1) [ x:collection1] o.a.s.c.CachingDirectoryFactory Closing directory, CoreContainer#isShutdown=true
[junit4] 2> 3141199 INFO (coreCloseExecutor-10216-thread-1) [ x:collection1] o.a.s.c.CachingDirectoryFactory Closing directory: C:\Users\jenkins\workspace\Lucene-Solr-6.x-Windows\solr\build\solr-core\test\J0\temp\solr.rest.schema.TestBulkSchemaAPI_437FE9807A472571-001\tempDir-018\cores\core\data\index
[junit4] 2> 3141199 INFO (coreCloseExecutor-10216-thread-1) [ x:collection1] o.a.s.c.CachingDirectoryFactory looking to close C:\Users\jenkins\workspace\Lucene-Solr-6.x-Windows\solr\build\solr-core\test\J0\temp\solr.rest.schema.TestBulkSchemaAPI_437FE9807A472571-001\tempDir-018\cores\core\data [CachedDir<<refCount=0;path=C:\Users\jenkins\workspace\Lucene-Solr-6.x-Windows\solr\build\solr-core\test\J0\temp\solr.rest.schema.TestBulkSchemaAPI_437FE9807A472571-001\tempDir-018\cores\core\data;done=false>>]
[junit4] 2> 3141200 INFO (coreCloseExecutor-10216-thread-1) [ x:collection1] o.a.s.c.CachingDirectoryFactory Closing directory, CoreContainer#isShutdown=true
[junit4] 2> 3141200 INFO (coreCloseExecutor-10216-thread-1) [ x:collection1] o.a.s.c.CachingDirectoryFactory Closing directory: C:\Users\jenkins\workspace\Lucene-Solr-6.x-Windows\solr\build\solr-core\test\J0\temp\solr.rest.schema.TestBulkSchemaAPI_437FE9807A472571-001\tempDir-018\cores\core\data
[junit4] 2> 3141200 INFO (TEST-TestBulkSchemaAPI.testAnalyzerClass-seed#[437FE9807A472571]) [ ] o.e.j.s.h.ContextHandler Stopped o.e.j.s.ServletContextHandler@1268a56{/solr,null,UNAVAILABLE}
[junit4] 2> 3141207 INFO (TEST-TestBulkSchemaAPI.testAnalyzerClass-seed#[437FE9807A472571]) [ ] o.a.s.SolrTestCaseJ4 ###Ending testAnalyzerClass
[junit4] 2> 3141208 INFO (SUITE-TestBulkSchemaAPI-seed#[437FE9807A472571]-worker) [ ] o.a.s.SolrTestCaseJ4 ###deleteCore
[junit4] 2> NOTE: test params are: codec=Asserting(Lucene62): {}, docValues:{}, maxPointsInLeafNode=742, maxMBSortInHeap=5.872816799001893, sim=RandomSimilarity(queryNorm=false,coord=crazy): {}, locale=ms-MY, timezone=Indian/Cocos
[junit4] 2> NOTE: Windows 10 10.0 x86/Oracle Corporation 1.8.0_92 (32-bit)/cpus=3,threads=1,free=229559592,total=421199872
[junit4] 2> NOTE: All tests run in this JVM: [TestCollapseQParserPlugin, TestStressLucene, DistribCursorPagingTest, TestConfigReload, HighlighterTest, HdfsRecoverLeaseTest, SOLR749Test, TestReplicationHandler, MigrateRouteKeyTest, TestGroupingSearch, TestMergePolicyConfig, ZkCLITest, TestShardHandlerFactory, PrimitiveFieldTypeTest, TestJsonRequest, TestSolrConfigHandlerConcurrent, SolrCoreTest, TestCoreContainer, TestCryptoKeys, TestLFUCache, TestJmxIntegration, TestScoreJoinQPNoScore, TestReqParamsAPI, TestFastLRUCache, ChaosMonkeyNothingIsSafeTest, TriLevelCompositeIdRoutingTest, TestGeoJSONResponseWriter, CloudExitableDirectoryReaderTest, LeaderElectionTest, BlockDirectoryTest, DistributedQueryComponentCustomSortTest, TestCollationFieldDocValues, ZkControllerTest, DOMUtilTest, ShardRoutingTest, TestLMDirichletSimilarityFactory, RegexBoostProcessorTest, DistributedQueryElevationComponentTest, TestSolrCloudWithKerberosAlt, TestTolerantUpdateProcessorRandomCloud, TestAnalyzedSuggestions, TestHighlightDedupGrouping, TestConfigSetsAPIExclusivity, TestFilteredDocIdSet, StressHdfsTest, UpdateParamsTest, XsltUpdateRequestHandlerTest, SpatialFilterTest, TestSortByMinMaxFunction, TestCloudInspectUtil, TestInfoStreamLogging, RulesTest, PreAnalyzedFieldTest, TestRawResponseWriter, TestDistribIDF, TestFieldCacheSort, IndexBasedSpellCheckerTest, TestQueryWrapperFilter, TestDefaultSearchFieldResource, TestRuleBasedAuthorizationPlugin, DistributedSuggestComponentTest, TestFunctionQuery, TestAddFieldRealTimeGet, ScriptEngineTest, TestHashQParserPlugin, DocExpirationUpdateProcessorFactoryTest, AddSchemaFieldsUpdateProcessorFactoryTest, AsyncMigrateRouteKeyTest, BadComponentTest, TestElisionMultitermQuery, TestRandomDVFaceting, TestSolrFieldCacheMBean, DirectUpdateHandlerTest, QueryElevationComponentTest, TestSchemaVersionResource, TestSolrDynamicMBean, SolrTestCaseJ4Test, TestObjectReleaseTracker, TestChildDocTransformer, DocValuesTest, DocValuesMultiTest, TestSchemaResource, TimeZoneUtilsTest, RollingRestartTest, TestRequestStatusCollectionAPI, HLLUtilTest, SimpleMLTQParserTest, TestSubQueryTransformerCrossCore, TestDFRSimilarityFactory, TestExtendedDismaxParser, TestSQLHandler, CursorPagingTest, TestXIncludeConfig, LeaderInitiatedRecoveryOnCommitTest, TestDistributedSearch, TestSort, DirectoryFactoryTest, IndexSchemaTest, TestHdfsUpdateLog, TestSearchPerf, TestLeaderElectionZkExpiry, DocumentBuilderTest, TestLockTree, TestUniqueKeyFieldResource, TestHighFrequencyDictionaryFactory, ClusterStateUpdateTest, TestSolrDeletionPolicy1, TestPartialUpdateDeduplication, TestNoOpRegenerator, TestDocumentBuilder, TestPostingsSolrHighlighter, HighlighterMaxOffsetTest, TestMacros, DeleteLastCustomShardedReplicaTest, SystemInfoHandlerTest, TestPerFieldSimilarityClassic, TestMiniSolrCloudClusterSSL, SaslZkACLProviderTest, TestReplicaProperties, AnalyticsMergeStrategyTest, TestFieldCacheReopen, HdfsChaosMonkeyNothingIsSafeTest, TestConfigSetProperties, TestDynamicFieldResource, DistributedSpellCheckComponentTest, TestXmlQParser, TestFieldCacheVsDocValues, ResponseHeaderTest, HdfsDirectoryFactoryTest, RequiredFieldsTest, TestRemoteStreaming, TestBulkSchemaConcurrent, PingRequestHandlerTest, TestLazyCores, TestCloudBackupRestore, UnloadDistributedZkTest, TestManagedSynonymFilterFactory, MoreLikeThisHandlerTest, SharedFSAutoReplicaFailoverTest, TestConfig, TestCustomSort, DirectSolrSpellCheckerTest, UUIDFieldTest, SuggesterFSTTest, TermsComponentTest, CollectionStateFormat2Test, CollectionsAPIAsyncDistributedZkTest, ConcurrentDeleteAndCreateCollectionTest, ConfigSetsAPITest, ConnectionManagerTest, CustomCollectionTest, DeleteReplicaTest, DistributedQueueTest, DistributedVersionInfoTest, LeaderInitiatedRecoveryOnShardRestartTest, MultiThreadedOCPTest, OutOfBoxZkACLAndCredentialsProvidersTest, OverseerCollectionConfigSetProcessorTest, OverseerStatusTest, RecoveryAfterSoftCommitTest, ReplicationFactorTest, RestartWhileUpdatingTest, SSLMigrationTest, ShardSplitTest, TestConfigSetsAPIZkFailure, TestDownShardTolerantSearch, TestMiniSolrCloudCluster, TestRebalanceLeaders, TestStressLiveNodes, QueryResultKeyTest, TestConfigOverlay, TestConfigSets, TestDynamicLoading, CoreAdminCreateDiscoverTest, CoreAdminRequestStatusTest, CoreMergeIndexesAdminHandlerTest, InfoHandlerTest, SecurityConfHandlerTest, SegmentsInfoRequestHandlerTest, DistributedExpandComponentTest, DistributedFacetPivotLargeTest, DistributedFacetPivotLongTailTest, DistributedFacetPivotSmallAdvancedTest, DistributedFacetPivotWhiteBoxTest, FacetPivotSmallTest, SpatialHeatmapFacetsTest, TestExpandComponent, TestPivotHelperCode, TestTrackingShardHandlerFactory, JavabinLoaderTest, WrapperMergePolicyFactoryTest, CheckHdfsIndexTest, SmileWriterTest, TestIntervalFaceting, TestCustomDocTransformer, TestGraphMLResponseWriter, TestSolrQueryResponse, TestSubQueryTransformer, TestManagedResource, TestRestManager, TestBulkSchemaAPI]
[junit4] 2> NOTE: reproduce with: ant test -Dtestcase=TestBulkSchemaAPI -Dtests.seed=437FE9807A472571 -Dtests.slow=true -Dtests.locale=ms-MY -Dtests.timezone=Indian/Cocos -Dtests.asserts=true -Dtests.file.encoding=UTF-8
[junit4] ERROR 0.00s J0 | TestBulkSchemaAPI (suite) <<<
[junit4] > Throwable #1: java.io.IOException: Could not remove the following files (in the order of attempts):
[junit4] > C:\Users\jenkins\workspace\Lucene-Solr-6.x-Windows\solr\build\solr-core\test\J0\temp\solr.rest.schema.TestBulkSchemaAPI_437FE9807A472571-001\tempDir-016\collection1: java.nio.file.DirectoryNotEmptyException: C:\Users\jenkins\workspace\Lucene-Solr-6.x-Windows\solr\build\solr-core\test\J0\temp\solr.rest.schema.TestBulkSchemaAPI_437FE9807A472571-001\tempDir-016\collection1
[junit4] > C:\Users\jenkins\workspace\Lucene-Solr-6.x-Windows\solr\build\solr-core\test\J0\temp\solr.rest.schema.TestBulkSchemaAPI_437FE9807A472571-001\tempDir-016: java.nio.file.DirectoryNotEmptyException: C:\Users\jenkins\workspace\Lucene-Solr-6.x-Windows\solr\build\solr-core\test\J0\temp\solr.rest.schema.TestBulkSchemaAPI_437FE9807A472571-001\tempDir-016
[junit4] > at __randomizedtesting.SeedInfo.seed([437FE9807A472571]:0)
[junit4] > at org.apache.lucene.util.IOUtils.rm(IOUtils.java:323)
[junit4] > at java.lang.Thread.run(Thread.java:745)
[junit4] Completed [542/615 (1!)] on J0 in 11.25s, 6 tests, 1 error <<< FAILURES!
[...truncated 267 lines...]
BUILD FAILED
C:\Users\jenkins\workspace\Lucene-Solr-6.x-Windows\build.xml:740: The following error occurred while executing this line:
C:\Users\jenkins\workspace\Lucene-Solr-6.x-Windows\build.xml:684: The following error occurred while executing this line:
C:\Users\jenkins\workspace\Lucene-Solr-6.x-Windows\build.xml:59: The following error occurred while executing this line:
C:\Users\jenkins\workspace\Lucene-Solr-6.x-Windows\solr\build.xml:233: The following error occurred while executing this line:
C:\Users\jenkins\workspace\Lucene-Solr-6.x-Windows\solr\common-build.xml:531: The following error occurred while executing this line:
C:\Users\jenkins\workspace\Lucene-Solr-6.x-Windows\lucene\common-build.xml:1427: The following error occurred while executing this line:
C:\Users\jenkins\workspace\Lucene-Solr-6.x-Windows\lucene\common-build.xml:984: There were test failures: 615 suites (10 ignored), 2591 tests, 1 suite-level error, 126 ignored (82 assumptions) [seed: 437FE9807A472571]
Total time: 82 minutes 46 seconds
Build step 'Invoke Ant' marked build as failure
Archiving artifacts
[WARNINGS] Skipping publisher since build result is FAILURE
Recording test results
Email was triggered for: Failure - Any
Sending email for trigger: Failure - Any
[JENKINS] Lucene-Solr-6.x-Windows (32bit/jdk1.8.0_92) - Build # 259
- Still Failing!
Posted by Policeman Jenkins Server <je...@thetaphi.de>.
Build: http://jenkins.thetaphi.de/job/Lucene-Solr-6.x-Windows/259/
Java: 32bit/jdk1.8.0_92 -client -XX:+UseSerialGC
2 tests failed.
FAILED: junit.framework.TestSuite.org.apache.solr.schema.TestManagedSchemaAPI
Error Message:
ObjectTracker found 8 object(s) that were not released!!! [MockDirectoryWrapper, TransactionLog, TransactionLog, MockDirectoryWrapper, MockDirectoryWrapper, MDCAwareThreadPoolExecutor, MDCAwareThreadPoolExecutor, MockDirectoryWrapper]
Stack Trace:
java.lang.AssertionError: ObjectTracker found 8 object(s) that were not released!!! [MockDirectoryWrapper, TransactionLog, TransactionLog, MockDirectoryWrapper, MockDirectoryWrapper, MDCAwareThreadPoolExecutor, MDCAwareThreadPoolExecutor, MockDirectoryWrapper]
at __randomizedtesting.SeedInfo.seed([E09596BB55A2C286]:0)
at org.junit.Assert.fail(Assert.java:93)
at org.junit.Assert.assertTrue(Assert.java:43)
at org.junit.Assert.assertNull(Assert.java:551)
at org.apache.solr.SolrTestCaseJ4.teardownTestCases(SolrTestCaseJ4.java:257)
at sun.reflect.GeneratedMethodAccessor25.invoke(Unknown Source)
at sun.reflect.DelegatingMethodAccessorImpl.invoke(DelegatingMethodAccessorImpl.java:43)
at java.lang.reflect.Method.invoke(Method.java:498)
at com.carrotsearch.randomizedtesting.RandomizedRunner.invoke(RandomizedRunner.java:1764)
at com.carrotsearch.randomizedtesting.RandomizedRunner$7.evaluate(RandomizedRunner.java:834)
at com.carrotsearch.randomizedtesting.rules.StatementAdapter.evaluate(StatementAdapter.java:36)
at com.carrotsearch.randomizedtesting.rules.SystemPropertiesRestoreRule$1.evaluate(SystemPropertiesRestoreRule.java:57)
at org.apache.lucene.util.AbstractBeforeAfterRule$1.evaluate(AbstractBeforeAfterRule.java:45)
at com.carrotsearch.randomizedtesting.rules.StatementAdapter.evaluate(StatementAdapter.java:36)
at org.apache.lucene.util.TestRuleStoreClassName$1.evaluate(TestRuleStoreClassName.java:41)
at com.carrotsearch.randomizedtesting.rules.NoShadowingOrOverridesOnMethodsRule$1.evaluate(NoShadowingOrOverridesOnMethodsRule.java:40)
at com.carrotsearch.randomizedtesting.rules.NoShadowingOrOverridesOnMethodsRule$1.evaluate(NoShadowingOrOverridesOnMethodsRule.java:40)
at com.carrotsearch.randomizedtesting.rules.StatementAdapter.evaluate(StatementAdapter.java:36)
at com.carrotsearch.randomizedtesting.rules.StatementAdapter.evaluate(StatementAdapter.java:36)
at com.carrotsearch.randomizedtesting.rules.StatementAdapter.evaluate(StatementAdapter.java:36)
at org.apache.lucene.util.TestRuleAssertionsRequired$1.evaluate(TestRuleAssertionsRequired.java:53)
at org.apache.lucene.util.TestRuleMarkFailure$1.evaluate(TestRuleMarkFailure.java:47)
at org.apache.lucene.util.TestRuleIgnoreAfterMaxFailures$1.evaluate(TestRuleIgnoreAfterMaxFailures.java:64)
at org.apache.lucene.util.TestRuleIgnoreTestSuites$1.evaluate(TestRuleIgnoreTestSuites.java:54)
at com.carrotsearch.randomizedtesting.rules.StatementAdapter.evaluate(StatementAdapter.java:36)
at com.carrotsearch.randomizedtesting.ThreadLeakControl$StatementRunner.run(ThreadLeakControl.java:367)
at java.lang.Thread.run(Thread.java:745)
FAILED: junit.framework.TestSuite.org.apache.solr.schema.TestManagedSchemaAPI
Error Message:
Could not remove the following files (in the order of attempts): C:\Users\jenkins\workspace\Lucene-Solr-6.x-Windows\solr\build\solr-core\test\J1\temp\solr.schema.TestManagedSchemaAPI_E09596BB55A2C286-001\tempDir-001\node2\testschemaapi_shard1_replica2\data\tlog\tlog.0000000000000000000: java.nio.file.FileSystemException: C:\Users\jenkins\workspace\Lucene-Solr-6.x-Windows\solr\build\solr-core\test\J1\temp\solr.schema.TestManagedSchemaAPI_E09596BB55A2C286-001\tempDir-001\node2\testschemaapi_shard1_replica2\data\tlog\tlog.0000000000000000000: The process cannot access the file because it is being used by another process. C:\Users\jenkins\workspace\Lucene-Solr-6.x-Windows\solr\build\solr-core\test\J1\temp\solr.schema.TestManagedSchemaAPI_E09596BB55A2C286-001\tempDir-001\node2\testschemaapi_shard1_replica2\data\tlog: java.nio.file.DirectoryNotEmptyException: C:\Users\jenkins\workspace\Lucene-Solr-6.x-Windows\solr\build\solr-core\test\J1\temp\solr.schema.TestManagedSchemaAPI_E09596BB55A2C286-001\tempDir-001\node2\testschemaapi_shard1_replica2\data\tlog C:\Users\jenkins\workspace\Lucene-Solr-6.x-Windows\solr\build\solr-core\test\J1\temp\solr.schema.TestManagedSchemaAPI_E09596BB55A2C286-001\tempDir-001\node2\testschemaapi_shard1_replica2\data: java.nio.file.DirectoryNotEmptyException: C:\Users\jenkins\workspace\Lucene-Solr-6.x-Windows\solr\build\solr-core\test\J1\temp\solr.schema.TestManagedSchemaAPI_E09596BB55A2C286-001\tempDir-001\node2\testschemaapi_shard1_replica2\data C:\Users\jenkins\workspace\Lucene-Solr-6.x-Windows\solr\build\solr-core\test\J1\temp\solr.schema.TestManagedSchemaAPI_E09596BB55A2C286-001\tempDir-001\node2\testschemaapi_shard1_replica2: java.nio.file.DirectoryNotEmptyException: C:\Users\jenkins\workspace\Lucene-Solr-6.x-Windows\solr\build\solr-core\test\J1\temp\solr.schema.TestManagedSchemaAPI_E09596BB55A2C286-001\tempDir-001\node2\testschemaapi_shard1_replica2 C:\Users\jenkins\workspace\Lucene-Solr-6.x-Windows\solr\build\solr-core\test\J1\temp\solr.schema.TestManagedSchemaAPI_E09596BB55A2C286-001\tempDir-001\node2: java.nio.file.DirectoryNotEmptyException: C:\Users\jenkins\workspace\Lucene-Solr-6.x-Windows\solr\build\solr-core\test\J1\temp\solr.schema.TestManagedSchemaAPI_E09596BB55A2C286-001\tempDir-001\node2 C:\Users\jenkins\workspace\Lucene-Solr-6.x-Windows\solr\build\solr-core\test\J1\temp\solr.schema.TestManagedSchemaAPI_E09596BB55A2C286-001\tempDir-001\node1\testschemaapi_shard1_replica1\data\tlog\tlog.0000000000000000001: java.nio.file.FileSystemException: C:\Users\jenkins\workspace\Lucene-Solr-6.x-Windows\solr\build\solr-core\test\J1\temp\solr.schema.TestManagedSchemaAPI_E09596BB55A2C286-001\tempDir-001\node1\testschemaapi_shard1_replica1\data\tlog\tlog.0000000000000000001: The process cannot access the file because it is being used by another process. C:\Users\jenkins\workspace\Lucene-Solr-6.x-Windows\solr\build\solr-core\test\J1\temp\solr.schema.TestManagedSchemaAPI_E09596BB55A2C286-001\tempDir-001\node1\testschemaapi_shard1_replica1\data\tlog: java.nio.file.DirectoryNotEmptyException: C:\Users\jenkins\workspace\Lucene-Solr-6.x-Windows\solr\build\solr-core\test\J1\temp\solr.schema.TestManagedSchemaAPI_E09596BB55A2C286-001\tempDir-001\node1\testschemaapi_shard1_replica1\data\tlog C:\Users\jenkins\workspace\Lucene-Solr-6.x-Windows\solr\build\solr-core\test\J1\temp\solr.schema.TestManagedSchemaAPI_E09596BB55A2C286-001\tempDir-001\node1\testschemaapi_shard1_replica1\data: java.nio.file.DirectoryNotEmptyException: C:\Users\jenkins\workspace\Lucene-Solr-6.x-Windows\solr\build\solr-core\test\J1\temp\solr.schema.TestManagedSchemaAPI_E09596BB55A2C286-001\tempDir-001\node1\testschemaapi_shard1_replica1\data C:\Users\jenkins\workspace\Lucene-Solr-6.x-Windows\solr\build\solr-core\test\J1\temp\solr.schema.TestManagedSchemaAPI_E09596BB55A2C286-001\tempDir-001\node1\testschemaapi_shard1_replica1: java.nio.file.DirectoryNotEmptyException: C:\Users\jenkins\workspace\Lucene-Solr-6.x-Windows\solr\build\solr-core\test\J1\temp\solr.schema.TestManagedSchemaAPI_E09596BB55A2C286-001\tempDir-001\node1\testschemaapi_shard1_replica1 C:\Users\jenkins\workspace\Lucene-Solr-6.x-Windows\solr\build\solr-core\test\J1\temp\solr.schema.TestManagedSchemaAPI_E09596BB55A2C286-001\tempDir-001\node1: java.nio.file.DirectoryNotEmptyException: C:\Users\jenkins\workspace\Lucene-Solr-6.x-Windows\solr\build\solr-core\test\J1\temp\solr.schema.TestManagedSchemaAPI_E09596BB55A2C286-001\tempDir-001\node1 C:\Users\jenkins\workspace\Lucene-Solr-6.x-Windows\solr\build\solr-core\test\J1\temp\solr.schema.TestManagedSchemaAPI_E09596BB55A2C286-001\tempDir-001: java.nio.file.DirectoryNotEmptyException: C:\Users\jenkins\workspace\Lucene-Solr-6.x-Windows\solr\build\solr-core\test\J1\temp\solr.schema.TestManagedSchemaAPI_E09596BB55A2C286-001\tempDir-001 C:\Users\jenkins\workspace\Lucene-Solr-6.x-Windows\solr\build\solr-core\test\J1\temp\solr.schema.TestManagedSchemaAPI_E09596BB55A2C286-001: java.nio.file.DirectoryNotEmptyException: C:\Users\jenkins\workspace\Lucene-Solr-6.x-Windows\solr\build\solr-core\test\J1\temp\solr.schema.TestManagedSchemaAPI_E09596BB55A2C286-001
Stack Trace:
java.io.IOException: Could not remove the following files (in the order of attempts):
C:\Users\jenkins\workspace\Lucene-Solr-6.x-Windows\solr\build\solr-core\test\J1\temp\solr.schema.TestManagedSchemaAPI_E09596BB55A2C286-001\tempDir-001\node2\testschemaapi_shard1_replica2\data\tlog\tlog.0000000000000000000: java.nio.file.FileSystemException: C:\Users\jenkins\workspace\Lucene-Solr-6.x-Windows\solr\build\solr-core\test\J1\temp\solr.schema.TestManagedSchemaAPI_E09596BB55A2C286-001\tempDir-001\node2\testschemaapi_shard1_replica2\data\tlog\tlog.0000000000000000000: The process cannot access the file because it is being used by another process.
C:\Users\jenkins\workspace\Lucene-Solr-6.x-Windows\solr\build\solr-core\test\J1\temp\solr.schema.TestManagedSchemaAPI_E09596BB55A2C286-001\tempDir-001\node2\testschemaapi_shard1_replica2\data\tlog: java.nio.file.DirectoryNotEmptyException: C:\Users\jenkins\workspace\Lucene-Solr-6.x-Windows\solr\build\solr-core\test\J1\temp\solr.schema.TestManagedSchemaAPI_E09596BB55A2C286-001\tempDir-001\node2\testschemaapi_shard1_replica2\data\tlog
C:\Users\jenkins\workspace\Lucene-Solr-6.x-Windows\solr\build\solr-core\test\J1\temp\solr.schema.TestManagedSchemaAPI_E09596BB55A2C286-001\tempDir-001\node2\testschemaapi_shard1_replica2\data: java.nio.file.DirectoryNotEmptyException: C:\Users\jenkins\workspace\Lucene-Solr-6.x-Windows\solr\build\solr-core\test\J1\temp\solr.schema.TestManagedSchemaAPI_E09596BB55A2C286-001\tempDir-001\node2\testschemaapi_shard1_replica2\data
C:\Users\jenkins\workspace\Lucene-Solr-6.x-Windows\solr\build\solr-core\test\J1\temp\solr.schema.TestManagedSchemaAPI_E09596BB55A2C286-001\tempDir-001\node2\testschemaapi_shard1_replica2: java.nio.file.DirectoryNotEmptyException: C:\Users\jenkins\workspace\Lucene-Solr-6.x-Windows\solr\build\solr-core\test\J1\temp\solr.schema.TestManagedSchemaAPI_E09596BB55A2C286-001\tempDir-001\node2\testschemaapi_shard1_replica2
C:\Users\jenkins\workspace\Lucene-Solr-6.x-Windows\solr\build\solr-core\test\J1\temp\solr.schema.TestManagedSchemaAPI_E09596BB55A2C286-001\tempDir-001\node2: java.nio.file.DirectoryNotEmptyException: C:\Users\jenkins\workspace\Lucene-Solr-6.x-Windows\solr\build\solr-core\test\J1\temp\solr.schema.TestManagedSchemaAPI_E09596BB55A2C286-001\tempDir-001\node2
C:\Users\jenkins\workspace\Lucene-Solr-6.x-Windows\solr\build\solr-core\test\J1\temp\solr.schema.TestManagedSchemaAPI_E09596BB55A2C286-001\tempDir-001\node1\testschemaapi_shard1_replica1\data\tlog\tlog.0000000000000000001: java.nio.file.FileSystemException: C:\Users\jenkins\workspace\Lucene-Solr-6.x-Windows\solr\build\solr-core\test\J1\temp\solr.schema.TestManagedSchemaAPI_E09596BB55A2C286-001\tempDir-001\node1\testschemaapi_shard1_replica1\data\tlog\tlog.0000000000000000001: The process cannot access the file because it is being used by another process.
C:\Users\jenkins\workspace\Lucene-Solr-6.x-Windows\solr\build\solr-core\test\J1\temp\solr.schema.TestManagedSchemaAPI_E09596BB55A2C286-001\tempDir-001\node1\testschemaapi_shard1_replica1\data\tlog: java.nio.file.DirectoryNotEmptyException: C:\Users\jenkins\workspace\Lucene-Solr-6.x-Windows\solr\build\solr-core\test\J1\temp\solr.schema.TestManagedSchemaAPI_E09596BB55A2C286-001\tempDir-001\node1\testschemaapi_shard1_replica1\data\tlog
C:\Users\jenkins\workspace\Lucene-Solr-6.x-Windows\solr\build\solr-core\test\J1\temp\solr.schema.TestManagedSchemaAPI_E09596BB55A2C286-001\tempDir-001\node1\testschemaapi_shard1_replica1\data: java.nio.file.DirectoryNotEmptyException: C:\Users\jenkins\workspace\Lucene-Solr-6.x-Windows\solr\build\solr-core\test\J1\temp\solr.schema.TestManagedSchemaAPI_E09596BB55A2C286-001\tempDir-001\node1\testschemaapi_shard1_replica1\data
C:\Users\jenkins\workspace\Lucene-Solr-6.x-Windows\solr\build\solr-core\test\J1\temp\solr.schema.TestManagedSchemaAPI_E09596BB55A2C286-001\tempDir-001\node1\testschemaapi_shard1_replica1: java.nio.file.DirectoryNotEmptyException: C:\Users\jenkins\workspace\Lucene-Solr-6.x-Windows\solr\build\solr-core\test\J1\temp\solr.schema.TestManagedSchemaAPI_E09596BB55A2C286-001\tempDir-001\node1\testschemaapi_shard1_replica1
C:\Users\jenkins\workspace\Lucene-Solr-6.x-Windows\solr\build\solr-core\test\J1\temp\solr.schema.TestManagedSchemaAPI_E09596BB55A2C286-001\tempDir-001\node1: java.nio.file.DirectoryNotEmptyException: C:\Users\jenkins\workspace\Lucene-Solr-6.x-Windows\solr\build\solr-core\test\J1\temp\solr.schema.TestManagedSchemaAPI_E09596BB55A2C286-001\tempDir-001\node1
C:\Users\jenkins\workspace\Lucene-Solr-6.x-Windows\solr\build\solr-core\test\J1\temp\solr.schema.TestManagedSchemaAPI_E09596BB55A2C286-001\tempDir-001: java.nio.file.DirectoryNotEmptyException: C:\Users\jenkins\workspace\Lucene-Solr-6.x-Windows\solr\build\solr-core\test\J1\temp\solr.schema.TestManagedSchemaAPI_E09596BB55A2C286-001\tempDir-001
C:\Users\jenkins\workspace\Lucene-Solr-6.x-Windows\solr\build\solr-core\test\J1\temp\solr.schema.TestManagedSchemaAPI_E09596BB55A2C286-001: java.nio.file.DirectoryNotEmptyException: C:\Users\jenkins\workspace\Lucene-Solr-6.x-Windows\solr\build\solr-core\test\J1\temp\solr.schema.TestManagedSchemaAPI_E09596BB55A2C286-001
at org.apache.lucene.util.IOUtils.rm(IOUtils.java:323)
at org.apache.lucene.util.TestRuleTemporaryFilesCleanup.afterAlways(TestRuleTemporaryFilesCleanup.java:216)
at com.carrotsearch.randomizedtesting.rules.TestRuleAdapter$1.afterAlways(TestRuleAdapter.java:31)
at com.carrotsearch.randomizedtesting.rules.StatementAdapter.evaluate(StatementAdapter.java:43)
at com.carrotsearch.randomizedtesting.rules.StatementAdapter.evaluate(StatementAdapter.java:36)
at org.apache.lucene.util.TestRuleAssertionsRequired$1.evaluate(TestRuleAssertionsRequired.java:53)
at org.apache.lucene.util.TestRuleMarkFailure$1.evaluate(TestRuleMarkFailure.java:47)
at org.apache.lucene.util.TestRuleIgnoreAfterMaxFailures$1.evaluate(TestRuleIgnoreAfterMaxFailures.java:64)
at org.apache.lucene.util.TestRuleIgnoreTestSuites$1.evaluate(TestRuleIgnoreTestSuites.java:54)
at com.carrotsearch.randomizedtesting.rules.StatementAdapter.evaluate(StatementAdapter.java:36)
at com.carrotsearch.randomizedtesting.ThreadLeakControl$StatementRunner.run(ThreadLeakControl.java:367)
at java.lang.Thread.run(Thread.java:745)
Build Log:
[...truncated 12384 lines...]
[junit4] Suite: org.apache.solr.schema.TestManagedSchemaAPI
[junit4] 2> Creating dataDir: C:\Users\jenkins\workspace\Lucene-Solr-6.x-Windows\solr\build\solr-core\test\J1\temp\solr.schema.TestManagedSchemaAPI_E09596BB55A2C286-001\init-core-data-001
[junit4] 2> 3423431 INFO (SUITE-TestManagedSchemaAPI-seed#[E09596BB55A2C286]-worker) [ ] o.a.s.SolrTestCaseJ4 Randomized ssl (false) and clientAuth (false) via: @org.apache.solr.util.RandomizeSSL(reason=, value=NaN, ssl=NaN, clientAuth=NaN)
[junit4] 2> 3423433 INFO (SUITE-TestManagedSchemaAPI-seed#[E09596BB55A2C286]-worker) [ ] o.a.s.c.ZkTestServer STARTING ZK TEST SERVER
[junit4] 2> 3423433 INFO (Thread-7941) [ ] o.a.s.c.ZkTestServer client port:0.0.0.0/0.0.0.0:0
[junit4] 2> 3423433 INFO (Thread-7941) [ ] o.a.s.c.ZkTestServer Starting server
[junit4] 2> 3423534 INFO (SUITE-TestManagedSchemaAPI-seed#[E09596BB55A2C286]-worker) [ ] o.a.s.c.ZkTestServer start zk server on port:60852
[junit4] 2> 3423535 INFO (SUITE-TestManagedSchemaAPI-seed#[E09596BB55A2C286]-worker) [ ] o.a.s.c.c.SolrZkClient Using default ZkCredentialsProvider
[junit4] 2> 3423536 INFO (SUITE-TestManagedSchemaAPI-seed#[E09596BB55A2C286]-worker) [ ] o.a.s.c.c.ConnectionManager Waiting for client to connect to ZooKeeper
[junit4] 2> 3423543 INFO (zkCallback-12170-thread-1) [ ] o.a.s.c.c.ConnectionManager Watcher org.apache.solr.common.cloud.ConnectionManager@7ce0bc name:ZooKeeperConnection Watcher:127.0.0.1:60852 got event WatchedEvent state:SyncConnected type:None path:null path:null type:None
[junit4] 2> 3423544 INFO (SUITE-TestManagedSchemaAPI-seed#[E09596BB55A2C286]-worker) [ ] o.a.s.c.c.ConnectionManager Client is connected to ZooKeeper
[junit4] 2> 3423544 INFO (SUITE-TestManagedSchemaAPI-seed#[E09596BB55A2C286]-worker) [ ] o.a.s.c.c.SolrZkClient Using default ZkACLProvider
[junit4] 2> 3423544 INFO (SUITE-TestManagedSchemaAPI-seed#[E09596BB55A2C286]-worker) [ ] o.a.s.c.c.SolrZkClient makePath: /solr/solr.xml
[junit4] 2> 3423549 WARN (NIOServerCxn.Factory:0.0.0.0/0.0.0.0:0) [ ] o.a.z.s.NIOServerCnxn caught end of stream exception
[junit4] 2> EndOfStreamException: Unable to read additional data from client sessionid 0x15569fa8a750000, likely client has closed socket
[junit4] 2> at org.apache.zookeeper.server.NIOServerCnxn.doIO(NIOServerCnxn.java:228)
[junit4] 2> at org.apache.zookeeper.server.NIOServerCnxnFactory.run(NIOServerCnxnFactory.java:208)
[junit4] 2> at java.lang.Thread.run(Thread.java:745)
[junit4] 2> 3423554 INFO (jetty-launcher-12169-thread-2) [ ] o.e.j.s.Server jetty-9.3.8.v20160314
[junit4] 2> 3423554 INFO (jetty-launcher-12169-thread-1) [ ] o.e.j.s.Server jetty-9.3.8.v20160314
[junit4] 2> 3423555 INFO (jetty-launcher-12169-thread-1) [ ] o.e.j.s.h.ContextHandler Started o.e.j.s.ServletContextHandler@1e48754{/solr,null,AVAILABLE}
[junit4] 2> 3423556 INFO (jetty-launcher-12169-thread-2) [ ] o.e.j.s.h.ContextHandler Started o.e.j.s.ServletContextHandler@4c3ae8{/solr,null,AVAILABLE}
[junit4] 2> 3423560 INFO (jetty-launcher-12169-thread-2) [ ] o.e.j.s.ServerConnector Started ServerConnector@1fb4d33{HTTP/1.1,[http/1.1]}{127.0.0.1:60858}
[junit4] 2> 3423560 INFO (jetty-launcher-12169-thread-2) [ ] o.e.j.s.Server Started @3427247ms
[junit4] 2> 3423560 INFO (jetty-launcher-12169-thread-1) [ ] o.e.j.s.ServerConnector Started ServerConnector@109a695{HTTP/1.1,[http/1.1]}{127.0.0.1:60856}
[junit4] 2> 3423560 INFO (jetty-launcher-12169-thread-2) [ ] o.a.s.c.s.e.JettySolrRunner Jetty properties: {hostContext=/solr, hostPort=60858}
[junit4] 2> 3423564 INFO (jetty-launcher-12169-thread-2) [ ] o.a.s.s.SolrDispatchFilter SolrDispatchFilter.init(): sun.misc.Launcher$AppClassLoader@1d16e93
[junit4] 2> 3423565 INFO (jetty-launcher-12169-thread-2) [ ] o.a.s.c.SolrResourceLoader new SolrResourceLoader for directory: 'C:\Users\jenkins\workspace\Lucene-Solr-6.x-Windows\solr\build\solr-core\test\J1\temp\solr.schema.TestManagedSchemaAPI_E09596BB55A2C286-001\tempDir-001\node2'
[junit4] 2> 3423565 INFO (jetty-launcher-12169-thread-2) [ ] o.a.s.c.SolrResourceLoader JNDI not configured for solr (NoInitialContextEx)
[junit4] 2> 3423565 INFO (jetty-launcher-12169-thread-2) [ ] o.a.s.c.SolrResourceLoader solr home defaulted to 'solr/' (could not find system property or JNDI)
[junit4] 2> 3423564 INFO (jetty-launcher-12169-thread-1) [ ] o.e.j.s.Server Started @3427247ms
[junit4] 2> 3423565 INFO (jetty-launcher-12169-thread-1) [ ] o.a.s.c.s.e.JettySolrRunner Jetty properties: {hostContext=/solr, hostPort=60856}
[junit4] 2> 3423566 INFO (jetty-launcher-12169-thread-1) [ ] o.a.s.s.SolrDispatchFilter SolrDispatchFilter.init(): sun.misc.Launcher$AppClassLoader@1d16e93
[junit4] 2> 3423566 INFO (jetty-launcher-12169-thread-1) [ ] o.a.s.c.SolrResourceLoader new SolrResourceLoader for directory: 'C:\Users\jenkins\workspace\Lucene-Solr-6.x-Windows\solr\build\solr-core\test\J1\temp\solr.schema.TestManagedSchemaAPI_E09596BB55A2C286-001\tempDir-001\node1'
[junit4] 2> 3423566 INFO (jetty-launcher-12169-thread-1) [ ] o.a.s.c.SolrResourceLoader JNDI not configured for solr (NoInitialContextEx)
[junit4] 2> 3423566 INFO (jetty-launcher-12169-thread-1) [ ] o.a.s.c.SolrResourceLoader solr home defaulted to 'solr/' (could not find system property or JNDI)
[junit4] 2> 3423567 INFO (jetty-launcher-12169-thread-2) [ ] o.a.s.c.c.SolrZkClient Using default ZkCredentialsProvider
[junit4] 2> 3423568 INFO (jetty-launcher-12169-thread-1) [ ] o.a.s.c.c.SolrZkClient Using default ZkCredentialsProvider
[junit4] 2> 3423569 INFO (jetty-launcher-12169-thread-1) [ ] o.a.s.c.c.ConnectionManager Waiting for client to connect to ZooKeeper
[junit4] 2> 3423570 INFO (jetty-launcher-12169-thread-2) [ ] o.a.s.c.c.ConnectionManager Waiting for client to connect to ZooKeeper
[junit4] 2> 3423572 INFO (zkCallback-12172-thread-1) [ ] o.a.s.c.c.ConnectionManager Watcher org.apache.solr.common.cloud.ConnectionManager@1fdce7d name:ZooKeeperConnection Watcher:127.0.0.1:60852/solr got event WatchedEvent state:SyncConnected type:None path:null path:null type:None
[junit4] 2> 3423573 INFO (jetty-launcher-12169-thread-1) [ ] o.a.s.c.c.ConnectionManager Client is connected to ZooKeeper
[junit4] 2> 3423573 INFO (jetty-launcher-12169-thread-1) [ ] o.a.s.c.c.SolrZkClient Using default ZkACLProvider
[junit4] 2> 3423574 INFO (zkCallback-12171-thread-1) [ ] o.a.s.c.c.ConnectionManager Watcher org.apache.solr.common.cloud.ConnectionManager@1648252 name:ZooKeeperConnection Watcher:127.0.0.1:60852/solr got event WatchedEvent state:SyncConnected type:None path:null path:null type:None
[junit4] 2> 3423574 INFO (jetty-launcher-12169-thread-2) [ ] o.a.s.c.c.ConnectionManager Client is connected to ZooKeeper
[junit4] 2> 3423574 INFO (jetty-launcher-12169-thread-2) [ ] o.a.s.c.c.SolrZkClient Using default ZkACLProvider
[junit4] 2> 3423574 INFO (jetty-launcher-12169-thread-1) [ ] o.a.s.s.SolrDispatchFilter solr.xml found in ZooKeeper. Loading...
[junit4] 2> 3423577 INFO (jetty-launcher-12169-thread-2) [ ] o.a.s.s.SolrDispatchFilter solr.xml found in ZooKeeper. Loading...
[junit4] 2> 3423594 WARN (NIOServerCxn.Factory:0.0.0.0/0.0.0.0:0) [ ] o.a.z.s.NIOServerCnxn caught end of stream exception
[junit4] 2> EndOfStreamException: Unable to read additional data from client sessionid 0x15569fa8a750001, likely client has closed socket
[junit4] 2> at org.apache.zookeeper.server.NIOServerCnxn.doIO(NIOServerCnxn.java:228)
[junit4] 2> at org.apache.zookeeper.server.NIOServerCnxnFactory.run(NIOServerCnxnFactory.java:208)
[junit4] 2> at java.lang.Thread.run(Thread.java:745)
[junit4] 2> 3423596 INFO (jetty-launcher-12169-thread-1) [ ] o.a.s.c.CorePropertiesLocator Config-defined core root directory: C:\Users\jenkins\workspace\Lucene-Solr-6.x-Windows\solr\build\solr-core\test\J1\temp\solr.schema.TestManagedSchemaAPI_E09596BB55A2C286-001\tempDir-001\node1\.
[junit4] 2> 3423596 INFO (jetty-launcher-12169-thread-1) [ ] o.a.s.c.CoreContainer New CoreContainer 15606932
[junit4] 2> 3423596 INFO (jetty-launcher-12169-thread-1) [ ] o.a.s.c.CoreContainer Loading cores into CoreContainer [instanceDir=C:\Users\jenkins\workspace\Lucene-Solr-6.x-Windows\solr\build\solr-core\test\J1\temp\solr.schema.TestManagedSchemaAPI_E09596BB55A2C286-001\tempDir-001\node1]
[junit4] 2> 3423597 WARN (jetty-launcher-12169-thread-1) [ ] o.a.s.c.CoreContainer Couldn't add files from C:\Users\jenkins\workspace\Lucene-Solr-6.x-Windows\solr\build\solr-core\test\J1\temp\solr.schema.TestManagedSchemaAPI_E09596BB55A2C286-001\tempDir-001\node1\lib to classpath: C:\Users\jenkins\workspace\Lucene-Solr-6.x-Windows\solr\build\solr-core\test\J1\temp\solr.schema.TestManagedSchemaAPI_E09596BB55A2C286-001\tempDir-001\node1\lib
[junit4] 2> 3423597 INFO (jetty-launcher-12169-thread-1) [ ] o.a.s.h.c.HttpShardHandlerFactory created with socketTimeout : 90000,urlScheme : ,connTimeout : 15000,maxConnectionsPerHost : 20,maxConnections : 10000,corePoolSize : 0,maximumPoolSize : 2147483647,maxThreadIdleTime : 5,sizeOfQueue : -1,fairnessPolicy : false,useRetries : false,
[junit4] 2> 3423598 WARN (NIOServerCxn.Factory:0.0.0.0/0.0.0.0:0) [ ] o.a.z.s.NIOServerCnxn caught end of stream exception
[junit4] 2> EndOfStreamException: Unable to read additional data from client sessionid 0x15569fa8a750002, likely client has closed socket
[junit4] 2> at org.apache.zookeeper.server.NIOServerCnxn.doIO(NIOServerCnxn.java:228)
[junit4] 2> at org.apache.zookeeper.server.NIOServerCnxnFactory.run(NIOServerCnxnFactory.java:208)
[junit4] 2> at java.lang.Thread.run(Thread.java:745)
[junit4] 2> 3423599 INFO (jetty-launcher-12169-thread-2) [ ] o.a.s.c.CorePropertiesLocator Config-defined core root directory: C:\Users\jenkins\workspace\Lucene-Solr-6.x-Windows\solr\build\solr-core\test\J1\temp\solr.schema.TestManagedSchemaAPI_E09596BB55A2C286-001\tempDir-001\node2\.
[junit4] 2> 3423599 INFO (jetty-launcher-12169-thread-2) [ ] o.a.s.c.CoreContainer New CoreContainer 3549794
[junit4] 2> 3423599 INFO (jetty-launcher-12169-thread-2) [ ] o.a.s.c.CoreContainer Loading cores into CoreContainer [instanceDir=C:\Users\jenkins\workspace\Lucene-Solr-6.x-Windows\solr\build\solr-core\test\J1\temp\solr.schema.TestManagedSchemaAPI_E09596BB55A2C286-001\tempDir-001\node2]
[junit4] 2> 3423599 WARN (jetty-launcher-12169-thread-2) [ ] o.a.s.c.CoreContainer Couldn't add files from C:\Users\jenkins\workspace\Lucene-Solr-6.x-Windows\solr\build\solr-core\test\J1\temp\solr.schema.TestManagedSchemaAPI_E09596BB55A2C286-001\tempDir-001\node2\lib to classpath: C:\Users\jenkins\workspace\Lucene-Solr-6.x-Windows\solr\build\solr-core\test\J1\temp\solr.schema.TestManagedSchemaAPI_E09596BB55A2C286-001\tempDir-001\node2\lib
[junit4] 2> 3423600 INFO (jetty-launcher-12169-thread-2) [ ] o.a.s.h.c.HttpShardHandlerFactory created with socketTimeout : 90000,urlScheme : ,connTimeout : 15000,maxConnectionsPerHost : 20,maxConnections : 10000,corePoolSize : 0,maximumPoolSize : 2147483647,maxThreadIdleTime : 5,sizeOfQueue : -1,fairnessPolicy : false,useRetries : false,
[junit4] 2> 3423604 INFO (jetty-launcher-12169-thread-2) [ ] o.a.s.u.UpdateShardHandler Creating UpdateShardHandler HTTP client with params: socketTimeout=340000&connTimeout=45000&retry=true
[junit4] 2> 3423604 INFO (jetty-launcher-12169-thread-1) [ ] o.a.s.u.UpdateShardHandler Creating UpdateShardHandler HTTP client with params: socketTimeout=340000&connTimeout=45000&retry=true
[junit4] 2> 3423605 INFO (jetty-launcher-12169-thread-2) [ ] o.a.s.l.LogWatcher SLF4J impl is org.slf4j.impl.Log4jLoggerFactory
[junit4] 2> 3423605 INFO (jetty-launcher-12169-thread-2) [ ] o.a.s.l.LogWatcher Registering Log Listener [Log4j (org.slf4j.impl.Log4jLoggerFactory)]
[junit4] 2> 3423605 INFO (jetty-launcher-12169-thread-1) [ ] o.a.s.l.LogWatcher SLF4J impl is org.slf4j.impl.Log4jLoggerFactory
[junit4] 2> 3423605 INFO (jetty-launcher-12169-thread-1) [ ] o.a.s.l.LogWatcher Registering Log Listener [Log4j (org.slf4j.impl.Log4jLoggerFactory)]
[junit4] 2> 3423605 INFO (jetty-launcher-12169-thread-2) [ ] o.a.s.c.ZkContainer Zookeeper client=127.0.0.1:60852/solr
[junit4] 2> 3423606 INFO (jetty-launcher-12169-thread-2) [ ] o.a.s.c.ZkController zkHost includes chroot
[junit4] 2> 3423606 INFO (jetty-launcher-12169-thread-2) [ ] o.a.s.c.c.SolrZkClient Using default ZkCredentialsProvider
[junit4] 2> 3423606 INFO (jetty-launcher-12169-thread-1) [ ] o.a.s.c.ZkContainer Zookeeper client=127.0.0.1:60852/solr
[junit4] 2> 3423607 INFO (jetty-launcher-12169-thread-1) [ ] o.a.s.c.ZkController zkHost includes chroot
[junit4] 2> 3423607 INFO (jetty-launcher-12169-thread-1) [ ] o.a.s.c.c.SolrZkClient Using default ZkCredentialsProvider
[junit4] 2> 3423608 INFO (jetty-launcher-12169-thread-2) [ ] o.a.s.c.c.ConnectionManager Waiting for client to connect to ZooKeeper
[junit4] 2> 3423608 INFO (jetty-launcher-12169-thread-1) [ ] o.a.s.c.c.ConnectionManager Waiting for client to connect to ZooKeeper
[junit4] 2> 3423612 INFO (zkCallback-12177-thread-1) [ ] o.a.s.c.c.ConnectionManager Watcher org.apache.solr.common.cloud.ConnectionManager@b56853 name:ZooKeeperConnection Watcher:127.0.0.1:60852 got event WatchedEvent state:SyncConnected type:None path:null path:null type:None
[junit4] 2> 3423613 INFO (jetty-launcher-12169-thread-2) [ ] o.a.s.c.c.ConnectionManager Client is connected to ZooKeeper
[junit4] 2> 3423613 INFO (jetty-launcher-12169-thread-2) [ ] o.a.s.c.c.SolrZkClient Using default ZkACLProvider
[junit4] 2> 3423614 INFO (zkCallback-12178-thread-1) [ ] o.a.s.c.c.ConnectionManager Watcher org.apache.solr.common.cloud.ConnectionManager@ef3ea0 name:ZooKeeperConnection Watcher:127.0.0.1:60852 got event WatchedEvent state:SyncConnected type:None path:null path:null type:None
[junit4] 2> 3423614 INFO (jetty-launcher-12169-thread-1) [ ] o.a.s.c.c.ConnectionManager Client is connected to ZooKeeper
[junit4] 2> 3423615 INFO (jetty-launcher-12169-thread-1) [ ] o.a.s.c.c.SolrZkClient Using default ZkACLProvider
[junit4] 2> 3423618 INFO (jetty-launcher-12169-thread-2) [n:127.0.0.1:60858_solr ] o.a.s.c.ZkController Added new OnReconnect listener org.apache.solr.cloud.ZkController$$Lambda$26/23710090@972d28
[junit4] 2> 3423621 INFO (jetty-launcher-12169-thread-1) [n:127.0.0.1:60856_solr ] o.a.s.c.ZkController Added new OnReconnect listener org.apache.solr.cloud.ZkController$$Lambda$26/23710090@f7ae82
[junit4] 2> 3423621 INFO (jetty-launcher-12169-thread-2) [n:127.0.0.1:60858_solr ] o.a.s.c.c.ConnectionManager Waiting for client to connect to ZooKeeper
[junit4] 2> 3423622 INFO (jetty-launcher-12169-thread-1) [n:127.0.0.1:60856_solr ] o.a.s.c.c.ConnectionManager Waiting for client to connect to ZooKeeper
[junit4] 2> 3423624 INFO (zkCallback-12179-thread-1-processing-n:127.0.0.1:60858_solr) [n:127.0.0.1:60858_solr ] o.a.s.c.c.ConnectionManager Watcher org.apache.solr.common.cloud.ConnectionManager@1cba70f name:ZooKeeperConnection Watcher:127.0.0.1:60852/solr got event WatchedEvent state:SyncConnected type:None path:null path:null type:None
[junit4] 2> 3423625 INFO (jetty-launcher-12169-thread-2) [n:127.0.0.1:60858_solr ] o.a.s.c.c.ConnectionManager Client is connected to ZooKeeper
[junit4] 2> 3423625 INFO (zkCallback-12180-thread-1-processing-n:127.0.0.1:60856_solr) [n:127.0.0.1:60856_solr ] o.a.s.c.c.ConnectionManager Watcher org.apache.solr.common.cloud.ConnectionManager@9a9f40 name:ZooKeeperConnection Watcher:127.0.0.1:60852/solr got event WatchedEvent state:SyncConnected type:None path:null path:null type:None
[junit4] 2> 3423625 INFO (jetty-launcher-12169-thread-1) [n:127.0.0.1:60856_solr ] o.a.s.c.c.ConnectionManager Client is connected to ZooKeeper
[junit4] 2> 3423627 INFO (jetty-launcher-12169-thread-2) [n:127.0.0.1:60858_solr ] o.a.s.c.c.SolrZkClient makePath: /overseer/queue
[junit4] 2> 3423627 INFO (jetty-launcher-12169-thread-1) [n:127.0.0.1:60856_solr ] o.a.s.c.c.SolrZkClient makePath: /overseer/queue
[junit4] 2> 3423632 INFO (jetty-launcher-12169-thread-1) [n:127.0.0.1:60856_solr ] o.a.s.c.c.SolrZkClient makePath: /overseer/collection-queue-work
[junit4] 2> 3423633 INFO (jetty-launcher-12169-thread-2) [n:127.0.0.1:60858_solr ] o.a.s.c.c.SolrZkClient makePath: /overseer/collection-queue-work
[junit4] 2> 3423642 INFO (jetty-launcher-12169-thread-2) [n:127.0.0.1:60858_solr ] o.a.s.c.c.SolrZkClient makePath: /overseer/collection-map-running
[junit4] 2> 3423643 INFO (jetty-launcher-12169-thread-1) [n:127.0.0.1:60856_solr ] o.a.s.c.c.SolrZkClient makePath: /overseer/collection-map-running
[junit4] 2> 3423647 INFO (jetty-launcher-12169-thread-2) [n:127.0.0.1:60858_solr ] o.a.s.c.c.SolrZkClient makePath: /overseer/collection-map-completed
[junit4] 2> 3423648 INFO (jetty-launcher-12169-thread-1) [n:127.0.0.1:60856_solr ] o.a.s.c.c.SolrZkClient makePath: /overseer/collection-map-completed
[junit4] 2> 3423651 INFO (jetty-launcher-12169-thread-2) [n:127.0.0.1:60858_solr ] o.a.s.c.c.SolrZkClient makePath: /overseer/collection-map-failure
[junit4] 2> 3423653 INFO (jetty-launcher-12169-thread-1) [n:127.0.0.1:60856_solr ] o.a.s.c.c.SolrZkClient makePath: /overseer/collection-map-failure
[junit4] 2> 3423656 INFO (jetty-launcher-12169-thread-2) [n:127.0.0.1:60858_solr ] o.a.s.c.c.SolrZkClient makePath: /live_nodes
[junit4] 2> 3423659 INFO (jetty-launcher-12169-thread-1) [n:127.0.0.1:60856_solr ] o.a.s.c.c.SolrZkClient makePath: /collections
[junit4] 2> 3423659 INFO (jetty-launcher-12169-thread-2) [n:127.0.0.1:60858_solr ] o.a.s.c.c.SolrZkClient makePath: /collections
[junit4] 2> 3423663 INFO (jetty-launcher-12169-thread-2) [n:127.0.0.1:60858_solr ] o.a.s.c.c.SolrZkClient makePath: /aliases.json
[junit4] 2> 3423664 INFO (jetty-launcher-12169-thread-1) [n:127.0.0.1:60856_solr ] o.a.s.c.c.SolrZkClient makePath: /aliases.json
[junit4] 2> 3423667 INFO (jetty-launcher-12169-thread-2) [n:127.0.0.1:60858_solr ] o.a.s.c.c.SolrZkClient makePath: /clusterstate.json
[junit4] 2> 3423668 INFO (jetty-launcher-12169-thread-1) [n:127.0.0.1:60856_solr ] o.a.s.c.c.SolrZkClient makePath: /clusterstate.json
[junit4] 2> 3423671 INFO (jetty-launcher-12169-thread-2) [n:127.0.0.1:60858_solr ] o.a.s.c.c.SolrZkClient makePath: /security.json
[junit4] 2> 3423671 INFO (jetty-launcher-12169-thread-1) [n:127.0.0.1:60856_solr ] o.a.s.c.c.SolrZkClient makePath: /security.json
[junit4] 2> 3423673 INFO (jetty-launcher-12169-thread-1) [n:127.0.0.1:60856_solr ] o.a.s.c.c.ZkStateReader Updating cluster state from ZooKeeper...
[junit4] 2> 3423673 INFO (jetty-launcher-12169-thread-2) [n:127.0.0.1:60858_solr ] o.a.s.c.c.ZkStateReader Updating cluster state from ZooKeeper...
[junit4] 2> 3423674 INFO (jetty-launcher-12169-thread-1) [n:127.0.0.1:60856_solr ] o.a.s.c.c.ZkStateReader Loaded empty cluster properties
[junit4] 2> 3423675 INFO (jetty-launcher-12169-thread-2) [n:127.0.0.1:60858_solr ] o.a.s.c.c.ZkStateReader Loaded empty cluster properties
[junit4] 2> 3423676 INFO (jetty-launcher-12169-thread-2) [n:127.0.0.1:60858_solr ] o.a.s.c.c.ZkStateReader Updated live nodes from ZooKeeper... (0) -> (0)
[junit4] 2> 3423677 INFO (jetty-launcher-12169-thread-1) [n:127.0.0.1:60856_solr ] o.a.s.c.c.ZkStateReader Updated live nodes from ZooKeeper... (0) -> (0)
[junit4] 2> 3423682 INFO (jetty-launcher-12169-thread-2) [n:127.0.0.1:60858_solr ] o.a.s.c.c.SolrZkClient makePath: /overseer_elect
[junit4] 2> 3423687 INFO (jetty-launcher-12169-thread-2) [n:127.0.0.1:60858_solr ] o.a.s.c.c.SolrZkClient makePath: /overseer_elect/election
[junit4] 2> 3423688 INFO (jetty-launcher-12169-thread-1) [n:127.0.0.1:60856_solr ] o.a.s.c.c.SolrZkClient makePath: /overseer_elect/election
[junit4] 2> 3423690 INFO (jetty-launcher-12169-thread-2) [n:127.0.0.1:60858_solr ] o.a.s.c.Overseer Overseer (id=null) closing
[junit4] 2> 3423691 INFO (jetty-launcher-12169-thread-1) [n:127.0.0.1:60856_solr ] o.a.s.c.Overseer Overseer (id=null) closing
[junit4] 2> 3423691 INFO (jetty-launcher-12169-thread-2) [n:127.0.0.1:60858_solr ] o.a.s.c.LeaderElector Joined leadership election with path: /overseer_elect/election/96099491843997701-127.0.0.1:60858_solr-n_0000000000
[junit4] 2> 3423692 INFO (jetty-launcher-12169-thread-1) [n:127.0.0.1:60856_solr ] o.a.s.c.LeaderElector Joined leadership election with path: /overseer_elect/election/96099491843997702-127.0.0.1:60856_solr-n_0000000001
[junit4] 2> 3423692 INFO (jetty-launcher-12169-thread-2) [n:127.0.0.1:60858_solr ] o.a.s.c.OverseerElectionContext I am going to be the leader 127.0.0.1:60858_solr
[junit4] 2> 3423693 INFO (jetty-launcher-12169-thread-2) [n:127.0.0.1:60858_solr ] o.a.s.c.c.SolrZkClient makePath: /overseer_elect/leader
[junit4] 2> 3423694 INFO (jetty-launcher-12169-thread-1) [n:127.0.0.1:60856_solr ] o.a.s.c.LeaderElector Watching path /overseer_elect/election/96099491843997701-127.0.0.1:60858_solr-n_0000000000 to know if I could be the leader
[junit4] 2> 3423695 INFO (jetty-launcher-12169-thread-1) [n:127.0.0.1:60856_solr ] o.a.s.c.ZkController Register node as live in ZooKeeper:/live_nodes/127.0.0.1:60856_solr
[junit4] 2> 3423696 INFO (jetty-launcher-12169-thread-2) [n:127.0.0.1:60858_solr ] o.a.s.c.Overseer Overseer (id=96099491843997701-127.0.0.1:60858_solr-n_0000000000) starting
[junit4] 2> 3423696 INFO (jetty-launcher-12169-thread-1) [n:127.0.0.1:60856_solr ] o.a.s.c.c.SolrZkClient makePath: /live_nodes/127.0.0.1:60856_solr
[junit4] 2> 3423700 INFO (zkCallback-12179-thread-1-processing-n:127.0.0.1:60858_solr) [n:127.0.0.1:60858_solr ] o.a.s.c.c.ZkStateReader A live node change: [WatchedEvent state:SyncConnected type:NodeChildrenChanged path:/live_nodes], has occurred - updating... (live nodes size: [0])
[junit4] 2> 3423700 INFO (zkCallback-12180-thread-1-processing-n:127.0.0.1:60856_solr) [n:127.0.0.1:60856_solr ] o.a.s.c.c.ZkStateReader A live node change: [WatchedEvent state:SyncConnected type:NodeChildrenChanged path:/live_nodes], has occurred - updating... (live nodes size: [0])
[junit4] 2> 3423700 INFO (jetty-launcher-12169-thread-2) [n:127.0.0.1:60858_solr ] o.a.s.c.c.SolrZkClient makePath: /overseer/queue-work
[junit4] 2> 3423705 INFO (zkCallback-12179-thread-1-processing-n:127.0.0.1:60858_solr) [n:127.0.0.1:60858_solr ] o.a.s.c.c.ZkStateReader Updated live nodes from ZooKeeper... (0) -> (1)
[junit4] 2> 3423708 INFO (zkCallback-12180-thread-1-processing-n:127.0.0.1:60856_solr) [n:127.0.0.1:60856_solr ] o.a.s.c.c.ZkStateReader Updated live nodes from ZooKeeper... (0) -> (1)
[junit4] 2> 3423733 INFO (jetty-launcher-12169-thread-2) [n:127.0.0.1:60858_solr ] o.a.s.c.OverseerAutoReplicaFailoverThread Starting OverseerAutoReplicaFailoverThread autoReplicaFailoverWorkLoopDelay=10000 autoReplicaFailoverWaitAfterExpiration=30000 autoReplicaFailoverBadNodeExpiration=60000
[junit4] 2> 3423734 INFO (jetty-launcher-12169-thread-2) [n:127.0.0.1:60858_solr ] o.a.s.c.ZkController Publish node=127.0.0.1:60858_solr as DOWN
[junit4] 2> 3423737 INFO (OverseerCollectionConfigSetProcessor-96099491843997701-127.0.0.1:60858_solr-n_0000000000) [n:127.0.0.1:60858_solr ] o.a.s.c.OverseerTaskProcessor Process current queue of overseer operations
[junit4] 2> 3423738 INFO (OverseerStateUpdate-96099491843997701-127.0.0.1:60858_solr-n_0000000000) [n:127.0.0.1:60858_solr ] o.a.s.c.Overseer Starting to work on the main queue
[junit4] 2> 3423740 INFO (jetty-launcher-12169-thread-1) [n:127.0.0.1:60856_solr ] o.a.s.c.CoreContainer Security conf doesn't exist. Skipping setup for authorization module.
[junit4] 2> 3423740 INFO (jetty-launcher-12169-thread-1) [n:127.0.0.1:60856_solr ] o.a.s.c.CoreContainer No authentication plugin used.
[junit4] 2> 3423741 INFO (jetty-launcher-12169-thread-1) [n:127.0.0.1:60856_solr ] o.a.s.c.CorePropertiesLocator Looking for core definitions underneath C:\Users\jenkins\workspace\Lucene-Solr-6.x-Windows\solr\build\solr-core\test\J1\temp\solr.schema.TestManagedSchemaAPI_E09596BB55A2C286-001\tempDir-001\node1\.
[junit4] 2> 3423742 INFO (jetty-launcher-12169-thread-1) [n:127.0.0.1:60856_solr ] o.a.s.c.CorePropertiesLocator Found 0 core definitions
[junit4] 2> 3423743 INFO (OverseerStateUpdate-96099491843997701-127.0.0.1:60858_solr-n_0000000000) [n:127.0.0.1:60858_solr ] o.a.s.c.c.ZkStateReader Updated live nodes from ZooKeeper... (1) -> (1)
[junit4] 2> 3423743 INFO (jetty-launcher-12169-thread-1) [n:127.0.0.1:60856_solr ] o.a.s.s.SolrDispatchFilter user.dir=C:\Users\jenkins\workspace\Lucene-Solr-6.x-Windows\solr\build\solr-core\test\J1
[junit4] 2> 3423743 INFO (jetty-launcher-12169-thread-1) [n:127.0.0.1:60856_solr ] o.a.s.s.SolrDispatchFilter SolrDispatchFilter.init() done
[junit4] 2> 3423747 INFO (OverseerStateUpdate-96099491843997701-127.0.0.1:60858_solr-n_0000000000) [n:127.0.0.1:60858_solr ] o.a.s.c.Overseer processMessage: queueSize: 1, message = {
[junit4] 2> "operation":"downnode",
[junit4] 2> "node_name":"127.0.0.1:60858_solr"} current state version: 0
[junit4] 2> 3423747 INFO (OverseerStateUpdate-96099491843997701-127.0.0.1:60858_solr-n_0000000000) [n:127.0.0.1:60858_solr ] o.a.s.c.o.NodeMutator DownNode state invoked for node: 127.0.0.1:60858_solr
[junit4] 2> 3424740 INFO (jetty-launcher-12169-thread-2) [n:127.0.0.1:60858_solr ] o.a.s.c.ZkController Register node as live in ZooKeeper:/live_nodes/127.0.0.1:60858_solr
[junit4] 2> 3424741 INFO (jetty-launcher-12169-thread-2) [n:127.0.0.1:60858_solr ] o.a.s.c.c.SolrZkClient makePath: /live_nodes/127.0.0.1:60858_solr
[junit4] 2> 3424743 INFO (zkCallback-12179-thread-1-processing-n:127.0.0.1:60858_solr) [n:127.0.0.1:60858_solr ] o.a.s.c.c.ZkStateReader A live node change: [WatchedEvent state:SyncConnected type:NodeChildrenChanged path:/live_nodes], has occurred - updating... (live nodes size: [1])
[junit4] 2> 3424744 INFO (zkCallback-12180-thread-1-processing-n:127.0.0.1:60856_solr) [n:127.0.0.1:60856_solr ] o.a.s.c.c.ZkStateReader A live node change: [WatchedEvent state:SyncConnected type:NodeChildrenChanged path:/live_nodes], has occurred - updating... (live nodes size: [1])
[junit4] 2> 3424746 INFO (zkCallback-12179-thread-1-processing-n:127.0.0.1:60858_solr) [n:127.0.0.1:60858_solr ] o.a.s.c.c.ZkStateReader Updated live nodes from ZooKeeper... (1) -> (2)
[junit4] 2> 3424750 INFO (zkCallback-12180-thread-1-processing-n:127.0.0.1:60856_solr) [n:127.0.0.1:60856_solr ] o.a.s.c.c.ZkStateReader Updated live nodes from ZooKeeper... (1) -> (2)
[junit4] 2> 3424770 INFO (jetty-launcher-12169-thread-2) [n:127.0.0.1:60858_solr ] o.a.s.c.CoreContainer Security conf doesn't exist. Skipping setup for authorization module.
[junit4] 2> 3424770 INFO (jetty-launcher-12169-thread-2) [n:127.0.0.1:60858_solr ] o.a.s.c.CoreContainer No authentication plugin used.
[junit4] 2> 3424773 INFO (jetty-launcher-12169-thread-2) [n:127.0.0.1:60858_solr ] o.a.s.c.CorePropertiesLocator Looking for core definitions underneath C:\Users\jenkins\workspace\Lucene-Solr-6.x-Windows\solr\build\solr-core\test\J1\temp\solr.schema.TestManagedSchemaAPI_E09596BB55A2C286-001\tempDir-001\node2\.
[junit4] 2> 3424774 INFO (jetty-launcher-12169-thread-2) [n:127.0.0.1:60858_solr ] o.a.s.c.CorePropertiesLocator Found 0 core definitions
[junit4] 2> 3424775 INFO (jetty-launcher-12169-thread-2) [n:127.0.0.1:60858_solr ] o.a.s.s.SolrDispatchFilter user.dir=C:\Users\jenkins\workspace\Lucene-Solr-6.x-Windows\solr\build\solr-core\test\J1
[junit4] 2> 3424775 INFO (jetty-launcher-12169-thread-2) [n:127.0.0.1:60858_solr ] o.a.s.s.SolrDispatchFilter SolrDispatchFilter.init() done
[junit4] 2> 3424775 INFO (SUITE-TestManagedSchemaAPI-seed#[E09596BB55A2C286]-worker) [ ] o.a.s.c.c.SolrZkClient Using default ZkCredentialsProvider
[junit4] 2> 3424776 INFO (SUITE-TestManagedSchemaAPI-seed#[E09596BB55A2C286]-worker) [ ] o.a.s.c.c.ConnectionManager Waiting for client to connect to ZooKeeper
[junit4] 2> 3424779 INFO (zkCallback-12183-thread-1) [ ] o.a.s.c.c.ConnectionManager Watcher org.apache.solr.common.cloud.ConnectionManager@2579e5 name:ZooKeeperConnection Watcher:127.0.0.1:60852 got event WatchedEvent state:SyncConnected type:None path:null path:null type:None
[junit4] 2> 3424779 INFO (SUITE-TestManagedSchemaAPI-seed#[E09596BB55A2C286]-worker) [ ] o.a.s.c.c.ConnectionManager Client is connected to ZooKeeper
[junit4] 2> 3424780 INFO (SUITE-TestManagedSchemaAPI-seed#[E09596BB55A2C286]-worker) [ ] o.a.s.c.c.SolrZkClient Using default ZkACLProvider
[junit4] 2> 3424783 WARN (NIOServerCxn.Factory:0.0.0.0/0.0.0.0:0) [ ] o.a.z.s.NIOServerCnxn caught end of stream exception
[junit4] 2> EndOfStreamException: Unable to read additional data from client sessionid 0x15569fa8a750007, likely client has closed socket
[junit4] 2> at org.apache.zookeeper.server.NIOServerCnxn.doIO(NIOServerCnxn.java:228)
[junit4] 2> at org.apache.zookeeper.server.NIOServerCnxnFactory.run(NIOServerCnxnFactory.java:208)
[junit4] 2> at java.lang.Thread.run(Thread.java:745)
[junit4] 2> 3424783 INFO (SUITE-TestManagedSchemaAPI-seed#[E09596BB55A2C286]-worker) [ ] o.a.s.c.s.i.CloudSolrClient Final constructed zkHost string: 127.0.0.1:60852/solr
[junit4] 2> 3424784 INFO (SUITE-TestManagedSchemaAPI-seed#[E09596BB55A2C286]-worker) [ ] o.a.s.c.c.SolrZkClient Using default ZkCredentialsProvider
[junit4] 2> 3424785 INFO (SUITE-TestManagedSchemaAPI-seed#[E09596BB55A2C286]-worker) [ ] o.a.s.c.c.ConnectionManager Waiting for client to connect to ZooKeeper
[junit4] 2> 3424787 INFO (zkCallback-12186-thread-1) [ ] o.a.s.c.c.ConnectionManager Watcher org.apache.solr.common.cloud.ConnectionManager@11c3f6a name:ZooKeeperConnection Watcher:127.0.0.1:60852/solr got event WatchedEvent state:SyncConnected type:None path:null path:null type:None
[junit4] 2> 3424788 INFO (SUITE-TestManagedSchemaAPI-seed#[E09596BB55A2C286]-worker) [ ] o.a.s.c.c.ConnectionManager Client is connected to ZooKeeper
[junit4] 2> 3424788 INFO (SUITE-TestManagedSchemaAPI-seed#[E09596BB55A2C286]-worker) [ ] o.a.s.c.c.SolrZkClient Using default ZkACLProvider
[junit4] 2> 3424788 INFO (SUITE-TestManagedSchemaAPI-seed#[E09596BB55A2C286]-worker) [ ] o.a.s.c.c.ZkStateReader Updating cluster state from ZooKeeper...
[junit4] 2> 3424791 INFO (SUITE-TestManagedSchemaAPI-seed#[E09596BB55A2C286]-worker) [ ] o.a.s.c.c.ZkStateReader Loaded empty cluster properties
[junit4] 2> 3424792 INFO (SUITE-TestManagedSchemaAPI-seed#[E09596BB55A2C286]-worker) [ ] o.a.s.c.c.ZkStateReader Updated live nodes from ZooKeeper... (0) -> (2)
[junit4] 2> 3424797 INFO (SUITE-TestManagedSchemaAPI-seed#[E09596BB55A2C286]-worker) [ ] o.a.s.c.c.SolrZkClient makePath: /configs/conf1/managed-schema
[junit4] 2> 3424804 INFO (SUITE-TestManagedSchemaAPI-seed#[E09596BB55A2C286]-worker) [ ] o.a.s.c.c.SolrZkClient makePath: /configs/conf1/solrconfig.xml
[junit4] 2> 3424828 INFO (TEST-TestManagedSchemaAPI.test-seed#[E09596BB55A2C286]) [ ] o.a.s.SolrTestCaseJ4 ###Starting test
[junit4] 2> 3424833 INFO (qtp10038635-51525) [n:127.0.0.1:60856_solr ] o.a.s.h.a.CollectionsHandler Invoked Collection Action :create with params replicationFactor=2&collection.configName=conf1&name=testschemaapi&action=CREATE&numShards=1&wt=javabin&version=2 and sendToOCPQueue=true
[junit4] 2> 3424839 INFO (OverseerCollectionConfigSetProcessor-96099491843997701-127.0.0.1:60858_solr-n_0000000000) [n:127.0.0.1:60858_solr ] o.a.s.c.OverseerTaskProcessor Overseer Collection Message Handler: Get the message id:/overseer/collection-queue-work/qn-0000000000 message:{
[junit4] 2> "name":"testschemaapi",
[junit4] 2> "fromApi":"true",
[junit4] 2> "replicationFactor":"2",
[junit4] 2> "collection.configName":"conf1",
[junit4] 2> "numShards":"1",
[junit4] 2> "stateFormat":"2",
[junit4] 2> "operation":"create"}
[junit4] 2> 3424840 INFO (OverseerThreadFactory-12541-thread-1-processing-n:127.0.0.1:60858_solr) [n:127.0.0.1:60858_solr ] o.a.s.c.OverseerCollectionMessageHandler OverseerCollectionMessageHandler.processMessage : create , {
[junit4] 2> "name":"testschemaapi",
[junit4] 2> "fromApi":"true",
[junit4] 2> "replicationFactor":"2",
[junit4] 2> "collection.configName":"conf1",
[junit4] 2> "numShards":"1",
[junit4] 2> "stateFormat":"2",
[junit4] 2> "operation":"create"}
[junit4] 2> 3424840 INFO (OverseerThreadFactory-12541-thread-1-processing-n:127.0.0.1:60858_solr) [n:127.0.0.1:60858_solr ] o.a.s.c.OverseerCollectionMessageHandler Create collection testschemaapi
[junit4] 2> 3424841 INFO (OverseerThreadFactory-12541-thread-1-processing-n:127.0.0.1:60858_solr) [n:127.0.0.1:60858_solr ] o.a.s.c.OverseerCollectionMessageHandler creating collections conf node /collections/testschemaapi
[junit4] 2> 3424842 INFO (OverseerThreadFactory-12541-thread-1-processing-n:127.0.0.1:60858_solr) [n:127.0.0.1:60858_solr ] o.a.s.c.c.SolrZkClient makePath: /collections/testschemaapi
[junit4] 2> 3424845 INFO (zkCallback-12179-thread-1-processing-n:127.0.0.1:60858_solr) [n:127.0.0.1:60858_solr ] o.a.s.c.c.ZkStateReader A collections change: [WatchedEvent state:SyncConnected type:NodeChildrenChanged path:/collections], has occurred - updating...
[junit4] 2> 3424845 INFO (zkCallback-12186-thread-1) [ ] o.a.s.c.c.ZkStateReader A collections change: [WatchedEvent state:SyncConnected type:NodeChildrenChanged path:/collections], has occurred - updating...
[junit4] 2> 3424845 INFO (zkCallback-12180-thread-1-processing-n:127.0.0.1:60856_solr) [n:127.0.0.1:60856_solr ] o.a.s.c.c.ZkStateReader A collections change: [WatchedEvent state:SyncConnected type:NodeChildrenChanged path:/collections], has occurred - updating...
[junit4] 2> 3424851 INFO (OverseerStateUpdate-96099491843997701-127.0.0.1:60858_solr-n_0000000000) [n:127.0.0.1:60858_solr ] o.a.s.c.Overseer processMessage: queueSize: 1, message = {
[junit4] 2> "name":"testschemaapi",
[junit4] 2> "fromApi":"true",
[junit4] 2> "replicationFactor":"2",
[junit4] 2> "collection.configName":"conf1",
[junit4] 2> "numShards":"1",
[junit4] 2> "stateFormat":"2",
[junit4] 2> "operation":"create"} current state version: 0
[junit4] 2> 3424851 INFO (OverseerStateUpdate-96099491843997701-127.0.0.1:60858_solr-n_0000000000) [n:127.0.0.1:60858_solr ] o.a.s.c.o.ClusterStateMutator building a new cName: testschemaapi
[junit4] 2> 3424853 INFO (OverseerStateUpdate-96099491843997701-127.0.0.1:60858_solr-n_0000000000) [n:127.0.0.1:60858_solr ] o.a.s.c.o.ZkStateWriter going to create_collection /collections/testschemaapi/state.json
[junit4] 2> 3424949 INFO (OverseerThreadFactory-12541-thread-1-processing-n:127.0.0.1:60858_solr) [n:127.0.0.1:60858_solr ] o.a.s.c.OverseerCollectionMessageHandler Creating SolrCores for new collection testschemaapi, shardNames [shard1] , replicationFactor : 2
[junit4] 2> 3424949 INFO (OverseerThreadFactory-12541-thread-1-processing-n:127.0.0.1:60858_solr) [n:127.0.0.1:60858_solr ] o.a.s.c.OverseerCollectionMessageHandler Creating core testschemaapi_shard1_replica1 as part of shard shard1 of collection testschemaapi on 127.0.0.1:60856_solr
[junit4] 2> 3424949 INFO (OverseerThreadFactory-12541-thread-1-processing-n:127.0.0.1:60858_solr) [n:127.0.0.1:60858_solr ] o.a.s.c.OverseerCollectionMessageHandler Creating core testschemaapi_shard1_replica2 as part of shard shard1 of collection testschemaapi on 127.0.0.1:60858_solr
[junit4] 2> 3424952 INFO (qtp10038635-51521) [n:127.0.0.1:60856_solr ] o.a.s.h.a.CoreAdminOperation core create command qt=/admin/cores&collection.configName=conf1&name=testschemaapi_shard1_replica1&action=CREATE&numShards=1&collection=testschemaapi&shard=shard1&wt=javabin&version=2
[junit4] 2> 3424954 INFO (qtp10038635-51521) [n:127.0.0.1:60856_solr ] o.a.s.c.CoreDescriptor Created CoreDescriptor: {name=testschemaapi_shard1_replica1, collection.configName=conf1, config=solrconfig.xml, transient=false, schema=schema.xml, loadOnStartup=true, configSetProperties=configsetprops.json, collection=testschemaapi, numShards=1, dataDir=data\, shard=shard1}
[junit4] 2> 3424954 INFO (qtp10038635-51521) [n:127.0.0.1:60856_solr c:testschemaapi s:shard1 x:testschemaapi_shard1_replica1] o.a.s.c.ZkController publishing state=down
[junit4] 2> 3424957 INFO (qtp28974646-51534) [n:127.0.0.1:60858_solr ] o.a.s.h.a.CoreAdminOperation core create command qt=/admin/cores&collection.configName=conf1&name=testschemaapi_shard1_replica2&action=CREATE&numShards=1&collection=testschemaapi&shard=shard1&wt=javabin&version=2
[junit4] 2> 3424959 INFO (qtp28974646-51534) [n:127.0.0.1:60858_solr ] o.a.s.c.CoreDescriptor Created CoreDescriptor: {name=testschemaapi_shard1_replica2, collection.configName=conf1, config=solrconfig.xml, transient=false, schema=schema.xml, loadOnStartup=true, configSetProperties=configsetprops.json, collection=testschemaapi, numShards=1, dataDir=data\, shard=shard1}
[junit4] 2> 3424960 INFO (qtp10038635-51521) [n:127.0.0.1:60856_solr c:testschemaapi s:shard1 x:testschemaapi_shard1_replica1] o.a.s.c.ZkController Registering watch for collection testschemaapi
[junit4] 2> 3424961 INFO (qtp10038635-51521) [n:127.0.0.1:60856_solr c:testschemaapi s:shard1 x:testschemaapi_shard1_replica1] o.a.s.c.c.ZkStateReader Add data for [testschemaapi] ver [0]
[junit4] 2> 3424961 INFO (qtp10038635-51521) [n:127.0.0.1:60856_solr c:testschemaapi s:shard1 x:testschemaapi_shard1_replica1] o.a.s.c.ZkController look for our core node name
[junit4] 2> 3424962 INFO (qtp28974646-51534) [n:127.0.0.1:60858_solr c:testschemaapi s:shard1 x:testschemaapi_shard1_replica2] o.a.s.c.ZkController publishing state=down
[junit4] 2> 3424965 INFO (qtp28974646-51534) [n:127.0.0.1:60858_solr c:testschemaapi s:shard1 x:testschemaapi_shard1_replica2] o.a.s.c.ZkController Registering watch for collection testschemaapi
[junit4] 2> 3424966 INFO (qtp28974646-51534) [n:127.0.0.1:60858_solr c:testschemaapi s:shard1 x:testschemaapi_shard1_replica2] o.a.s.c.c.ZkStateReader Add data for [testschemaapi] ver [0]
[junit4] 2> 3424966 INFO (qtp28974646-51534) [n:127.0.0.1:60858_solr c:testschemaapi s:shard1 x:testschemaapi_shard1_replica2] o.a.s.c.ZkController look for our core node name
[junit4] 2> 3424968 INFO (OverseerStateUpdate-96099491843997701-127.0.0.1:60858_solr-n_0000000000) [n:127.0.0.1:60858_solr ] o.a.s.c.Overseer processMessage: queueSize: 2, message = {
[junit4] 2> "core":"testschemaapi_shard1_replica1",
[junit4] 2> "roles":null,
[junit4] 2> "base_url":"http://127.0.0.1:60856/solr",
[junit4] 2> "node_name":"127.0.0.1:60856_solr",
[junit4] 2> "numShards":"1",
[junit4] 2> "state":"down",
[junit4] 2> "shard":"shard1",
[junit4] 2> "collection":"testschemaapi",
[junit4] 2> "operation":"state"} current state version: 0
[junit4] 2> 3424968 INFO (OverseerStateUpdate-96099491843997701-127.0.0.1:60858_solr-n_0000000000) [n:127.0.0.1:60858_solr ] o.a.s.c.o.ReplicaMutator Update state numShards=1 message={
[junit4] 2> "core":"testschemaapi_shard1_replica1",
[junit4] 2> "roles":null,
[junit4] 2> "base_url":"http://127.0.0.1:60856/solr",
[junit4] 2> "node_name":"127.0.0.1:60856_solr",
[junit4] 2> "numShards":"1",
[junit4] 2> "state":"down",
[junit4] 2> "shard":"shard1",
[junit4] 2> "collection":"testschemaapi",
[junit4] 2> "operation":"state"}
[junit4] 2> 3424972 INFO (OverseerStateUpdate-96099491843997701-127.0.0.1:60858_solr-n_0000000000) [n:127.0.0.1:60858_solr ] o.a.s.c.Overseer processMessage: queueSize: 1, message = {
[junit4] 2> "core":"testschemaapi_shard1_replica2",
[junit4] 2> "roles":null,
[junit4] 2> "base_url":"http://127.0.0.1:60858/solr",
[junit4] 2> "node_name":"127.0.0.1:60858_solr",
[junit4] 2> "numShards":"1",
[junit4] 2> "state":"down",
[junit4] 2> "shard":"shard1",
[junit4] 2> "collection":"testschemaapi",
[junit4] 2> "operation":"state"} current state version: 0
[junit4] 2> 3424972 INFO (OverseerStateUpdate-96099491843997701-127.0.0.1:60858_solr-n_0000000000) [n:127.0.0.1:60858_solr ] o.a.s.c.o.ReplicaMutator Update state numShards=1 message={
[junit4] 2> "core":"testschemaapi_shard1_replica2",
[junit4] 2> "roles":null,
[junit4] 2> "base_url":"http://127.0.0.1:60858/solr",
[junit4] 2> "node_name":"127.0.0.1:60858_solr",
[junit4] 2> "numShards":"1",
[junit4] 2> "state":"down",
[junit4] 2> "shard":"shard1",
[junit4] 2> "collection":"testschemaapi",
[junit4] 2> "operation":"state"}
[junit4] 2> 3425079 INFO (OverseerStateUpdate-96099491843997701-127.0.0.1:60858_solr-n_0000000000) [n:127.0.0.1:60858_solr ] o.a.s.c.o.ZkStateWriter going to update_collection /collections/testschemaapi/state.json version: 0
[junit4] 2> 3425080 INFO (zkCallback-12179-thread-1-processing-n:127.0.0.1:60858_solr) [n:127.0.0.1:60858_solr ] o.a.s.c.c.ZkStateReader A cluster state change: [WatchedEvent state:SyncConnected type:NodeDataChanged path:/collections/testschemaapi/state.json] for collection [testschemaapi] has occurred - updating... (live nodes size: [2])
[junit4] 2> 3425080 INFO (zkCallback-12180-thread-1-processing-n:127.0.0.1:60856_solr) [n:127.0.0.1:60856_solr ] o.a.s.c.c.ZkStateReader A cluster state change: [WatchedEvent state:SyncConnected type:NodeDataChanged path:/collections/testschemaapi/state.json] for collection [testschemaapi] has occurred - updating... (live nodes size: [2])
[junit4] 2> 3425081 INFO (zkCallback-12179-thread-1-processing-n:127.0.0.1:60858_solr) [n:127.0.0.1:60858_solr ] o.a.s.c.c.ZkStateReader Updating data for [testschemaapi] from [0] to [1]
[junit4] 2> 3425082 INFO (zkCallback-12180-thread-1-processing-n:127.0.0.1:60856_solr) [n:127.0.0.1:60856_solr ] o.a.s.c.c.ZkStateReader Updating data for [testschemaapi] from [0] to [1]
[junit4] 2> 3425962 INFO (qtp10038635-51521) [n:127.0.0.1:60856_solr c:testschemaapi s:shard1 x:testschemaapi_shard1_replica1] o.a.s.c.ZkController waiting to find shard id in clusterstate for testschemaapi_shard1_replica1
[junit4] 2> 3425962 INFO (qtp10038635-51521) [n:127.0.0.1:60856_solr c:testschemaapi s:shard1 x:testschemaapi_shard1_replica1] o.a.s.c.ZkController Check for collection zkNode:testschemaapi
[junit4] 2> 3425963 INFO (qtp10038635-51521) [n:127.0.0.1:60856_solr c:testschemaapi s:shard1 x:testschemaapi_shard1_replica1] o.a.s.c.ZkController Collection zkNode exists
[junit4] 2> 3425963 INFO (qtp10038635-51521) [n:127.0.0.1:60856_solr c:testschemaapi s:shard1 x:testschemaapi_shard1_replica1] o.a.s.c.c.ZkStateReader Load collection config from: [/collections/testschemaapi]
[junit4] 2> 3425964 INFO (qtp10038635-51521) [n:127.0.0.1:60856_solr c:testschemaapi s:shard1 x:testschemaapi_shard1_replica1] o.a.s.c.c.ZkStateReader path=[/collections/testschemaapi] [configName]=[conf1] specified config exists in ZooKeeper
[junit4] 2> 3425965 INFO (qtp10038635-51521) [n:127.0.0.1:60856_solr c:testschemaapi s:shard1 x:testschemaapi_shard1_replica1] o.a.s.c.SolrResourceLoader new SolrResourceLoader for directory: 'C:\Users\jenkins\workspace\Lucene-Solr-6.x-Windows\solr\build\solr-core\test\J1\temp\solr.schema.TestManagedSchemaAPI_E09596BB55A2C286-001\tempDir-001\node1\testschemaapi_shard1_replica1'
[junit4] 2> 3425965 INFO (qtp10038635-51521) [n:127.0.0.1:60856_solr c:testschemaapi s:shard1 x:testschemaapi_shard1_replica1] o.a.s.c.SolrResourceLoader JNDI not configured for solr (NoInitialContextEx)
[junit4] 2> 3425965 INFO (qtp10038635-51521) [n:127.0.0.1:60856_solr c:testschemaapi s:shard1 x:testschemaapi_shard1_replica1] o.a.s.c.SolrResourceLoader solr home defaulted to 'solr/' (could not find system property or JNDI)
[junit4] 2> 3425967 INFO (qtp28974646-51534) [n:127.0.0.1:60858_solr c:testschemaapi s:shard1 x:testschemaapi_shard1_replica2] o.a.s.c.ZkController waiting to find shard id in clusterstate for testschemaapi_shard1_replica2
[junit4] 2> 3425967 INFO (qtp28974646-51534) [n:127.0.0.1:60858_solr c:testschemaapi s:shard1 x:testschemaapi_shard1_replica2] o.a.s.c.ZkController Check for collection zkNode:testschemaapi
[junit4] 2> 3425968 INFO (qtp28974646-51534) [n:127.0.0.1:60858_solr c:testschemaapi s:shard1 x:testschemaapi_shard1_replica2] o.a.s.c.ZkController Collection zkNode exists
[junit4] 2> 3425968 INFO (qtp28974646-51534) [n:127.0.0.1:60858_solr c:testschemaapi s:shard1 x:testschemaapi_shard1_replica2] o.a.s.c.c.ZkStateReader Load collection config from: [/collections/testschemaapi]
[junit4] 2> 3425969 INFO (qtp10038635-51521) [n:127.0.0.1:60856_solr c:testschemaapi s:shard1 x:testschemaapi_shard1_replica1] o.a.s.c.Config loaded config solrconfig.xml with version 0
[junit4] 2> 3425970 INFO (qtp28974646-51534) [n:127.0.0.1:60858_solr c:testschemaapi s:shard1 x:testschemaapi_shard1_replica2] o.a.s.c.c.ZkStateReader path=[/collections/testschemaapi] [configName]=[conf1] specified config exists in ZooKeeper
[junit4] 2> 3425970 INFO (qtp28974646-51534) [n:127.0.0.1:60858_solr c:testschemaapi s:shard1 x:testschemaapi_shard1_replica2] o.a.s.c.SolrResourceLoader new SolrResourceLoader for directory: 'C:\Users\jenkins\workspace\Lucene-Solr-6.x-Windows\solr\build\solr-core\test\J1\temp\solr.schema.TestManagedSchemaAPI_E09596BB55A2C286-001\tempDir-001\node2\testschemaapi_shard1_replica2'
[junit4] 2> 3425970 INFO (qtp28974646-51534) [n:127.0.0.1:60858_solr c:testschemaapi s:shard1 x:testschemaapi_shard1_replica2] o.a.s.c.SolrResourceLoader JNDI not configured for solr (NoInitialContextEx)
[junit4] 2> 3425970 INFO (qtp28974646-51534) [n:127.0.0.1:60858_solr c:testschemaapi s:shard1 x:testschemaapi_shard1_replica2] o.a.s.c.SolrResourceLoader solr home defaulted to 'solr/' (could not find system property or JNDI)
[junit4] 2> 3425980 INFO (qtp28974646-51534) [n:127.0.0.1:60858_solr c:testschemaapi s:shard1 x:testschemaapi_shard1_replica2] o.a.s.c.Config loaded config solrconfig.xml with version 0
[junit4] 2> 3425983 INFO (qtp10038635-51521) [n:127.0.0.1:60856_solr c:testschemaapi s:shard1 x:testschemaapi_shard1_replica1] o.a.s.c.SolrConfig current version of requestparams : -1
[junit4] 2> 3425987 INFO (qtp10038635-51521) [n:127.0.0.1:60856_solr c:testschemaapi s:shard1 x:testschemaapi_shard1_replica1] o.a.s.c.SolrConfig Using Lucene MatchVersion: 6.2.0
[junit4] 2> 3425992 INFO (qtp10038635-51521) [n:127.0.0.1:60856_solr c:testschemaapi s:shard1 x:testschemaapi_shard1_replica1] o.a.s.c.SolrConfig Loaded SolrConfig: solrconfig.xml
[junit4] 2> 3425993 INFO (qtp28974646-51534) [n:127.0.0.1:60858_solr c:testschemaapi s:shard1 x:testschemaapi_shard1_replica2] o.a.s.c.SolrConfig current version of requestparams : -1
[junit4] 2> 3426013 INFO (qtp10038635-51521) [n:127.0.0.1:60856_solr c:testschemaapi s:shard1 x:testschemaapi_shard1_replica1] o.a.s.s.IndexSchema [testschemaapi_shard1_replica1] Schema name=minimal
[junit4] 2> 3426015 INFO (qtp28974646-51534) [n:127.0.0.1:60858_solr c:testschemaapi s:shard1 x:testschemaapi_shard1_replica2] o.a.s.c.SolrConfig Using Lucene MatchVersion: 6.2.0
[junit4] 2> 3426021 INFO (qtp10038635-51521) [n:127.0.0.1:60856_solr c:testschemaapi s:shard1 x:testschemaapi_shard1_replica1] o.a.s.s.IndexSchema unique key field: id
[junit4] 2> 3426023 INFO (qtp28974646-51534) [n:127.0.0.1:60858_solr c:testschemaapi s:shard1 x:testschemaapi_shard1_replica2] o.a.s.c.SolrConfig Loaded SolrConfig: solrconfig.xml
[junit4] 2> 3426029 INFO (qtp28974646-51534) [n:127.0.0.1:60858_solr c:testschemaapi s:shard1 x:testschemaapi_shard1_replica2] o.a.s.s.IndexSchema [testschemaapi_shard1_replica2] Schema name=minimal
[junit4] 2> 3426032 INFO (qtp10038635-51521) [n:127.0.0.1:60856_solr c:testschemaapi s:shard1 x:testschemaapi_shard1_replica1] o.a.s.c.ConfigSetProperties Did not find ConfigSet properties, assuming default properties: Can't find resource 'configsetprops.json' in classpath or '/configs/conf1', cwd=C:\Users\jenkins\workspace\Lucene-Solr-6.x-Windows\solr\build\solr-core\test\J1
[junit4] 2> 3426032 INFO (qtp10038635-51521) [n:127.0.0.1:60856_solr c:testschemaapi s:shard1 x:testschemaapi_shard1_replica1] o.a.s.c.CoreContainer Creating SolrCore 'testschemaapi_shard1_replica1' using configuration from collection testschemaapi
[junit4] 2> 3426033 INFO (qtp10038635-51521) [n:127.0.0.1:60856_solr c:testschemaapi s:shard1 r:core_node1 x:testschemaapi_shard1_replica1] o.a.s.c.SolrCore org.apache.solr.core.MockDirectoryFactory
[junit4] 2> 3426033 INFO (qtp10038635-51521) [n:127.0.0.1:60856_solr c:testschemaapi s:shard1 r:core_node1 x:testschemaapi_shard1_replica1] o.a.s.c.SolrCore [[testschemaapi_shard1_replica1] ] Opening new SolrCore at [C:\Users\jenkins\workspace\Lucene-Solr-6.x-Windows\solr\build\solr-core\test\J1\temp\solr.schema.TestManagedSchemaAPI_E09596BB55A2C286-001\tempDir-001\node1\testschemaapi_shard1_replica1], dataDir=[C:\Users\jenkins\workspace\Lucene-Solr-6.x-Windows\solr\build\solr-core\test\J1\temp\solr.schema.TestManagedSchemaAPI_E09596BB55A2C286-001\tempDir-001\node1\.\testschemaapi_shard1_replica1\data\]
[junit4] 2> 3426033 INFO (qtp10038635-51521) [n:127.0.0.1:60856_solr c:testschemaapi s:shard1 r:core_node1 x:testschemaapi_shard1_replica1] o.a.s.c.SolrCore JMX monitoring not detected for core: testschemaapi_shard1_replica1
[junit4] 2> 3426034 INFO (qtp28974646-51534) [n:127.0.0.1:60858_solr c:testschemaapi s:shard1 x:testschemaapi_shard1_replica2] o.a.s.s.IndexSchema unique key field: id
[junit4] 2> 3426035 INFO (qtp10038635-51521) [n:127.0.0.1:60856_solr c:testschemaapi s:shard1 r:core_node1 x:testschemaapi_shard1_replica1] o.a.s.c.CachingDirectoryFactory return new directory for C:\Users\jenkins\workspace\Lucene-Solr-6.x-Windows\solr\build\solr-core\test\J1\temp\solr.schema.TestManagedSchemaAPI_E09596BB55A2C286-001\tempDir-001\node1\.\testschemaapi_shard1_replica1\data\
[junit4] 2> 3426035 INFO (qtp10038635-51521) [n:127.0.0.1:60856_solr c:testschemaapi s:shard1 r:core_node1 x:testschemaapi_shard1_replica1] o.a.s.c.SolrCore New index directory detected: old=null new=C:\Users\jenkins\workspace\Lucene-Solr-6.x-Windows\solr\build\solr-core\test\J1\temp\solr.schema.TestManagedSchemaAPI_E09596BB55A2C286-001\tempDir-001\node1\.\testschemaapi_shard1_replica1\data\index/
[junit4] 2> 3426036 WARN (qtp10038635-51521) [n:127.0.0.1:60856_solr c:testschemaapi s:shard1 r:core_node1 x:testschemaapi_shard1_replica1] o.a.s.c.SolrCore [testschemaapi_shard1_replica1] Solr index directory 'C:\Users\jenkins\workspace\Lucene-Solr-6.x-Windows\solr\build\solr-core\test\J1\temp\solr.schema.TestManagedSchemaAPI_E09596BB55A2C286-001\tempDir-001\node1\.\testschemaapi_shard1_replica1\data\index' doesn't exist. Creating new index...
[junit4] 2> 3426037 INFO (qtp28974646-51534) [n:127.0.0.1:60858_solr c:testschemaapi s:shard1 x:testschemaapi_shard1_replica2] o.a.s.c.ConfigSetProperties Did not find ConfigSet properties, assuming default properties: Can't find resource 'configsetprops.json' in classpath or '/configs/conf1', cwd=C:\Users\jenkins\workspace\Lucene-Solr-6.x-Windows\solr\build\solr-core\test\J1
[junit4] 2> 3426037 INFO (qtp28974646-51534) [n:127.0.0.1:60858_solr c:testschemaapi s:shard1 x:testschemaapi_shard1_replica2] o.a.s.c.CoreContainer Creating SolrCore 'testschemaapi_shard1_replica2' using configuration from collection testschemaapi
[junit4] 2> 3426037 INFO (qtp10038635-51521) [n:127.0.0.1:60856_solr c:testschemaapi s:shard1 r:core_node1 x:testschemaapi_shard1_replica1] o.a.s.c.CachingDirectoryFactory return new directory for C:\Users\jenkins\workspace\Lucene-Solr-6.x-Windows\solr\build\solr-core\test\J1\temp\solr.schema.TestManagedSchemaAPI_E09596BB55A2C286-001\tempDir-001\node1\.\testschemaapi_shard1_replica1\data\index
[junit4] 2> 3426038 INFO (qtp28974646-51534) [n:127.0.0.1:60858_solr c:testschemaapi s:shard1 r:core_node2 x:testschemaapi_shard1_replica2] o.a.s.c.SolrCore org.apache.solr.core.MockDirectoryFactory
[junit4] 2> 3426038 INFO (qtp28974646-51534) [n:127.0.0.1:60858_solr c:testschemaapi s:shard1 r:core_node2 x:testschemaapi_shard1_replica2] o.a.s.c.SolrCore [[testschemaapi_shard1_replica2] ] Opening new SolrCore at [C:\Users\jenkins\workspace\Lucene-Solr-6.x-Windows\solr\build\solr-core\test\J1\temp\solr.schema.TestManagedSchemaAPI_E09596BB55A2C286-001\tempDir-001\node2\testschemaapi_shard1_replica2], dataDir=[C:\Users\jenkins\workspace\Lucene-Solr-6.x-Windows\solr\build\solr-core\test\J1\temp\solr.schema.TestManagedSchemaAPI_E09596BB55A2C286-001\tempDir-001\node2\.\testschemaapi_shard1_replica2\data\]
[junit4] 2> 3426038 INFO (qtp28974646-51534) [n:127.0.0.1:60858_solr c:testschemaapi s:shard1 r:core_node2 x:testschemaapi_shard1_replica2] o.a.s.c.SolrCore JMX monitoring not detected for core: testschemaapi_shard1_replica2
[junit4] 2> 3426039 INFO (qtp28974646-51534) [n:127.0.0.1:60858_solr c:testschemaapi s:shard1 r:core_node2 x:testschemaapi_shard1_replica2] o.a.s.c.CachingDirectoryFactory return new directory for C:\Users\jenkins\workspace\Lucene-Solr-6.x-Windows\solr\build\solr-core\test\J1\temp\solr.schema.TestManagedSchemaAPI_E09596BB55A2C286-001\tempDir-001\node2\.\testschemaapi_shard1_replica2\data\
[junit4] 2> 3426039 INFO (qtp28974646-51534) [n:127.0.0.1:60858_solr c:testschemaapi s:shard1 r:core_node2 x:testschemaapi_shard1_replica2] o.a.s.c.SolrCore New index directory detected: old=null new=C:\Users\jenkins\workspace\Lucene-Solr-6.x-Windows\solr\build\solr-core\test\J1\temp\solr.schema.TestManagedSchemaAPI_E09596BB55A2C286-001\tempDir-001\node2\.\testschemaapi_shard1_replica2\data\index/
[junit4] 2> 3426039 WARN (qtp28974646-51534) [n:127.0.0.1:60858_solr c:testschemaapi s:shard1 r:core_node2 x:testschemaapi_shard1_replica2] o.a.s.c.SolrCore [testschemaapi_shard1_replica2] Solr index directory 'C:\Users\jenkins\workspace\Lucene-Solr-6.x-Windows\solr\build\solr-core\test\J1\temp\solr.schema.TestManagedSchemaAPI_E09596BB55A2C286-001\tempDir-001\node2\.\testschemaapi_shard1_replica2\data\index' doesn't exist. Creating new index...
[junit4] 2> 3426039 INFO (qtp28974646-51534) [n:127.0.0.1:60858_solr c:testschemaapi s:shard1 r:core_node2 x:testschemaapi_shard1_replica2] o.a.s.c.CachingDirectoryFactory return new directory for C:\Users\jenkins\workspace\Lucene-Solr-6.x-Windows\solr\build\solr-core\test\J1\temp\solr.schema.TestManagedSchemaAPI_E09596BB55A2C286-001\tempDir-001\node2\.\testschemaapi_shard1_replica2\data\index
[junit4] 2> 3426041 INFO (qtp10038635-51521) [n:127.0.0.1:60856_solr c:testschemaapi s:shard1 r:core_node1 x:testschemaapi_shard1_replica1] o.a.s.c.SolrDeletionPolicy SolrDeletionPolicy.onCommit: commits: num=1
[junit4] 2> commit{dir=MockDirectoryWrapper(RAMDirectory@788d6c lockFactory=org.apache.lucene.store.SingleInstanceLockFactory@1523614),segFN=segments_1,generation=1}
[junit4] 2> 3426041 INFO (qtp10038635-51521) [n:127.0.0.1:60856_solr c:testschemaapi s:shard1 r:core_node1 x:testschemaapi_shard1_replica1] o.a.s.c.SolrDeletionPolicy newest commit generation = 1
[junit4] 2> 3426044 INFO (qtp10038635-51521) [n:127.0.0.1:60856_solr c:testschemaapi s:shard1 r:core_node1 x:testschemaapi_shard1_replica1] o.a.s.c.SolrCore no updateRequestProcessorChain defined as default, creating implicit default
[junit4] 2> 3426045 INFO (qtp28974646-51534) [n:127.0.0.1:60858_solr c:testschemaapi s:shard1 r:core_node2 x:testschemaapi_shard1_replica2] o.a.s.c.SolrDeletionPolicy SolrDeletionPolicy.onCommit: commits: num=1
[junit4] 2> commit{dir=MockDirectoryWrapper(RAMDirectory@189cf9a lockFactory=org.apache.lucene.store.SingleInstanceLockFactory@8eada6),segFN=segments_1,generation=1}
[junit4] 2> 3426045 INFO (qtp28974646-51534) [n:127.0.0.1:60858_solr c:testschemaapi s:shard1 r:core_node2 x:testschemaapi_shard1_replica2] o.a.s.c.SolrDeletionPolicy newest commit generation = 1
[junit4] 2> 3426051 INFO (qtp28974646-51534) [n:127.0.0.1:60858_solr c:testschemaapi s:shard1 r:core_node2 x:testschemaapi_shard1_replica2] o.a.s.c.SolrCore no updateRequestProcessorChain defined as default, creating implicit default
[junit4] 2> 3426053 INFO (OldIndexDirectoryCleanupThreadForCore-testschemaapi_shard1_replica1) [n:127.0.0.1:60856_solr c:testschemaapi s:shard1 r:core_node1 x:testschemaapi_shard1_replica1] o.a.s.c.SolrCore Looking for old index directories to cleanup for core testschemaapi_shard1_replica1 in C:\Users\jenkins\workspace\Lucene-Solr-6.x-Windows\solr\build\solr-core\test\J1\temp\solr.schema.TestManagedSchemaAPI_E09596BB55A2C286-001\tempDir-001\node1\.\testschemaapi_shard1_replica1\data\
[junit4] 2> 3426053 INFO (OldIndexDirectoryCleanupThreadForCore-testschemaapi_shard1_replica2) [n:127.0.0.1:60858_solr c:testschemaapi s:shard1 r:core_node2 x:testschemaapi_shard1_replica2] o.a.s.c.SolrCore Looking for old index directories to cleanup for core testschemaapi_shard1_replica2 in C:\Users\jenkins\workspace\Lucene-Solr-6.x-Windows\solr\build\solr-core\test\J1\temp\solr.schema.TestManagedSchemaAPI_E09596BB55A2C286-001\tempDir-001\node2\.\testschemaapi_shard1_replica2\data\
[junit4] 2> 3426054 WARN (OldIndexDirectoryCleanupThreadForCore-testschemaapi_shard1_replica2) [n:127.0.0.1:60858_solr c:testschemaapi s:shard1 r:core_node2 x:testschemaapi_shard1_replica2] o.a.s.c.DirectoryFactory C:\Users\jenkins\workspace\Lucene-Solr-6.x-Windows\solr\build\solr-core\test\J1\temp\solr.schema.TestManagedSchemaAPI_E09596BB55A2C286-001\tempDir-001\node2\.\testschemaapi_shard1_replica2\data\ does not point to a valid data directory; skipping clean-up of old index directories.
[junit4] 2> 3426054 WARN (OldIndexDirectoryCleanupThreadForCore-testschemaapi_shard1_replica1) [n:127.0.0.1:60856_solr c:testschemaapi s:shard1 r:core_node1 x:testschemaapi_shard1_replica1] o.a.s.c.DirectoryFactory C:\Users\jenkins\workspace\Lucene-Solr-6.x-Windows\solr\build\solr-core\test\J1\temp\solr.schema.TestManagedSchemaAPI_E09596BB55A2C286-001\tempDir-001\node1\.\testschemaapi_shard1_replica1\data\ does not point to a valid data directory; skipping clean-up of old index directories.
[junit4] 2> 3426054 INFO (qtp28974646-51534) [n:127.0.0.1:60858_solr c:testschemaapi s:shard1 r:core_node2 x:testschemaapi_shard1_replica2] o.a.s.h.l.XMLLoader xsltCacheLifetimeSeconds=60
[junit4] 2> 3426057 INFO (qtp10038635-51521) [n:127.0.0.1:60856_solr c:testschemaapi s:shard1 r:core_node1 x:testschemaapi_shard1_replica1] o.a.s.h.l.XMLLoader xsltCacheLifetimeSeconds=60
[junit4] 2> 3426059 INFO (qtp28974646-51534) [n:127.0.0.1:60858_solr c:testschemaapi s:shard1 r:core_node2 x:testschemaapi_shard1_replica2] o.a.s.h.l.XMLLoader xsltCacheLifetimeSeconds=60
[junit4] 2> 3426059 INFO (qtp10038635-51521) [n:127.0.0.1:60856_solr c:testschemaapi s:shard1 r:core_node1 x:testschemaapi_shard1_replica1] o.a.s.h.l.XMLLoader xsltCacheLifetimeSeconds=60
[junit4] 2> 3426060 INFO (qtp10038635-51521) [n:127.0.0.1:60856_solr c:testschemaapi s:shard1 r:core_node1 x:testschemaapi_shard1_replica1] o.a.s.h.l.XMLLoader xsltCacheLifetimeSeconds=60
[junit4] 2> 3426061 INFO (qtp28974646-51534) [n:127.0.0.1:60858_solr c:testschemaapi s:shard1 r:core_node2 x:testschemaapi_shard1_replica2] o.a.s.h.l.XMLLoader xsltCacheLifetimeSeconds=60
[junit4] 2> 3426061 INFO (qtp10038635-51521) [n:127.0.0.1:60856_solr c:testschemaapi s:shard1 r:core_node1 x:testschemaapi_shard1_replica1] o.a.s.h.l.XMLLoader xsltCacheLifetimeSeconds=60
[junit4] 2> 3426063 INFO (qtp28974646-51534) [n:127.0.0.1:60858_solr c:testschemaapi s:shard1 r:core_node2 x:testschemaapi_shard1_replica2] o.a.s.h.l.XMLLoader xsltCacheLifetimeSeconds=60
[junit4] 2> 3426064 INFO (qtp10038635-51521) [n:127.0.0.1:60856_solr c:testschemaapi s:shard1 r:core_node1 x:testschemaapi_shard1_replica1] o.a.s.c.RequestHandlers Registered paths: /admin/mbeans,/update/csv,/sql,/update/json/docs,/admin/luke,/graph,/export,/select,/admin/segments,/get,/admin/system,/replication,/admin/properties,/config,/stream,/schema,/admin/plugins,/admin/logging,/update/json,/admin/ping,/admin/threads,/update,/admin/file
[junit4] 2> 3426064 INFO (qtp10038635-51521) [n:127.0.0.1:60856_solr c:testschemaapi s:shard1 r:core_node1 x:testschemaapi_shard1_replica1] o.a.s.c.SolrCore Using default statsCache cache: org.apache.solr.search.stats.LocalStatsCache
[junit4] 2> 3426065 INFO (qtp10038635-51521) [n:127.0.0.1:60856_solr c:testschemaapi s:shard1 r:core_node1 x:testschemaapi_shard1_replica1] o.a.s.u.UpdateHandler Using UpdateLog implementation: org.apache.solr.update.UpdateLog
[junit4] 2> 3426065 INFO (qtp10038635-51521) [n:127.0.0.1:60856_solr c:testschemaapi s:shard1 r:core_node1 x:testschemaapi_shard1_replica1] o.a.s.u.UpdateLog Initializing UpdateLog: dataDir=null defaultSyncLevel=FLUSH numRecordsToKeep=100 maxNumLogsToKeep=10 numVersionBuckets=65536
[junit4] 2> 3426066 INFO (qtp28974646-51534) [n:127.0.0.1:60858_solr c:testschemaapi s:shard1 r:core_node2 x:testschemaapi_shard1_replica2] o.a.s.c.RequestHandlers Registered paths: /admin/mbeans,/update/csv,/sql,/update/json/docs,/admin/luke,/graph,/export,/select,/admin/segments,/get,/admin/system,/replication,/admin/properties,/config,/stream,/schema,/admin/plugins,/admin/logging,/update/json,/admin/ping,/admin/threads,/update,/admin/file
[junit4] 2> 3426066 INFO (qtp28974646-51534) [n:127.0.0.1:60858_solr c:testschemaapi s:shard1 r:core_node2 x:testschemaapi_shard1_replica2] o.a.s.c.SolrCore Using default statsCache cache: org.apache.solr.search.stats.LocalStatsCache
[junit4] 2> 3426068 INFO (qtp28974646-51534) [n:127.0.0.1:60858_solr c:testschemaapi s:shard1 r:core_node2 x:testschemaapi_shard1_replica2] o.a.s.u.UpdateHandler Using UpdateLog implementation: org.apache.solr.update.UpdateLog
[junit4] 2> 3426068 INFO (qtp28974646-51534) [n:127.0.0.1:60858_solr c:testschemaapi s:shard1 r:core_node2 x:testschemaapi_shard1_replica2] o.a.s.u.UpdateLog Initializing UpdateLog: dataDir=null defaultSyncLevel=FLUSH numRecordsToKeep=100 maxNumLogsToKeep=10 numVersionBuckets=65536
[junit4] 2> 3426068 INFO (qtp10038635-51521) [n:127.0.0.1:60856_solr c:testschemaapi s:shard1 r:core_node1 x:testschemaapi_shard1_replica1] o.a.s.u.CommitTracker Hard AutoCommit: disabled
[junit4] 2> 3426068 INFO (qtp10038635-51521) [n:127.0.0.1:60856_solr c:testschemaapi s:shard1 r:core_node1 x:testschemaapi_shard1_replica1] o.a.s.u.CommitTracker Soft AutoCommit: disabled
[junit4] 2> 3426071 INFO (qtp28974646-51534) [n:127.0.0.1:60858_solr c:testschemaapi s:shard1 r:core_node2 x:testschemaapi_shard1_replica2] o.a.s.u.CommitTracker Hard AutoCommit: disabled
[junit4] 2> 3426071 INFO (qtp28974646-51534) [n:127.0.0.1:60858_solr c:testschemaapi s:shard1 r:core_node2 x:testschemaapi_shard1_replica2] o.a.s.u.CommitTracker Soft AutoCommit: disabled
[junit4] 2> 3426077 INFO (qtp10038635-51521) [n:127.0.0.1:60856_solr c:testschemaapi s:shard1 r:core_node1 x:testschemaapi_shard1_replica1] o.a.s.c.SolrDeletionPolicy SolrDeletionPolicy.onInit: commits: num=1
[junit4] 2> commit{dir=MockDirectoryWrapper(RAMDirectory@788d6c lockFactory=org.apache.lucene.store.SingleInstanceLockFactory@1523614),segFN=segments_1,generation=1}
[junit4] 2> 3426077 INFO (qtp10038635-51521) [n:127.0.0.1:60856_solr c:testschemaapi s:shard1 r:core_node1 x:testschemaapi_shard1_replica1] o.a.s.c.SolrDeletionPolicy newest commit generation = 1
[junit4] 2> 3426078 INFO (qtp10038635-51521) [n:127.0.0.1:60856_solr c:testschemaapi s:shard1 r:core_node1 x:testschemaapi_shard1_replica1] o.a.s.s.SolrIndexSearcher Opening [Searcher@102f159[testschemaapi_shard1_replica1] main]
[junit4] 2> 3426078 INFO (qtp10038635-51521) [n:127.0.0.1:60856_solr c:testschemaapi s:shard1 r:core_node1 x:testschemaapi_shard1_replica1] o.a.s.c.c.ZkStateReader Load collection config from: [/collections/testschemaapi]
[junit4] 2> 3426082 INFO (qtp10038635-51521) [n:127.0.0.1:60856_solr c:testschemaapi s:shard1 r:core_node1 x:testschemaapi_shard1_replica1] o.a.s.c.c.ZkStateReader path=[/collections/testschemaapi] [configName]=[conf1] specified config exists in ZooKeeper
[junit4] 2> 3426082 INFO (qtp10038635-51521) [n:127.0.0.1:60856_solr c:testschemaapi s:shard1 r:core_node1 x:testschemaapi_shard1_replica1] o.a.s.r.ManagedResourceStorage Setting up ZooKeeper-based storage for the RestManager with znodeBase: /configs/conf1
[junit4] 2> 3426084 INFO (qtp10038635-51521) [n:127.0.0.1:60856_solr c:testschemaapi s:shard1 r:core_node1 x:testschemaapi_shard1_replica1] o.a.s.r.ManagedResourceStorage Configured ZooKeeperStorageIO with znodeBase: /configs/conf1
[junit4] 2> 3426084 INFO (qtp10038635-51521) [n:127.0.0.1:60856_solr c:testschemaapi s:shard1 r:core_node1 x:testschemaapi_shard1_replica1] o.a.s.r.RestManager Initializing RestManager with initArgs: {}
[junit4] 2> 3426084 INFO (qtp10038635-51521) [n:127.0.0.1:60856_solr c:testschemaapi s:shard1 r:core_node1 x:testschemaapi_shard1_replica1] o.a.s.r.ManagedResourceStorage Reading _rest_managed.json using ZooKeeperStorageIO:path=/configs/conf1
[junit4] 2> 3426085 INFO (qtp10038635-51521) [n:127.0.0.1:60856_solr c:testschemaapi s:shard1 r:core_node1 x:testschemaapi_shard1_replica1] o.a.s.r.ManagedResourceStorage No data found for znode /configs/conf1/_rest_managed.json
[junit4] 2> 3426086 INFO (qtp10038635-51521) [n:127.0.0.1:60856_solr c:testschemaapi s:shard1 r:core_node1 x:testschemaapi_shard1_replica1] o.a.s.r.ManagedResourceStorage Loaded null at path _rest_managed.json using ZooKeeperStorageIO:path=/configs/conf1
[junit4] 2> 3426086 INFO (qtp10038635-51521) [n:127.0.0.1:60856_solr c:testschemaapi s:shard1 r:core_node1 x:testschemaapi_shard1_replica1] o.a.s.r.RestManager Initializing 0 registered ManagedResources
[junit4] 2> 3426086 INFO (qtp10038635-51521) [n:127.0.0.1:60856_solr c:testschemaapi s:shard1 r:core_node1 x:testschemaapi_shard1_replica1] o.a.s.s.ZkIndexSchemaReader Creating ZooKeeper watch for the managed schema at /configs/conf1/managed-schema
[junit4] 2> 3426087 INFO (qtp28974646-51534) [n:127.0.0.1:60858_solr c:testschemaapi s:shard1 r:core_node2 x:testschemaapi_shard1_replica2] o.a.s.c.SolrDeletionPolicy SolrDeletionPolicy.onInit: commits: num=1
[junit4] 2> commit{dir=MockDirectoryWrapper(RAMDirectory@189cf9a lockFactory=org.apache.lucene.store.SingleInstanceLockFactory@8eada6),segFN=segments_1,generation=1}
[junit4] 2> 3426087 INFO (qtp28974646-51534) [n:127.0.0.1:60858_solr c:testschemaapi s:shard1 r:core_node2 x:testschemaapi_shard1_replica2] o.a.s.c.SolrDeletionPolicy newest commit generation = 1
[junit4] 2> 3426088 INFO (qtp10038635-51521) [n:127.0.0.1:60856_solr c:testschemaapi s:shard1 r:core_node1 x:testschemaapi_shard1_replica1] o.a.s.c.ZkController Added new OnReconnect listener ZkIndexSchemaReader: /configs/conf1/managed-schema, uniqueCoreId: testschemaapi_shard1_replica1:267100259688207
[junit4] 2> 3426088 INFO (qtp10038635-51521) [n:127.0.0.1:60856_solr c:testschemaapi s:shard1 r:core_node1 x:testschemaapi_shard1_replica1] o.a.s.h.ReplicationHandler Commits will be reserved for 10000
[junit4] 2> 3426089 INFO (qtp10038635-51521) [n:127.0.0.1:60856_solr c:testschemaapi s:shard1 r:core_node1 x:testschemaapi_shard1_replica1] o.a.s.u.UpdateLog Looking up max value of version field to seed version buckets
[junit4] 2> 3426089 INFO (qtp10038635-51521) [n:127.0.0.1:60856_solr c:testschemaapi s:shard1 r:core_node1 x:testschemaapi_shard1_replica1] o.a.s.u.VersionInfo Refreshing highest value of _version_ for 65536 version buckets from index
[junit4] 2> 3426089 INFO (qtp10038635-51521) [n:127.0.0.1:60856_solr c:testschemaapi s:shard1 r:core_node1 x:testschemaapi_shard1_replica1] o.a.s.u.VersionInfo No terms found for _version_, cannot seed version bucket highest value from index
[junit4] 2> 3426089 INFO (qtp10038635-51521) [n:127.0.0.1:60856_solr c:testschemaapi s:shard1 r:core_node1 x:testschemaapi_shard1_replica1] o.a.s.u.UpdateLog Could not find max version in index or recent updates, using new clock 1537591872283738112
[junit4] 2> 3426090 INFO (qtp28974646-51534) [n:127.0.0.1:60858_solr c:testschemaapi s:shard1 r:core_node2 x:testschemaapi_shard1_replica2] o.a.s.s.SolrIndexSearcher Opening [Searcher@12f1ee0[testschemaapi_shard1_replica2] main]
[junit4] 2> 3426090 INFO (qtp28974646-51534) [n:127.0.0.1:60858_solr c:testschemaapi s:shard1 r:core_node2 x:testschemaapi_shard1_replica2] o.a.s.c.c.ZkStateReader Load collection config from: [/collections/testschemaapi]
[junit4] 2> 3426091 INFO (searcherExecutor-12545-thread-1-processing-n:127.0.0.1:60856_solr x:testschemaapi_shard1_replica1 s:shard1 c:testschemaapi r:core_node1) [n:127.0.0.1:60856_solr c:testschemaapi s:shard1 r:core_node1 x:testschemaapi_shard1_replica1] o.a.s.c.SolrCore [testschemaapi_shard1_replica1] Registered new searcher Searcher@102f159[testschemaapi_shard1_replica1] main{ExitableDirectoryReader(UninvertingDirectoryReader())}
[junit4] 2> 3426092 INFO (qtp10038635-51521) [n:127.0.0.1:60856_solr c:testschemaapi s:shard1 r:core_node1 x:testschemaapi_shard1_replica1] o.a.s.u.UpdateLog Took 3.0ms to seed version buckets with highest version 1537591872283738112
[junit4] 2> 3426093 INFO (qtp10038635-51521) [n:127.0.0.1:60856_solr c:testschemaapi s:shard1 r:core_node1 x:testschemaapi_shard1_replica1] o.a.s.c.ZkController watch zkdir /configs/conf1
[junit4] 2> 3426093 INFO (qtp28974646-51534) [n:127.0.0.1:60858_solr c:testschemaapi s:shard1 r:core_node2 x:testschemaapi_shard1_replica2] o.a.s.c.c.ZkStateReader path=[/collections/testschemaapi] [configName]=[conf1] specified config exists in ZooKeeper
[junit4] 2> 3426093 INFO (qtp28974646-51534) [n:127.0.0.1:60858_solr c:testschemaapi s:shard1 r:core_node2 x:testschemaapi_shard1_replica2] o.a.s.r.ManagedResourceStorage Setting up ZooKeeper-based storage for the RestManager with znodeBase: /configs/conf1
[junit4] 2> 3426094 INFO (qtp10038635-51521) [n:127.0.0.1:60856_solr c:testschemaapi s:shard1 r:core_node1 x:testschemaapi_shard1_replica1] o.a.s.c.CoreContainer registering core: testschemaapi_shard1_replica1
[junit4] 2> 3426094 INFO (qtp10038635-51521) [n:127.0.0.1:60856_solr c:testschemaapi s:shard1 r:core_node1 x:testschemaapi_shard1_replica1] o.a.s.c.ZkController Register replica - core:testschemaapi_shard1_replica1 address:http://127.0.0.1:60856/solr collection:testschemaapi shard:shard1
[junit4] 2> 3426095 INFO (qtp28974646-51534) [n:127.0.0.1:60858_solr c:testschemaapi s:shard1 r:core_node2 x:testschemaapi_shard1_replica2] o.a.s.r.ManagedResourceStorage Configured ZooKeeperStorageIO with znodeBase: /configs/conf1
[junit4] 2> 3426095 INFO (qtp28974646-51534) [n:127.0.0.1:60858_solr c:testschemaapi s:shard1 r:core_node2 x:testschemaapi_shard1_replica2] o.a.s.r.RestManager Initializing RestManager with initArgs: {}
[junit4] 2> 3426095 INFO (qtp28974646-51534) [n:127.0.0.1:60858_solr c:testschemaapi s:shard1 r:core_node2 x:testschemaapi_shard1_replica2] o.a.s.r.ManagedResourceStorage Reading _rest_managed.json using ZooKeeperStorageIO:path=/configs/conf1
[junit4] 2> 3426096 INFO (qtp10038635-51521) [n:127.0.0.1:60856_solr c:testschemaapi s:shard1 r:core_node1 x:testschemaapi_shard1_replica1] o.a.s.c.c.SolrZkClient makePath: /collections/testschemaapi/leader_elect/shard1/election
[junit4] 2> 3426097 INFO (qtp28974646-51534) [n:127.0.0.1:60858_solr c:testschemaapi s:shard1 r:core_node2 x:testschemaapi_shard1_replica2] o.a.s.r.ManagedResourceStorage No data found for znode /configs/conf1/_rest_managed.json
[junit4] 2> 3426097 INFO (qtp28974646-51534) [n:127.0.0.1:60858_solr c:testschemaapi s:shard1 r:core_node2 x:testschemaapi_shard1_replica2] o.a.s.r.ManagedResourceStorage Loaded null at path _rest_managed.json using ZooKeeperStorageIO:path=/configs/conf1
[junit4] 2> 3426097 INFO (qtp28974646-51534) [n:127.0.0.1:60858_solr c:testschemaapi s:shard1 r:core_node2 x:testschemaapi_shard1_replica2] o.a.s.r.RestManager Initializing 0 registered ManagedResources
[junit4] 2> 3426097 INFO (qtp28974646-51534) [n:127.0.0.1:60858_solr c:testschemaapi s:shard1 r:core_node2 x:testschemaapi_shard1_replica2] o.a.s.s.ZkIndexSchemaReader Creating ZooKeeper watch for the managed schema at /configs/conf1/managed-schema
[junit4] 2> 3426098 INFO (qtp28974646-51534) [n:127.0.0.1:60858_solr c:testschemaapi s:shard1 r:core_node2 x:testschemaapi_shard1_replica2] o.a.s.c.ZkController Added new OnReconnect listener ZkIndexSchemaReader: /configs/conf1/managed-schema, uniqueCoreId: testschemaapi_shard1_replica2:267100264812848
[junit4] 2> 3426099 INFO (qtp28974646-51534) [n:127.0.0.1:60858_solr c:testschemaapi s:shard1 r:core_node2 x:testschemaapi_shard1_replica2] o.a.s.h.ReplicationHandler Commits will be reserved for 10000
[junit4] 2> 3426099 INFO (qtp28974646-51534) [n:127.0.0.1:60858_solr c:testschemaapi s:shard1 r:core_node2 x:testschemaapi_s
[...truncated too long message...]
rmVectorComponentTest, FieldAnalysisRequestHandlerTest, IndexSchemaRuntimeFieldTest, RegexBoostProcessorTest, UpdateRequestProcessorFactoryTest, TestCSVResponseWriter, UniqFieldsUpdateProcessorFactoryTest, BinaryUpdateRequestHandlerTest, TestPartialUpdateDeduplication, TestComponentsName, SearchHandlerTest, HighlighterConfigTest, SOLR749Test, UpdateParamsTest, AlternateDirectoryTest, TestSolrIndexConfig, CopyFieldTest, ResponseLogComponentTest, BadComponentTest, TestStressRecovery, TestMergePolicyConfig, TestSolrDeletionPolicy2, MultiTermTest, SampleTest, TestSearchPerf, NumericFieldsTest, OutputWriterTest, ExternalFileFieldSortTest, TestSolrCoreProperties, TestPostingsSolrHighlighter, DirectSolrConnectionTest, TestPhraseSuggestions, TestCharFilters, SynonymTokenizerTest, TestXIncludeConfig, TestDFRSimilarityFactory, ResourceLoaderTest, URLClassifyProcessorTest, TestFastLRUCache, PrimUtilsTest, SpellingQueryConverterTest, DOMUtilTest, ClusterStateTest, TestUtils, SliceStateTest, CircularListTest, CursorPagingTest, TestCrossCoreJoin, TestSimpleTrackingShardHandler, TestEmbeddedSolrServerConstructors, TestJettySolrRunner, ActionThrottleTest, AliasIntegrationTest, BaseCdcrDistributedZkTest, CdcrVersionReplicationTest, CollectionStateFormat2Test, CollectionsAPISolrJTest, DeleteReplicaTest, DistribJoinFromCollectionTest, DistributedQueueTest, ForceLeaderTest, RecoveryAfterSoftCommitTest, ReplicationFactorTest, RestartWhileUpdatingTest, SSLMigrationTest, SaslZkACLProviderTest, TestCloudDeleteByQuery, TestCloudPivotFacet, TestCollectionAPI, TestConfigSetsAPI, TestDistribDocBasedVersion, TestMiniSolrCloudCluster, TestSolrCloudWithKerberosAlt, TestStressLiveNodes, ExitableDirectoryReaderTest, QueryResultKeyTest, TestConfigSetProperties, TestImplicitCoreProperties, TestReloadAndDeleteDocs, TestShardHandlerFactory, TestSolrConfigHandler, TestRestoreCore, TestSQLHandler, InfoHandlerTest, SegmentsInfoRequestHandlerTest, DistributedFacetPivotLongTailTest, FacetPivotSmallTest, TestDistributedStatsComponentCardinality, TestFieldCollectionResource, TestSchemaNameResource, TestSchemaSimilarityResource, TestUniqueKeyFieldResource, DocValuesMissingTest, SpatialRPTFieldTypeTest, TestManagedSchemaAPI]
[junit4] 2> NOTE: reproduce with: ant test -Dtestcase=TestManagedSchemaAPI -Dtests.seed=E09596BB55A2C286 -Dtests.slow=true -Dtests.locale=mt-MT -Dtests.timezone=Antarctica/DumontDUrville -Dtests.asserts=true -Dtests.file.encoding=UTF-8
[junit4] ERROR 0.00s J1 | TestManagedSchemaAPI (suite) <<<
[junit4] > Throwable #1: java.lang.AssertionError: ObjectTracker found 8 object(s) that were not released!!! [MockDirectoryWrapper, TransactionLog, TransactionLog, MockDirectoryWrapper, MockDirectoryWrapper, MDCAwareThreadPoolExecutor, MDCAwareThreadPoolExecutor, MockDirectoryWrapper]
[junit4] > at __randomizedtesting.SeedInfo.seed([E09596BB55A2C286]:0)
[junit4] > at org.apache.solr.SolrTestCaseJ4.teardownTestCases(SolrTestCaseJ4.java:257)
[junit4] > at java.lang.Thread.run(Thread.java:745)Throwable #2: java.io.IOException: Could not remove the following files (in the order of attempts):
[junit4] > C:\Users\jenkins\workspace\Lucene-Solr-6.x-Windows\solr\build\solr-core\test\J1\temp\solr.schema.TestManagedSchemaAPI_E09596BB55A2C286-001\tempDir-001\node2\testschemaapi_shard1_replica2\data\tlog\tlog.0000000000000000000: java.nio.file.FileSystemException: C:\Users\jenkins\workspace\Lucene-Solr-6.x-Windows\solr\build\solr-core\test\J1\temp\solr.schema.TestManagedSchemaAPI_E09596BB55A2C286-001\tempDir-001\node2\testschemaapi_shard1_replica2\data\tlog\tlog.0000000000000000000: The process cannot access the file because it is being used by another process.
[junit4] > C:\Users\jenkins\workspace\Lucene-Solr-6.x-Windows\solr\build\solr-core\test\J1\temp\solr.schema.TestManagedSchemaAPI_E09596BB55A2C286-001\tempDir-001\node2\testschemaapi_shard1_replica2\data\tlog: java.nio.file.DirectoryNotEmptyException: C:\Users\jenkins\workspace\Lucene-Solr-6.x-Windows\solr\build\solr-core\test\J1\temp\solr.schema.TestManagedSchemaAPI_E09596BB55A2C286-001\tempDir-001\node2\testschemaapi_shard1_replica2\data\tlog
[junit4] > C:\Users\jenkins\workspace\Lucene-Solr-6.x-Windows\solr\build\solr-core\test\J1\temp\solr.schema.TestManagedSchemaAPI_E09596BB55A2C286-001\tempDir-001\node2\testschemaapi_shard1_replica2\data: java.nio.file.DirectoryNotEmptyException: C:\Users\jenkins\workspace\Lucene-Solr-6.x-Windows\solr\build\solr-core\test\J1\temp\solr.schema.TestManagedSchemaAPI_E09596BB55A2C286-001\tempDir-001\node2\testschemaapi_shard1_replica2\data
[junit4] > C:\Users\jenkins\workspace\Lucene-Solr-6.x-Windows\solr\build\solr-core\test\J1\temp\solr.schema.TestManagedSchemaAPI_E09596BB55A2C286-001\tempDir-001\node2\testschemaapi_shard1_replica2: java.nio.file.DirectoryNotEmptyException: C:\Users\jenkins\workspace\Lucene-Solr-6.x-Windows\solr\build\solr-core\test\J1\temp\solr.schema.TestManagedSchemaAPI_E09596BB55A2C286-001\tempDir-001\node2\testschemaapi_shard1_replica2
[junit4] > C:\Users\jenkins\workspace\Lucene-Solr-6.x-Windows\solr\build\solr-core\test\J1\temp\solr.schema.TestManagedSchemaAPI_E09596BB55A2C286-001\tempDir-001\node2: java.nio.file.DirectoryNotEmptyException: C:\Users\jenkins\workspace\Lucene-Solr-6.x-Windows\solr\build\solr-core\test\J1\temp\solr.schema.TestManagedSchemaAPI_E09596BB55A2C286-001\tempDir-001\node2
[junit4] > C:\Users\jenkins\workspace\Lucene-Solr-6.x-Windows\solr\build\solr-core\test\J1\temp\solr.schema.TestManagedSchemaAPI_E09596BB55A2C286-001\tempDir-001\node1\testschemaapi_shard1_replica1\data\tlog\tlog.0000000000000000001: java.nio.file.FileSystemException: C:\Users\jenkins\workspace\Lucene-Solr-6.x-Windows\solr\build\solr-core\test\J1\temp\solr.schema.TestManagedSchemaAPI_E09596BB55A2C286-001\tempDir-001\node1\testschemaapi_shard1_replica1\data\tlog\tlog.0000000000000000001: The process cannot access the file because it is being used by another process.
[junit4] > C:\Users\jenkins\workspace\Lucene-Solr-6.x-Windows\solr\build\solr-core\test\J1\temp\solr.schema.TestManagedSchemaAPI_E09596BB55A2C286-001\tempDir-001\node1\testschemaapi_shard1_replica1\data\tlog: java.nio.file.DirectoryNotEmptyException: C:\Users\jenkins\workspace\Lucene-Solr-6.x-Windows\solr\build\solr-core\test\J1\temp\solr.schema.TestManagedSchemaAPI_E09596BB55A2C286-001\tempDir-001\node1\testschemaapi_shard1_replica1\data\tlog
[junit4] > C:\Users\jenkins\workspace\Lucene-Solr-6.x-Windows\solr\build\solr-core\test\J1\temp\solr.schema.TestManagedSchemaAPI_E09596BB55A2C286-001\tempDir-001\node1\testschemaapi_shard1_replica1\data: java.nio.file.DirectoryNotEmptyException: C:\Users\jenkins\workspace\Lucene-Solr-6.x-Windows\solr\build\solr-core\test\J1\temp\solr.schema.TestManagedSchemaAPI_E09596BB55A2C286-001\tempDir-001\node1\testschemaapi_shard1_replica1\data
[junit4] > C:\Users\jenkins\workspace\Lucene-Solr-6.x-Windows\solr\build\solr-core\test\J1\temp\solr.schema.TestManagedSchemaAPI_E09596BB55A2C286-001\tempDir-001\node1\testschemaapi_shard1_replica1: java.nio.file.DirectoryNotEmptyException: C:\Users\jenkins\workspace\Lucene-Solr-6.x-Windows\solr\build\solr-core\test\J1\temp\solr.schema.TestManagedSchemaAPI_E09596BB55A2C286-001\tempDir-001\node1\testschemaapi_shard1_replica1
[junit4] > C:\Users\jenkins\workspace\Lucene-Solr-6.x-Windows\solr\build\solr-core\test\J1\temp\solr.schema.TestManagedSchemaAPI_E09596BB55A2C286-001\tempDir-001\node1: java.nio.file.DirectoryNotEmptyException: C:\Users\jenkins\workspace\Lucene-Solr-6.x-Windows\solr\build\solr-core\test\J1\temp\solr.schema.TestManagedSchemaAPI_E09596BB55A2C286-001\tempDir-001\node1
[junit4] > C:\Users\jenkins\workspace\Lucene-Solr-6.x-Windows\solr\build\solr-core\test\J1\temp\solr.schema.TestManagedSchemaAPI_E09596BB55A2C286-001\tempDir-001: java.nio.file.DirectoryNotEmptyException: C:\Users\jenkins\workspace\Lucene-Solr-6.x-Windows\solr\build\solr-core\test\J1\temp\solr.schema.TestManagedSchemaAPI_E09596BB55A2C286-001\tempDir-001
[junit4] > C:\Users\jenkins\workspace\Lucene-Solr-6.x-Windows\solr\build\solr-core\test\J1\temp\solr.schema.TestManagedSchemaAPI_E09596BB55A2C286-001: java.nio.file.DirectoryNotEmptyException: C:\Users\jenkins\workspace\Lucene-Solr-6.x-Windows\solr\build\solr-core\test\J1\temp\solr.schema.TestManagedSchemaAPI_E09596BB55A2C286-001
[junit4] > at org.apache.lucene.util.IOUtils.rm(IOUtils.java:323)
[junit4] > at java.lang.Thread.run(Thread.java:745)
[junit4] Completed [566/615 (1!)] on J1 in 14.18s, 1 test, 1 failure, 1 error <<< FAILURES!
[...truncated 173 lines...]
BUILD FAILED
C:\Users\jenkins\workspace\Lucene-Solr-6.x-Windows\build.xml:740: The following error occurred while executing this line:
C:\Users\jenkins\workspace\Lucene-Solr-6.x-Windows\build.xml:684: The following error occurred while executing this line:
C:\Users\jenkins\workspace\Lucene-Solr-6.x-Windows\build.xml:59: The following error occurred while executing this line:
C:\Users\jenkins\workspace\Lucene-Solr-6.x-Windows\solr\build.xml:233: The following error occurred while executing this line:
C:\Users\jenkins\workspace\Lucene-Solr-6.x-Windows\solr\common-build.xml:531: The following error occurred while executing this line:
C:\Users\jenkins\workspace\Lucene-Solr-6.x-Windows\lucene\common-build.xml:1427: The following error occurred while executing this line:
C:\Users\jenkins\workspace\Lucene-Solr-6.x-Windows\lucene\common-build.xml:984: There were test failures: 615 suites (10 ignored), 2591 tests, 2 suite-level errors, 126 ignored (82 assumptions) [seed: E09596BB55A2C286]
Total time: 81 minutes 0 seconds
Build step 'Invoke Ant' marked build as failure
Archiving artifacts
[WARNINGS] Skipping publisher since build result is FAILURE
Recording test results
Email was triggered for: Failure - Any
Sending email for trigger: Failure - Any