You are viewing a plain text version of this content. The canonical link for it is here.
Posted to dev@kafka.apache.org by Apache Jenkins Server <je...@builds.apache.org> on 2017/08/23 15:06:06 UTC
Build failed in Jenkins: kafka-trunk-jdk7 #2665
See <https://builds.apache.org/job/kafka-trunk-jdk7/2665/display/redirect?page=changes>
Changes:
[ismael] KAFKA-5417; Fix Selector's handling of some failures during prepare
------------------------------------------
[...truncated 2.43 MB...]
org.apache.kafka.streams.state.internals.RocksDBSessionStoreTest > shouldThrowNullPointerExceptionOnFindSessionsNullKey STARTED
org.apache.kafka.streams.state.internals.RocksDBSessionStoreTest > shouldThrowNullPointerExceptionOnFindSessionsNullKey PASSED
org.apache.kafka.streams.state.internals.RocksDBSessionStoreTest > shouldPutAndFindSessionsInRange STARTED
org.apache.kafka.streams.state.internals.RocksDBSessionStoreTest > shouldPutAndFindSessionsInRange PASSED
org.apache.kafka.streams.state.internals.RocksDBSessionStoreTest > shouldThrowNullPointerExceptionOnFetchNullKey STARTED
org.apache.kafka.streams.state.internals.RocksDBSessionStoreTest > shouldThrowNullPointerExceptionOnFetchNullKey PASSED
org.apache.kafka.streams.state.internals.MergedSortedCacheWrappedWindowStoreKeyValueIteratorTest > shouldHaveNextFromCache STARTED
org.apache.kafka.streams.state.internals.MergedSortedCacheWrappedWindowStoreKeyValueIteratorTest > shouldHaveNextFromCache PASSED
org.apache.kafka.streams.state.internals.MergedSortedCacheWrappedWindowStoreKeyValueIteratorTest > shouldHaveNextFromStore STARTED
org.apache.kafka.streams.state.internals.MergedSortedCacheWrappedWindowStoreKeyValueIteratorTest > shouldHaveNextFromStore PASSED
org.apache.kafka.streams.state.internals.MergedSortedCacheWrappedWindowStoreKeyValueIteratorTest > shouldPeekNextKeyFromCache STARTED
org.apache.kafka.streams.state.internals.MergedSortedCacheWrappedWindowStoreKeyValueIteratorTest > shouldPeekNextKeyFromCache PASSED
org.apache.kafka.streams.state.internals.MergedSortedCacheWrappedWindowStoreKeyValueIteratorTest > shouldPeekNextKeyFromStore STARTED
org.apache.kafka.streams.state.internals.MergedSortedCacheWrappedWindowStoreKeyValueIteratorTest > shouldPeekNextKeyFromStore PASSED
org.apache.kafka.streams.state.internals.MergedSortedCacheWrappedWindowStoreKeyValueIteratorTest > shouldIterateBothStoreAndCache STARTED
org.apache.kafka.streams.state.internals.MergedSortedCacheWrappedWindowStoreKeyValueIteratorTest > shouldIterateBothStoreAndCache PASSED
org.apache.kafka.streams.state.internals.MergedSortedCacheWrappedWindowStoreKeyValueIteratorTest > shouldGetNextFromCache STARTED
org.apache.kafka.streams.state.internals.MergedSortedCacheWrappedWindowStoreKeyValueIteratorTest > shouldGetNextFromCache PASSED
org.apache.kafka.streams.state.internals.MergedSortedCacheWrappedWindowStoreKeyValueIteratorTest > shouldGetNextFromStore STARTED
org.apache.kafka.streams.state.internals.MergedSortedCacheWrappedWindowStoreKeyValueIteratorTest > shouldGetNextFromStore PASSED
org.apache.kafka.streams.state.internals.ChangeLoggingSegmentedBytesStoreTest > shouldFlushUnderlyingStore STARTED
org.apache.kafka.streams.state.internals.ChangeLoggingSegmentedBytesStoreTest > shouldFlushUnderlyingStore PASSED
org.apache.kafka.streams.state.internals.ChangeLoggingSegmentedBytesStoreTest > shouldCloseUnderlyingStore STARTED
org.apache.kafka.streams.state.internals.ChangeLoggingSegmentedBytesStoreTest > shouldCloseUnderlyingStore PASSED
org.apache.kafka.streams.state.internals.ChangeLoggingSegmentedBytesStoreTest > shouldLogPuts STARTED
org.apache.kafka.streams.state.internals.ChangeLoggingSegmentedBytesStoreTest > shouldLogPuts PASSED
org.apache.kafka.streams.state.internals.ChangeLoggingSegmentedBytesStoreTest > shouldInitUnderlyingStore STARTED
org.apache.kafka.streams.state.internals.ChangeLoggingSegmentedBytesStoreTest > shouldInitUnderlyingStore PASSED
org.apache.kafka.streams.state.internals.ChangeLoggingSegmentedBytesStoreTest > shouldLogRemoves STARTED
org.apache.kafka.streams.state.internals.ChangeLoggingSegmentedBytesStoreTest > shouldLogRemoves PASSED
org.apache.kafka.streams.state.internals.ChangeLoggingSegmentedBytesStoreTest > shouldDelegateToUnderlyingStoreWhenFetching STARTED
org.apache.kafka.streams.state.internals.ChangeLoggingSegmentedBytesStoreTest > shouldDelegateToUnderlyingStoreWhenFetching PASSED
org.apache.kafka.streams.state.internals.WindowStoreUtilsTest > testSerialization STARTED
org.apache.kafka.streams.state.internals.WindowStoreUtilsTest > testSerialization PASSED
org.apache.kafka.streams.state.internals.RocksDBStoreTest > shouldHandleDeletesAndPutbackOnRestoreAll STARTED
org.apache.kafka.streams.state.internals.RocksDBStoreTest > shouldHandleDeletesAndPutbackOnRestoreAll PASSED
org.apache.kafka.streams.state.internals.RocksDBStoreTest > shouldThrowNullPointerExceptionOnDelete STARTED
org.apache.kafka.streams.state.internals.RocksDBStoreTest > shouldThrowNullPointerExceptionOnDelete PASSED
org.apache.kafka.streams.state.internals.RocksDBStoreTest > shouldNotThrowExceptionOnRestoreWhenThereIsPreExistingRocksDbFiles STARTED
org.apache.kafka.streams.state.internals.RocksDBStoreTest > shouldNotThrowExceptionOnRestoreWhenThereIsPreExistingRocksDbFiles PASSED
org.apache.kafka.streams.state.internals.RocksDBStoreTest > shouldPutAll STARTED
org.apache.kafka.streams.state.internals.RocksDBStoreTest > shouldPutAll PASSED
org.apache.kafka.streams.state.internals.RocksDBStoreTest > shouldThrowProcessorStateExeptionOnPutDeletedDir STARTED
org.apache.kafka.streams.state.internals.RocksDBStoreTest > shouldThrowProcessorStateExeptionOnPutDeletedDir PASSED
org.apache.kafka.streams.state.internals.RocksDBStoreTest > canSpecifyConfigSetterAsString STARTED
org.apache.kafka.streams.state.internals.RocksDBStoreTest > canSpecifyConfigSetterAsString PASSED
org.apache.kafka.streams.state.internals.RocksDBStoreTest > shouldThrowNullPointerExceptionOnNullGet STARTED
org.apache.kafka.streams.state.internals.RocksDBStoreTest > shouldThrowNullPointerExceptionOnNullGet PASSED
org.apache.kafka.streams.state.internals.RocksDBStoreTest > shouldThrowNullPointerExceptionOnNullPut STARTED
org.apache.kafka.streams.state.internals.RocksDBStoreTest > shouldThrowNullPointerExceptionOnNullPut PASSED
org.apache.kafka.streams.state.internals.RocksDBStoreTest > canSpecifyConfigSetterAsClass STARTED
org.apache.kafka.streams.state.internals.RocksDBStoreTest > canSpecifyConfigSetterAsClass PASSED
org.apache.kafka.streams.state.internals.RocksDBStoreTest > shouldTogglePrepareForBulkloadSetting STARTED
org.apache.kafka.streams.state.internals.RocksDBStoreTest > shouldTogglePrepareForBulkloadSetting PASSED
org.apache.kafka.streams.state.internals.RocksDBStoreTest > shouldThrowNullPointerExceptionOnNullPutAll STARTED
org.apache.kafka.streams.state.internals.RocksDBStoreTest > shouldThrowNullPointerExceptionOnNullPutAll PASSED
org.apache.kafka.streams.state.internals.RocksDBStoreTest > shouldHandleDeletesOnRestoreAll STARTED
org.apache.kafka.streams.state.internals.RocksDBStoreTest > shouldHandleDeletesOnRestoreAll PASSED
org.apache.kafka.streams.state.internals.RocksDBStoreTest > shouldThrowProcessorStateExceptionOnOpeningReadOnlyDir STARTED
org.apache.kafka.streams.state.internals.RocksDBStoreTest > shouldThrowProcessorStateExceptionOnOpeningReadOnlyDir PASSED
org.apache.kafka.streams.state.internals.RocksDBStoreTest > shouldThrowNullPointerExceptionOnRange STARTED
org.apache.kafka.streams.state.internals.RocksDBStoreTest > shouldThrowNullPointerExceptionOnRange PASSED
org.apache.kafka.streams.state.internals.RocksDBStoreTest > shouldRestoreThenDeleteOnRestoreAll STARTED
org.apache.kafka.streams.state.internals.RocksDBStoreTest > shouldRestoreThenDeleteOnRestoreAll PASSED
org.apache.kafka.streams.state.internals.RocksDBStoreTest > shouldTogglePrepareForBulkloadSettingWhenPrexistingSstFiles STARTED
org.apache.kafka.streams.state.internals.RocksDBStoreTest > shouldTogglePrepareForBulkloadSettingWhenPrexistingSstFiles PASSED
org.apache.kafka.streams.state.internals.RocksDBStoreTest > shouldRestoreAll STARTED
org.apache.kafka.streams.state.internals.RocksDBStoreTest > shouldRestoreAll PASSED
org.apache.kafka.streams.state.internals.RocksDBSessionStoreSupplierTest > shouldHaveMeteredStoreWhenNotLoggedOrCached STARTED
org.apache.kafka.streams.state.internals.RocksDBSessionStoreSupplierTest > shouldHaveMeteredStoreWhenNotLoggedOrCached PASSED
org.apache.kafka.streams.state.internals.RocksDBSessionStoreSupplierTest > shouldReturnRocksDbStoreWhenCachingDisabled STARTED
org.apache.kafka.streams.state.internals.RocksDBSessionStoreSupplierTest > shouldReturnRocksDbStoreWhenCachingDisabled PASSED
org.apache.kafka.streams.state.internals.RocksDBSessionStoreSupplierTest > shouldCreateLoggingEnabledStoreWhenStoreLogged STARTED
org.apache.kafka.streams.state.internals.RocksDBSessionStoreSupplierTest > shouldCreateLoggingEnabledStoreWhenStoreLogged PASSED
org.apache.kafka.streams.state.internals.RocksDBSessionStoreSupplierTest > shouldReturnCachedSessionStoreWhenCachingEnabled STARTED
org.apache.kafka.streams.state.internals.RocksDBSessionStoreSupplierTest > shouldReturnCachedSessionStoreWhenCachingEnabled PASSED
org.apache.kafka.streams.state.internals.RocksDBSessionStoreSupplierTest > shouldNotBeLoggingEnabledStoreWhenLoggingNotEnabled STARTED
org.apache.kafka.streams.state.internals.RocksDBSessionStoreSupplierTest > shouldNotBeLoggingEnabledStoreWhenLoggingNotEnabled PASSED
org.apache.kafka.streams.state.internals.RocksDBSessionStoreSupplierTest > shouldHaveMeteredStoreWhenCached STARTED
org.apache.kafka.streams.state.internals.RocksDBSessionStoreSupplierTest > shouldHaveMeteredStoreWhenCached PASSED
org.apache.kafka.streams.state.internals.RocksDBSessionStoreSupplierTest > shouldHaveMeteredStoreWhenLogged STARTED
org.apache.kafka.streams.state.internals.RocksDBSessionStoreSupplierTest > shouldHaveMeteredStoreWhenLogged PASSED
org.apache.kafka.streams.state.internals.RocksDBSessionStoreSupplierTest > shouldReturnRocksDbStoreWhenCachingAndLoggingDisabled STARTED
org.apache.kafka.streams.state.internals.RocksDBSessionStoreSupplierTest > shouldReturnRocksDbStoreWhenCachingAndLoggingDisabled PASSED
org.apache.kafka.streams.state.internals.MeteredWindowStoreTest > shouldRecordFetchLatency STARTED
org.apache.kafka.streams.state.internals.MeteredWindowStoreTest > shouldRecordFetchLatency PASSED
org.apache.kafka.streams.state.internals.MeteredWindowStoreTest > shouldRecordFetchRangeLatency STARTED
org.apache.kafka.streams.state.internals.MeteredWindowStoreTest > shouldRecordFetchRangeLatency PASSED
org.apache.kafka.streams.state.internals.MeteredWindowStoreTest > shouldCloseUnderlyingStore STARTED
org.apache.kafka.streams.state.internals.MeteredWindowStoreTest > shouldCloseUnderlyingStore PASSED
org.apache.kafka.streams.state.internals.MeteredWindowStoreTest > shouldRecordFlushLatency STARTED
org.apache.kafka.streams.state.internals.MeteredWindowStoreTest > shouldRecordFlushLatency PASSED
org.apache.kafka.streams.state.internals.MeteredWindowStoreTest > shouldRecordPutLatency STARTED
org.apache.kafka.streams.state.internals.MeteredWindowStoreTest > shouldRecordPutLatency PASSED
org.apache.kafka.streams.state.internals.MeteredWindowStoreTest > shouldRecordRestoreLatencyOnInit STARTED
org.apache.kafka.streams.state.internals.MeteredWindowStoreTest > shouldRecordRestoreLatencyOnInit PASSED
org.apache.kafka.streams.state.StoresTest > shouldThrowIllegalArgumentExceptionWhenTryingToConstructWindowStoreWithLessThanTwoSegments STARTED
org.apache.kafka.streams.state.StoresTest > shouldThrowIllegalArgumentExceptionWhenTryingToConstructWindowStoreWithLessThanTwoSegments PASSED
org.apache.kafka.streams.state.StoresTest > shouldCreateInMemoryStoreSupplierWithLoggedConfig STARTED
org.apache.kafka.streams.state.StoresTest > shouldCreateInMemoryStoreSupplierWithLoggedConfig PASSED
org.apache.kafka.streams.state.StoresTest > shouldCreatePersistenStoreSupplierNotLogged STARTED
org.apache.kafka.streams.state.StoresTest > shouldCreatePersistenStoreSupplierNotLogged PASSED
org.apache.kafka.streams.state.StoresTest > shouldCreatePersistenStoreSupplierWithLoggedConfig STARTED
org.apache.kafka.streams.state.StoresTest > shouldCreatePersistenStoreSupplierWithLoggedConfig PASSED
org.apache.kafka.streams.state.StoresTest > shouldCreateInMemoryStoreSupplierNotLogged STARTED
org.apache.kafka.streams.state.StoresTest > shouldCreateInMemoryStoreSupplierNotLogged PASSED
1572 tests completed, 1 failed
:streams:test FAILED
FAILURE: Build failed with an exception.
* What went wrong:
Execution failed for task ':streams:test'.
> There were failing tests. See the report at: file://<https://builds.apache.org/job/kafka-trunk-jdk7/ws/streams/build/reports/tests/test/index.html>
* Try:
Run with --stacktrace option to get the stack trace. Run with --info or --debug option to get more log output.
* Get more help at https://help.gradle.org
BUILD FAILED in 1h 17m 10s
52 actionable tasks: 32 executed, 20 up-to-date
Build step 'Execute shell' marked build as failure
[FINDBUGS] Collecting findbugs analysis files...
Setting GRADLE_3_4_RC_2_HOME=/home/jenkins/jenkins-slave/tools/hudson.plugins.gradle.GradleInstallation/Gradle_3.4-rc-2
[FINDBUGS] Searching for all files in <https://builds.apache.org/job/kafka-trunk-jdk7/ws/> that match the pattern **/build/reports/findbugs/*.xml
[FINDBUGS] Parsing 5 files in <https://builds.apache.org/job/kafka-trunk-jdk7/ws/>
[FINDBUGS] Successfully parsed file <https://builds.apache.org/job/kafka-trunk-jdk7/ws/clients/build/reports/findbugs/main.xml> with 0 unique warnings and 0 duplicates.
[FINDBUGS] Successfully parsed file <https://builds.apache.org/job/kafka-trunk-jdk7/ws/core/build/reports/findbugs/main.xml> with 0 unique warnings and 0 duplicates.
[FINDBUGS] Successfully parsed file <https://builds.apache.org/job/kafka-trunk-jdk7/ws/examples/build/reports/findbugs/main.xml> with 0 unique warnings and 0 duplicates.
[FINDBUGS] Successfully parsed file <https://builds.apache.org/job/kafka-trunk-jdk7/ws/log4j-appender/build/reports/findbugs/main.xml> with 0 unique warnings and 0 duplicates.
[FINDBUGS] Successfully parsed file <https://builds.apache.org/job/kafka-trunk-jdk7/ws/streams/build/reports/findbugs/main.xml> with 0 unique warnings and 0 duplicates.
Setting GRADLE_3_4_RC_2_HOME=/home/jenkins/jenkins-slave/tools/hudson.plugins.gradle.GradleInstallation/Gradle_3.4-rc-2
Setting GRADLE_3_4_RC_2_HOME=/home/jenkins/jenkins-slave/tools/hudson.plugins.gradle.GradleInstallation/Gradle_3.4-rc-2
<Git Blamer> Using GitBlamer to create author and commit information for all warnings.
<Git Blamer> GIT_COMMIT=ea21752a79f3e843f0c2a74ea093a8793e42edb4, workspace=<https://builds.apache.org/job/kafka-trunk-jdk7/ws/>
[FINDBUGS] Computing warning deltas based on reference build #2663
Recording test results
Setting GRADLE_3_4_RC_2_HOME=/home/jenkins/jenkins-slave/tools/hudson.plugins.gradle.GradleInstallation/Gradle_3.4-rc-2
Setting GRADLE_3_4_RC_2_HOME=/home/jenkins/jenkins-slave/tools/hudson.plugins.gradle.GradleInstallation/Gradle_3.4-rc-2
Not sending mail to unregistered user ismael@juma.me.uk
Not sending mail to unregistered user wangguoz@gmail.com
Jenkins build is back to normal : kafka-trunk-jdk7 #2667
Posted by Apache Jenkins Server <je...@builds.apache.org>.
See <https://builds.apache.org/job/kafka-trunk-jdk7/2667/display/redirect?page=changes>
Build failed in Jenkins: kafka-trunk-jdk7 #2666
Posted by Apache Jenkins Server <je...@builds.apache.org>.
See <https://builds.apache.org/job/kafka-trunk-jdk7/2666/display/redirect?page=changes>
Changes:
[me] MINOR: Verify startup of zookeeper service in system tests
------------------------------------------
[...truncated 914.98 KB...]
kafka.server.epoch.LeaderEpochFileCacheTest > shouldNotResetEpochHistoryTailIfUndefinedPassed STARTED
kafka.server.epoch.LeaderEpochFileCacheTest > shouldNotResetEpochHistoryTailIfUndefinedPassed PASSED
kafka.server.epoch.LeaderEpochFileCacheTest > shouldReturnUnsupportedIfNoEpochRecorded STARTED
kafka.server.epoch.LeaderEpochFileCacheTest > shouldReturnUnsupportedIfNoEpochRecorded PASSED
kafka.server.epoch.LeaderEpochFileCacheTest > shouldRetainLatestEpochOnClearAllEarliest STARTED
kafka.server.epoch.LeaderEpochFileCacheTest > shouldRetainLatestEpochOnClearAllEarliest PASSED
kafka.server.epoch.LeaderEpochFileCacheTest > shouldPersistEpochsBetweenInstances STARTED
kafka.server.epoch.LeaderEpochFileCacheTest > shouldPersistEpochsBetweenInstances PASSED
kafka.server.epoch.LeaderEpochFileCacheTest > shouldNotClearAnythingIfOffsetToFirstOffset STARTED
kafka.server.epoch.LeaderEpochFileCacheTest > shouldNotClearAnythingIfOffsetToFirstOffset PASSED
kafka.server.epoch.LeaderEpochFileCacheTest > shouldNotLetOffsetsGoBackwardsEvenIfEpochsProgress STARTED
kafka.server.epoch.LeaderEpochFileCacheTest > shouldNotLetOffsetsGoBackwardsEvenIfEpochsProgress PASSED
kafka.server.epoch.LeaderEpochFileCacheTest > shouldGetFirstOffsetOfSubsequentEpochWhenOffsetRequestedForPreviousEpoch STARTED
kafka.server.epoch.LeaderEpochFileCacheTest > shouldGetFirstOffsetOfSubsequentEpochWhenOffsetRequestedForPreviousEpoch PASSED
kafka.server.epoch.LeaderEpochFileCacheTest > shouldUpdateOffsetBetweenEpochBoundariesOnClearEarliest2 STARTED
kafka.server.epoch.LeaderEpochFileCacheTest > shouldUpdateOffsetBetweenEpochBoundariesOnClearEarliest2 PASSED
kafka.server.epoch.LeaderEpochFileCacheTest > shouldClearEarliestOnEmptyCache STARTED
kafka.server.epoch.LeaderEpochFileCacheTest > shouldClearEarliestOnEmptyCache PASSED
kafka.server.epoch.LeaderEpochFileCacheTest > shouldPreserveResetOffsetOnClearEarliestIfOneExists STARTED
kafka.server.epoch.LeaderEpochFileCacheTest > shouldPreserveResetOffsetOnClearEarliestIfOneExists PASSED
kafka.server.epoch.LeaderEpochFileCacheTest > shouldUpdateOffsetBetweenEpochBoundariesOnClearEarliest STARTED
kafka.server.epoch.LeaderEpochFileCacheTest > shouldUpdateOffsetBetweenEpochBoundariesOnClearEarliest PASSED
kafka.server.epoch.LeaderEpochFileCacheTest > shouldReturnInvalidOffsetIfEpochIsRequestedWhichIsNotCurrentlyTracked STARTED
kafka.server.epoch.LeaderEpochFileCacheTest > shouldReturnInvalidOffsetIfEpochIsRequestedWhichIsNotCurrentlyTracked PASSED
kafka.server.epoch.LeaderEpochFileCacheTest > shouldFetchEndOffsetOfEmptyCache STARTED
kafka.server.epoch.LeaderEpochFileCacheTest > shouldFetchEndOffsetOfEmptyCache PASSED
kafka.server.epoch.LeaderEpochFileCacheTest > shouldRetainLatestEpochOnClearAllEarliestAndUpdateItsOffset STARTED
kafka.server.epoch.LeaderEpochFileCacheTest > shouldRetainLatestEpochOnClearAllEarliestAndUpdateItsOffset PASSED
kafka.server.epoch.LeaderEpochFileCacheTest > shouldClearAllEntries STARTED
kafka.server.epoch.LeaderEpochFileCacheTest > shouldClearAllEntries PASSED
kafka.server.epoch.LeaderEpochFileCacheTest > shouldClearLatestOnEmptyCache STARTED
kafka.server.epoch.LeaderEpochFileCacheTest > shouldClearLatestOnEmptyCache PASSED
kafka.server.epoch.LeaderEpochFileCacheTest > shouldNotResetEpochHistoryHeadIfUndefinedPassed STARTED
kafka.server.epoch.LeaderEpochFileCacheTest > shouldNotResetEpochHistoryHeadIfUndefinedPassed PASSED
kafka.server.epoch.LeaderEpochIntegrationTest > shouldIncreaseLeaderEpochBetweenLeaderRestarts STARTED
kafka.server.epoch.LeaderEpochIntegrationTest > shouldIncreaseLeaderEpochBetweenLeaderRestarts PASSED
kafka.server.epoch.LeaderEpochIntegrationTest > shouldAddCurrentLeaderEpochToMessagesAsTheyAreWrittenToLeader STARTED
kafka.server.epoch.LeaderEpochIntegrationTest > shouldAddCurrentLeaderEpochToMessagesAsTheyAreWrittenToLeader PASSED
kafka.server.epoch.LeaderEpochIntegrationTest > shouldSendLeaderEpochRequestAndGetAResponse STARTED
kafka.server.epoch.LeaderEpochIntegrationTest > shouldSendLeaderEpochRequestAndGetAResponse PASSED
kafka.server.epoch.OffsetsForLeaderEpochTest > shouldGetEpochsFromReplica STARTED
kafka.server.epoch.OffsetsForLeaderEpochTest > shouldGetEpochsFromReplica PASSED
kafka.server.epoch.OffsetsForLeaderEpochTest > shouldReturnUnknownTopicOrPartitionIfThrown STARTED
kafka.server.epoch.OffsetsForLeaderEpochTest > shouldReturnUnknownTopicOrPartitionIfThrown PASSED
kafka.server.epoch.OffsetsForLeaderEpochTest > shouldReturnNoLeaderForPartitionIfThrown STARTED
kafka.server.epoch.OffsetsForLeaderEpochTest > shouldReturnNoLeaderForPartitionIfThrown PASSED
kafka.server.epoch.EpochDrivenReplicationProtocolAcceptanceTest > shouldSurviveFastLeaderChange STARTED
kafka.server.epoch.EpochDrivenReplicationProtocolAcceptanceTest > shouldSurviveFastLeaderChange PASSED
kafka.server.epoch.EpochDrivenReplicationProtocolAcceptanceTest > offsetsShouldNotGoBackwards STARTED
kafka.server.epoch.EpochDrivenReplicationProtocolAcceptanceTest > offsetsShouldNotGoBackwards PASSED
kafka.server.epoch.EpochDrivenReplicationProtocolAcceptanceTest > shouldFollowLeaderEpochBasicWorkflow STARTED
kafka.server.epoch.EpochDrivenReplicationProtocolAcceptanceTest > shouldFollowLeaderEpochBasicWorkflow PASSED
kafka.server.epoch.EpochDrivenReplicationProtocolAcceptanceTest > shouldNotAllowDivergentLogs STARTED
kafka.server.epoch.EpochDrivenReplicationProtocolAcceptanceTest > shouldNotAllowDivergentLogs PASSED
kafka.server.MultipleListenersWithAdditionalJaasContextTest > testProduceConsume STARTED
kafka.server.MultipleListenersWithAdditionalJaasContextTest > testProduceConsume PASSED
kafka.server.OffsetCommitTest > testUpdateOffsets STARTED
kafka.server.OffsetCommitTest > testUpdateOffsets PASSED
kafka.server.OffsetCommitTest > testLargeMetadataPayload STARTED
kafka.server.OffsetCommitTest > testLargeMetadataPayload PASSED
kafka.server.OffsetCommitTest > testOffsetsDeleteAfterTopicDeletion STARTED
kafka.server.OffsetCommitTest > testOffsetsDeleteAfterTopicDeletion PASSED
kafka.server.OffsetCommitTest > testCommitAndFetchOffsets STARTED
kafka.server.OffsetCommitTest > testCommitAndFetchOffsets PASSED
kafka.server.OffsetCommitTest > testOffsetExpiration STARTED
kafka.server.OffsetCommitTest > testOffsetExpiration PASSED
kafka.server.OffsetCommitTest > testNonExistingTopicOffsetCommit STARTED
kafka.server.OffsetCommitTest > testNonExistingTopicOffsetCommit PASSED
kafka.server.ReplicationQuotasTest > shouldBootstrapTwoBrokersWithLeaderThrottle STARTED
kafka.server.ReplicationQuotasTest > shouldBootstrapTwoBrokersWithLeaderThrottle PASSED
kafka.server.ReplicationQuotasTest > shouldThrottleOldSegments STARTED
kafka.server.ReplicationQuotasTest > shouldThrottleOldSegments PASSED
kafka.server.ReplicationQuotasTest > shouldBootstrapTwoBrokersWithFollowerThrottle STARTED
kafka.server.ReplicationQuotasTest > shouldBootstrapTwoBrokersWithFollowerThrottle PASSED
kafka.server.EdgeCaseRequestTest > testInvalidApiVersionRequest STARTED
kafka.server.EdgeCaseRequestTest > testInvalidApiVersionRequest PASSED
kafka.server.EdgeCaseRequestTest > testMalformedHeaderRequest STARTED
kafka.server.EdgeCaseRequestTest > testMalformedHeaderRequest PASSED
kafka.server.EdgeCaseRequestTest > testProduceRequestWithNullClientId STARTED
kafka.server.EdgeCaseRequestTest > testProduceRequestWithNullClientId PASSED
kafka.server.EdgeCaseRequestTest > testInvalidApiKeyRequest STARTED
kafka.server.EdgeCaseRequestTest > testInvalidApiKeyRequest PASSED
kafka.server.EdgeCaseRequestTest > testHeaderOnlyRequest STARTED
kafka.server.EdgeCaseRequestTest > testHeaderOnlyRequest PASSED
kafka.server.SaslApiVersionsRequestTest > testApiVersionsRequestWithUnsupportedVersion STARTED
kafka.server.SaslApiVersionsRequestTest > testApiVersionsRequestWithUnsupportedVersion PASSED
kafka.server.SaslApiVersionsRequestTest > testApiVersionsRequestBeforeSaslHandshakeRequest STARTED
kafka.server.SaslApiVersionsRequestTest > testApiVersionsRequestBeforeSaslHandshakeRequest PASSED
kafka.server.SaslApiVersionsRequestTest > testApiVersionsRequestAfterSaslHandshakeRequest STARTED
kafka.server.SaslApiVersionsRequestTest > testApiVersionsRequestAfterSaslHandshakeRequest PASSED
kafka.metrics.MetricsTest > testMetricsReporterAfterDeletingTopic STARTED
kafka.metrics.MetricsTest > testMetricsReporterAfterDeletingTopic PASSED
kafka.metrics.MetricsTest > testBrokerTopicMetricsUnregisteredAfterDeletingTopic STARTED
kafka.metrics.MetricsTest > testBrokerTopicMetricsUnregisteredAfterDeletingTopic PASSED
kafka.metrics.MetricsTest > testClusterIdMetric STARTED
kafka.metrics.MetricsTest > testClusterIdMetric PASSED
kafka.metrics.MetricsTest > testControllerMetrics STARTED
kafka.metrics.MetricsTest > testControllerMetrics PASSED
kafka.metrics.MetricsTest > testMetricsLeak STARTED
kafka.metrics.MetricsTest > testMetricsLeak FAILED
java.lang.AssertionError: expected:<1217> but was:<1220>
at org.junit.Assert.fail(Assert.java:88)
at org.junit.Assert.failNotEquals(Assert.java:834)
at org.junit.Assert.assertEquals(Assert.java:645)
at org.junit.Assert.assertEquals(Assert.java:631)
at kafka.metrics.MetricsTest$$anonfun$testMetricsLeak$1.apply$mcVI$sp(MetricsTest.scala:68)
at scala.collection.immutable.Range.foreach$mVc$sp(Range.scala:160)
at kafka.metrics.MetricsTest.testMetricsLeak(MetricsTest.scala:66)
kafka.metrics.MetricsTest > testBrokerTopicMetricsBytesInOut STARTED
kafka.metrics.MetricsTest > testBrokerTopicMetricsBytesInOut PASSED
kafka.metrics.KafkaTimerTest > testKafkaTimer STARTED
kafka.metrics.KafkaTimerTest > testKafkaTimer PASSED
1550 tests completed, 1 failed, 4 skipped
:kafka-trunk-jdk7:core:test FAILED
:test_core_2_11 FAILED
FAILURE: Build failed with an exception.
* What went wrong:
Execution failed for task ':kafka-trunk-jdk7:core:test'.
> There were failing tests. See the report at: file://<https://builds.apache.org/job/kafka-trunk-jdk7/ws/core/build/reports/tests/test/index.html>
* Try:
Run with --stacktrace option to get the stack trace. Run with --info or --debug option to get more log output.
* Get more help at https://help.gradle.org
BUILD FAILED in 43m 40s
16 actionable tasks: 3 executed, 13 up-to-date
Build step 'Execute shell' marked build as failure
[FINDBUGS] Collecting findbugs analysis files...
Setting GRADLE_3_4_RC_2_HOME=/home/jenkins/jenkins-slave/tools/hudson.plugins.gradle.GradleInstallation/Gradle_3.4-rc-2
[FINDBUGS] Searching for all files in <https://builds.apache.org/job/kafka-trunk-jdk7/ws/> that match the pattern **/build/reports/findbugs/*.xml
[FINDBUGS] Parsing 1 file in <https://builds.apache.org/job/kafka-trunk-jdk7/ws/>
[FINDBUGS] Successfully parsed file <https://builds.apache.org/job/kafka-trunk-jdk7/ws/core/build/reports/findbugs/main.xml> with 0 unique warnings and 0 duplicates.
Setting GRADLE_3_4_RC_2_HOME=/home/jenkins/jenkins-slave/tools/hudson.plugins.gradle.GradleInstallation/Gradle_3.4-rc-2
Setting GRADLE_3_4_RC_2_HOME=/home/jenkins/jenkins-slave/tools/hudson.plugins.gradle.GradleInstallation/Gradle_3.4-rc-2
<Git Blamer> Using GitBlamer to create author and commit information for all warnings.
<Git Blamer> GIT_COMMIT=3b7e104559211d8104eb6d1493b6cdb5ec93de3a, workspace=<https://builds.apache.org/job/kafka-trunk-jdk7/ws/>
[FINDBUGS] Computing warning deltas based on reference build #2663
Recording test results
Setting GRADLE_3_4_RC_2_HOME=/home/jenkins/jenkins-slave/tools/hudson.plugins.gradle.GradleInstallation/Gradle_3.4-rc-2
Setting GRADLE_3_4_RC_2_HOME=/home/jenkins/jenkins-slave/tools/hudson.plugins.gradle.GradleInstallation/Gradle_3.4-rc-2
Not sending mail to unregistered user ismael@juma.me.uk
Not sending mail to unregistered user wangguoz@gmail.com