You are viewing a plain text version of this content. The canonical link for it is here.
Posted to commits@carbondata.apache.org by Apache Jenkins Server <je...@builds.apache.org> on 2017/12/19 06:46:39 UTC

Build failed in Jenkins: carbondata-master-spark-2.1 #1766

See <https://builds.apache.org/job/carbondata-master-spark-2.1/1766/display/redirect?page=changes>

Changes:

[jacky.likun] [CARBONDATA-1884] Add CTAS support to carbondata

------------------------------------------
[...truncated 9.59 KB...]
Audit done.
[INFO] 
[INFO] --- scalastyle-maven-plugin:0.8.0:check (default) @ carbondata-parent ---
[WARNING] sourceDirectory is not specified or does not exist value=<https://builds.apache.org/job/carbondata-master-spark-2.1/ws/src/main/scala>
Saving to outputFile=<https://builds.apache.org/job/carbondata-master-spark-2.1/ws/target/scalastyle-output.xml>
Processed 0 file(s)
Found 0 errors
Found 0 warnings
Found 0 infos
Finished in 173 ms
[INFO] 
[INFO] --- jacoco-maven-plugin:0.7.9:report (default-report) @ carbondata-parent ---
[INFO] Skipping JaCoCo execution due to missing execution data file.
[INFO] 
[INFO] --- jacoco-maven-plugin:0.7.9:report-integration (default-report-integration) @ carbondata-parent ---
[INFO] Skipping JaCoCo execution due to missing execution data file.
[INFO] 
[INFO] --- jacoco-maven-plugin:0.7.9:check (default-check) @ carbondata-parent ---
[INFO] Skipping JaCoCo execution due to missing execution data <https://builds.apache.org/job/carbondata-master-spark-2.1/ws/target/jacoco.exec>
[INFO] 
[INFO] --- maven-install-plugin:2.5.2:install (default-install) @ carbondata-parent ---
[INFO] Installing <https://builds.apache.org/job/carbondata-master-spark-2.1/ws/pom.xml> to /home/jenkins/jenkins-slave/maven-repositories/0/org/apache/carbondata/carbondata-parent/1.3.0-SNAPSHOT/carbondata-parent-1.3.0-SNAPSHOT.pom
[INFO]                                                                         
[INFO] ------------------------------------------------------------------------
[INFO] Building Apache CarbonData :: Common 1.3.0-SNAPSHOT
[INFO] ------------------------------------------------------------------------
[INFO] 
[INFO] --- maven-clean-plugin:2.5:clean (default-clean) @ carbondata-common ---
[INFO] Deleting <https://builds.apache.org/job/carbondata-master-spark-2.1/ws/common/target>
[INFO] 
[INFO] --- jacoco-maven-plugin:0.7.9:prepare-agent (default-prepare-agent) @ carbondata-common ---
[INFO] argLine set to -javaagent:/home/jenkins/jenkins-slave/maven-repositories/0/org/jacoco/org.jacoco.agent/0.7.9/org.jacoco.agent-0.7.9-runtime.jar=destfile=<https://builds.apache.org/job/carbondata-master-spark-2.1/ws/common/target/jacoco.exec>
[INFO] 
[INFO] --- maven-remote-resources-plugin:1.5:process (default) @ carbondata-common ---
[INFO] 
[INFO] --- maven-resources-plugin:2.7:resources (default-resources) @ carbondata-common ---
[INFO] Using 'UTF-8' encoding to copy filtered resources.
[INFO] skip non existing resourceDirectory <https://builds.apache.org/job/carbondata-master-spark-2.1/ws/common/src/main/resources>
[INFO] Copying 3 resources
[INFO] 
[INFO] --- maven-compiler-plugin:3.2:compile (default-compile) @ carbondata-common ---
[INFO] Changes detected - recompiling the module!
[INFO] Compiling 10 source files to <https://builds.apache.org/job/carbondata-master-spark-2.1/ws/common/target/classes>
[INFO] 
[INFO] >>> findbugs-maven-plugin:3.0.4:check (analyze-compile) > :findbugs @ carbondata-common >>>
[INFO] 
[INFO] --- findbugs-maven-plugin:3.0.4:findbugs (findbugs) @ carbondata-common ---
[INFO] Fork Value is true
[INFO] Done FindBugs Analysis....
[INFO] 
[INFO] <<< findbugs-maven-plugin:3.0.4:check (analyze-compile) < :findbugs @ carbondata-common <<<
[INFO] 
[INFO] --- findbugs-maven-plugin:3.0.4:check (analyze-compile) @ carbondata-common ---
[INFO] BugInstance size is 0
[INFO] Error size is 0
[INFO] No errors/warnings found
[INFO] 
[INFO] --- maven-resources-plugin:2.7:testResources (default-testResources) @ carbondata-common ---
[INFO] Using 'UTF-8' encoding to copy filtered resources.
[INFO] skip non existing resourceDirectory <https://builds.apache.org/job/carbondata-master-spark-2.1/ws/common/src/test/resources>
[INFO] Copying 3 resources
[INFO] 
[INFO] --- maven-compiler-plugin:3.2:testCompile (default-testCompile) @ carbondata-common ---
[INFO] Changes detected - recompiling the module!
[INFO] Compiling 7 source files to <https://builds.apache.org/job/carbondata-master-spark-2.1/ws/common/target/test-classes>
[INFO] 
[INFO] --- maven-surefire-plugin:2.18.1:test (default-test) @ carbondata-common ---
[JENKINS] Recording test results
[INFO] 
[INFO] --- maven-jar-plugin:2.5:jar (default-jar) @ carbondata-common ---
[INFO] Building jar: <https://builds.apache.org/job/carbondata-master-spark-2.1/ws/common/target/carbondata-common-1.3.0-SNAPSHOT.jar>
[INFO] 
[INFO] --- maven-site-plugin:3.4:attach-descriptor (attach-descriptor) @ carbondata-common ---
[INFO] 
[INFO] --- jacoco-maven-plugin:0.7.9:prepare-agent-integration (default-prepare-agent-integration) @ carbondata-common ---
[INFO] argLine set to -javaagent:/home/jenkins/jenkins-slave/maven-repositories/0/org/jacoco/org.jacoco.agent/0.7.9/org.jacoco.agent-0.7.9-runtime.jar=destfile=<https://builds.apache.org/job/carbondata-master-spark-2.1/ws/common/target/jacoco-it.exec>
[INFO] 
[INFO] --- maven-checkstyle-plugin:2.17:check (default) @ carbondata-common ---
[INFO] Starting audit...
Audit done.
[INFO] 
[INFO] --- scalastyle-maven-plugin:0.8.0:check (default) @ carbondata-common ---
[WARNING] sourceDirectory is not specified or does not exist value=<https://builds.apache.org/job/carbondata-master-spark-2.1/ws/common/src/main/scala>
Saving to outputFile=<https://builds.apache.org/job/carbondata-master-spark-2.1/ws/common/target/scalastyle-output.xml>
Processed 0 file(s)
Found 0 errors
Found 0 warnings
Found 0 infos
Finished in 2 ms
[INFO] 
[INFO] --- jacoco-maven-plugin:0.7.9:report (default-report) @ carbondata-common ---
[INFO] Skipping JaCoCo execution due to missing execution data file.
[INFO] 
[INFO] --- jacoco-maven-plugin:0.7.9:report-integration (default-report-integration) @ carbondata-common ---
[INFO] Skipping JaCoCo execution due to missing execution data file.
[INFO] 
[INFO] --- jacoco-maven-plugin:0.7.9:check (default-check) @ carbondata-common ---
[INFO] Skipping JaCoCo execution due to missing execution data <https://builds.apache.org/job/carbondata-master-spark-2.1/ws/common/target/jacoco.exec>
[INFO] 
[INFO] --- maven-install-plugin:2.5.2:install (default-install) @ carbondata-common ---
[INFO] Installing <https://builds.apache.org/job/carbondata-master-spark-2.1/ws/common/target/carbondata-common-1.3.0-SNAPSHOT.jar> to /home/jenkins/jenkins-slave/maven-repositories/0/org/apache/carbondata/carbondata-common/1.3.0-SNAPSHOT/carbondata-common-1.3.0-SNAPSHOT.jar
[INFO] Installing <https://builds.apache.org/job/carbondata-master-spark-2.1/ws/common/pom.xml> to /home/jenkins/jenkins-slave/maven-repositories/0/org/apache/carbondata/carbondata-common/1.3.0-SNAPSHOT/carbondata-common-1.3.0-SNAPSHOT.pom
[INFO]                                                                         
[INFO] ------------------------------------------------------------------------
[INFO] Building Apache CarbonData :: Core 1.3.0-SNAPSHOT
[INFO] ------------------------------------------------------------------------
[INFO] Downloading: http://repo1.maven.org/maven2/org/apache/carbondata/carbondata-format/1.3.0-SNAPSHOT/maven-metadata.xml
[INFO] Downloading: http://repository.apache.org/snapshots/org/apache/carbondata/carbondata-format/1.3.0-SNAPSHOT/maven-metadata.xml
[INFO] Downloaded: http://repository.apache.org/snapshots/org/apache/carbondata/carbondata-format/1.3.0-SNAPSHOT/maven-metadata.xml (791 B at 1.7 KB/sec)
[INFO] 
[INFO] --- maven-clean-plugin:2.5:clean (default-clean) @ carbondata-core ---
[INFO] Deleting <https://builds.apache.org/job/carbondata-master-spark-2.1/ws/core/target>
[INFO] 
[INFO] --- jacoco-maven-plugin:0.7.9:prepare-agent (default-prepare-agent) @ carbondata-core ---
[INFO] argLine set to -javaagent:/home/jenkins/jenkins-slave/maven-repositories/0/org/jacoco/org.jacoco.agent/0.7.9/org.jacoco.agent-0.7.9-runtime.jar=destfile=<https://builds.apache.org/job/carbondata-master-spark-2.1/ws/core/target/jacoco.exec>
[INFO] 
[INFO] --- maven-remote-resources-plugin:1.5:process (default) @ carbondata-core ---
[INFO] 
[INFO] --- maven-resources-plugin:2.7:resources (default-resources) @ carbondata-core ---
[INFO] Using 'UTF-8' encoding to copy filtered resources.
[INFO] Copying 1 resource
[INFO] Copying 3 resources
[INFO] 
[INFO] --- maven-compiler-plugin:3.2:compile (default-compile) @ carbondata-core ---
[INFO] Changes detected - recompiling the module!
[INFO] Compiling 573 source files to <https://builds.apache.org/job/carbondata-master-spark-2.1/ws/core/target/classes>
[INFO] <https://builds.apache.org/job/carbondata-master-spark-2.1/ws/core/src/main/java/org/apache/carbondata/core/util/ByteUtil.java>: <https://builds.apache.org/job/carbondata-master-spark-2.1/ws/core/src/main/java/org/apache/carbondata/core/util/ByteUtil.java> uses or overrides a deprecated API.
[INFO] <https://builds.apache.org/job/carbondata-master-spark-2.1/ws/core/src/main/java/org/apache/carbondata/core/util/ByteUtil.java>: Recompile with -Xlint:deprecation for details.
[INFO] <https://builds.apache.org/job/carbondata-master-spark-2.1/ws/core/src/main/java/org/apache/carbondata/core/datamap/DataMapStoreManager.java>: Some input files use unchecked or unsafe operations.
[INFO] <https://builds.apache.org/job/carbondata-master-spark-2.1/ws/core/src/main/java/org/apache/carbondata/core/datamap/DataMapStoreManager.java>: Recompile with -Xlint:unchecked for details.
[INFO] -------------------------------------------------------------
[WARNING] COMPILATION WARNING : 
[INFO] -------------------------------------------------------------
[WARNING] <https://builds.apache.org/job/carbondata-master-spark-2.1/ws/core/src/main/java/org/apache/carbondata/core/memory/CarbonUnsafe.java>:[23,16] sun.misc.Unsafe is internal proprietary API and may be removed in a future release
[WARNING] <https://builds.apache.org/job/carbondata-master-spark-2.1/ws/core/src/main/java/org/apache/carbondata/core/memory/CarbonUnsafe.java>:[43,18] sun.misc.Unsafe is internal proprietary API and may be removed in a future release
[WARNING] <https://builds.apache.org/job/carbondata-master-spark-2.1/ws/core/src/main/java/org/apache/carbondata/core/memory/CarbonUnsafe.java>:[47,21] sun.misc.Unsafe is internal proprietary API and may be removed in a future release
[WARNING] <https://builds.apache.org/job/carbondata-master-spark-2.1/ws/core/src/main/java/org/apache/carbondata/core/memory/CarbonUnsafe.java>:[49,17] sun.misc.Unsafe is internal proprietary API and may be removed in a future release
[WARNING] <https://builds.apache.org/job/carbondata-master-spark-2.1/ws/core/src/main/java/org/apache/carbondata/core/memory/CarbonUnsafe.java>:[70,17] sun.misc.Unsafe is internal proprietary API and may be removed in a future release
[INFO] 5 warnings 
[INFO] -------------------------------------------------------------
[INFO] -------------------------------------------------------------
[ERROR] COMPILATION ERROR : 
[INFO] -------------------------------------------------------------
[ERROR] <https://builds.apache.org/job/carbondata-master-spark-2.1/ws/core/src/main/java/org/apache/carbondata/core/metadata/converter/ThriftWrapperSchemaConverterImpl.java>:[236,58] cannot find symbol
  symbol:   variable NATIVE_HIVE
  location: class org.apache.carbondata.format.PartitionType
[ERROR] <https://builds.apache.org/job/carbondata-master-spark-2.1/ws/core/src/main/java/org/apache/carbondata/core/metadata/converter/ThriftWrapperSchemaConverterImpl.java>:[238,58] cannot find symbol
  symbol:   variable NATIVE_HIVE
  location: class org.apache.carbondata.format.PartitionType
[ERROR] <https://builds.apache.org/job/carbondata-master-spark-2.1/ws/core/src/main/java/org/apache/carbondata/core/metadata/converter/ThriftWrapperSchemaConverterImpl.java>:[559,12] an enum switch case label must be the unqualified name of an enumeration constant
[INFO] 3 errors 
[INFO] -------------------------------------------------------------
[INFO] ------------------------------------------------------------------------
[INFO] Reactor Summary:
[INFO] 
[INFO] Apache CarbonData :: Parent ........................ SUCCESS [ 12.029 s]
[INFO] Apache CarbonData :: Common ........................ SUCCESS [ 17.165 s]
[INFO] Apache CarbonData :: Core .......................... FAILURE [ 14.646 s]
[INFO] Apache CarbonData :: Processing .................... SKIPPED
[INFO] Apache CarbonData :: Hadoop ........................ SKIPPED
[INFO] Apache CarbonData :: Spark Common .................. SKIPPED
[INFO] Apache CarbonData :: Streaming ..................... SKIPPED
[INFO] Apache CarbonData :: Spark2 ........................ SKIPPED
[INFO] Apache CarbonData :: Spark Common Test ............. SKIPPED
[INFO] Apache CarbonData :: Assembly ...................... SKIPPED
[INFO] Apache CarbonData :: Hive .......................... SKIPPED
[INFO] Apache CarbonData :: presto ........................ SKIPPED
[INFO] Apache CarbonData :: Spark2 Examples ............... SKIPPED
[INFO] ------------------------------------------------------------------------
[INFO] BUILD FAILURE
[INFO] ------------------------------------------------------------------------
[INFO] Total time: 01:00 min
[INFO] Finished at: 2017-12-19T06:46:14+00:00
[INFO] Final Memory: 89M/1840M
[INFO] ------------------------------------------------------------------------
[ERROR] Failed to execute goal org.apache.maven.plugins:maven-compiler-plugin:3.2:compile (default-compile) on project carbondata-core: Compilation failure: Compilation failure:
[ERROR] <https://builds.apache.org/job/carbondata-master-spark-2.1/ws/core/src/main/java/org/apache/carbondata/core/metadata/converter/ThriftWrapperSchemaConverterImpl.java>:[236,58] cannot find symbol
[ERROR] symbol:   variable NATIVE_HIVE
[ERROR] location: class org.apache.carbondata.format.PartitionType
[ERROR] <https://builds.apache.org/job/carbondata-master-spark-2.1/ws/core/src/main/java/org/apache/carbondata/core/metadata/converter/ThriftWrapperSchemaConverterImpl.java>:[238,58] cannot find symbol
[ERROR] symbol:   variable NATIVE_HIVE
[ERROR] location: class org.apache.carbondata.format.PartitionType
[ERROR] <https://builds.apache.org/job/carbondata-master-spark-2.1/ws/core/src/main/java/org/apache/carbondata/core/metadata/converter/ThriftWrapperSchemaConverterImpl.java>:[559,12] an enum switch case label must be the unqualified name of an enumeration constant
[ERROR] -> [Help 1]
org.apache.maven.lifecycle.LifecycleExecutionException: Failed to execute goal org.apache.maven.plugins:maven-compiler-plugin:3.2:compile (default-compile) on project carbondata-core: Compilation failure
	at org.apache.maven.lifecycle.internal.MojoExecutor.execute(MojoExecutor.java:212)
	at org.apache.maven.lifecycle.internal.MojoExecutor.execute(MojoExecutor.java:153)
	at org.apache.maven.lifecycle.internal.MojoExecutor.execute(MojoExecutor.java:145)
	at org.apache.maven.lifecycle.internal.LifecycleModuleBuilder.buildProject(LifecycleModuleBuilder.java:116)
	at org.apache.maven.lifecycle.internal.LifecycleModuleBuilder.buildProject(LifecycleModuleBuilder.java:80)
	at org.apache.maven.lifecycle.internal.builder.singlethreaded.SingleThreadedBuilder.build(SingleThreadedBuilder.java:51)
	at org.apache.maven.lifecycle.internal.LifecycleStarter.execute(LifecycleStarter.java:128)
	at org.apache.maven.DefaultMaven.doExecute(DefaultMaven.java:307)
	at org.apache.maven.DefaultMaven.doExecute(DefaultMaven.java:193)
	at org.apache.maven.DefaultMaven.execute(DefaultMaven.java:106)
	at org.jvnet.hudson.maven3.launcher.Maven33Launcher.main(Maven33Launcher.java:129)
	at sun.reflect.NativeMethodAccessorImpl.invoke0(Native Method)
	at sun.reflect.NativeMethodAccessorImpl.invoke(NativeMethodAccessorImpl.java:62)
	at sun.reflect.DelegatingMethodAccessorImpl.invoke(DelegatingMethodAccessorImpl.java:43)
	at java.lang.reflect.Method.invoke(Method.java:498)
	at org.codehaus.plexus.classworlds.launcher.Launcher.launchStandard(Launcher.java:330)
	at org.codehaus.plexus.classworlds.launcher.Launcher.launch(Launcher.java:238)
	at jenkins.maven3.agent.Maven33Main.launch(Maven33Main.java:176)
	at sun.reflect.NativeMethodAccessorImpl.invoke0(Native Method)
	at sun.reflect.NativeMethodAccessorImpl.invoke(NativeMethodAccessorImpl.java:62)
	at sun.reflect.DelegatingMethodAccessorImpl.invoke(DelegatingMethodAccessorImpl.java:43)
	at java.lang.reflect.Method.invoke(Method.java:498)
	at hudson.maven.Maven3Builder.call(Maven3Builder.java:139)
	at hudson.maven.Maven3Builder.call(Maven3Builder.java:70)
	at hudson.remoting.UserRequest.perform(UserRequest.java:181)
	at hudson.remoting.UserRequest.perform(UserRequest.java:52)
	at hudson.remoting.Request$2.run(Request.java:336)
	at hudson.remoting.InterceptingExecutorService$1.call(InterceptingExecutorService.java:68)
	at java.util.concurrent.FutureTask.run(FutureTask.java:266)
	at java.util.concurrent.ThreadPoolExecutor.runWorker(ThreadPoolExecutor.java:1149)
	at java.util.concurrent.ThreadPoolExecutor$Worker.run(ThreadPoolExecutor.java:624)
	at java.lang.Thread.run(Thread.java:748)
Caused by: org.apache.maven.plugin.compiler.CompilationFailureException: Compilation failure
	at org.apache.maven.plugin.compiler.AbstractCompilerMojo.execute(AbstractCompilerMojo.java:909)
	at org.apache.maven.plugin.compiler.CompilerMojo.execute(CompilerMojo.java:129)
	at org.apache.maven.plugin.DefaultBuildPluginManager.executeMojo(DefaultBuildPluginManager.java:134)
	at org.apache.maven.lifecycle.internal.MojoExecutor.execute(MojoExecutor.java:207)
	... 31 more
[ERROR] 
[ERROR] Re-run Maven using the -X switch to enable full debug logging.
[ERROR] 
[ERROR] For more information about the errors and possible solutions, please read the following articles:
[ERROR] [Help 1] http://cwiki.apache.org/confluence/display/MAVEN/MojoFailureException
[ERROR] 
[ERROR] After correcting the problems, you can resume the build with the command
[ERROR]   mvn <goals> -rf :carbondata-core
[JENKINS] Archiving <https://builds.apache.org/job/carbondata-master-spark-2.1/ws/processing/pom.xml> to org.apache.carbondata/carbondata-processing/1.3.0-SNAPSHOT/carbondata-processing-1.3.0-SNAPSHOT.pom
[JENKINS] Archiving <https://builds.apache.org/job/carbondata-master-spark-2.1/ws/streaming/pom.xml> to org.apache.carbondata/carbondata-streaming/1.3.0-SNAPSHOT/carbondata-streaming-1.3.0-SNAPSHOT.pom
[JENKINS] Archiving <https://builds.apache.org/job/carbondata-master-spark-2.1/ws/integration/spark-common/pom.xml> to org.apache.carbondata/carbondata-spark-common/1.3.0-SNAPSHOT/carbondata-spark-common-1.3.0-SNAPSHOT.pom
[JENKINS] Archiving <https://builds.apache.org/job/carbondata-master-spark-2.1/ws/integration/hive/pom.xml> to org.apache.carbondata/carbondata-hive/1.3.0-SNAPSHOT/carbondata-hive-1.3.0-SNAPSHOT.pom
[JENKINS] Archiving <https://builds.apache.org/job/carbondata-master-spark-2.1/ws/common/pom.xml> to org.apache.carbondata/carbondata-common/1.3.0-SNAPSHOT/carbondata-common-1.3.0-SNAPSHOT.pom
[JENKINS] Archiving <https://builds.apache.org/job/carbondata-master-spark-2.1/ws/common/target/carbondata-common-1.3.0-SNAPSHOT.jar> to org.apache.carbondata/carbondata-common/1.3.0-SNAPSHOT/carbondata-common-1.3.0-SNAPSHOT.jar
[JENKINS] Archiving <https://builds.apache.org/job/carbondata-master-spark-2.1/ws/examples/spark2/pom.xml> to org.apache.carbondata/carbondata-examples-spark2/1.3.0-SNAPSHOT/carbondata-examples-spark2-1.3.0-SNAPSHOT.pom
[JENKINS] Archiving <https://builds.apache.org/job/carbondata-master-spark-2.1/ws/integration/spark2/pom.xml> to org.apache.carbondata/carbondata-spark2/1.3.0-SNAPSHOT/carbondata-spark2-1.3.0-SNAPSHOT.pom
[JENKINS] Archiving <https://builds.apache.org/job/carbondata-master-spark-2.1/ws/assembly/pom.xml> to org.apache.carbondata/carbondata-assembly/1.3.0-SNAPSHOT/carbondata-assembly-1.3.0-SNAPSHOT.pom
[JENKINS] Archiving <https://builds.apache.org/job/carbondata-master-spark-2.1/ws/pom.xml> to org.apache.carbondata/carbondata-parent/1.3.0-SNAPSHOT/carbondata-parent-1.3.0-SNAPSHOT.pom
[JENKINS] Archiving <https://builds.apache.org/job/carbondata-master-spark-2.1/ws/core/pom.xml> to org.apache.carbondata/carbondata-core/1.3.0-SNAPSHOT/carbondata-core-1.3.0-SNAPSHOT.pom
[JENKINS] Archiving <https://builds.apache.org/job/carbondata-master-spark-2.1/ws/hadoop/pom.xml> to org.apache.carbondata/carbondata-hadoop/1.3.0-SNAPSHOT/carbondata-hadoop-1.3.0-SNAPSHOT.pom
[JENKINS] Archiving <https://builds.apache.org/job/carbondata-master-spark-2.1/ws/integration/presto/pom.xml> to org.apache.carbondata/carbondata-presto/1.3.0-SNAPSHOT/carbondata-presto-1.3.0-SNAPSHOT.pom
[JENKINS] Archiving <https://builds.apache.org/job/carbondata-master-spark-2.1/ws/integration/spark-common-test/pom.xml> to org.apache.carbondata/carbondata-spark-common-test/1.3.0-SNAPSHOT/carbondata-spark-common-test-1.3.0-SNAPSHOT.pom
Not sending mail to unregistered user jacky.likun@huawei.com
Sending e-mails to: commits@carbondata.apache.org ravi.pesala@gmail.com
channel stopped
Not sending mail to unregistered user jacky.likun@huawei.com

Jenkins build is back to normal : carbondata-master-spark-2.1 #1771

Posted by Apache Jenkins Server <je...@builds.apache.org>.
See <https://builds.apache.org/job/carbondata-master-spark-2.1/1771/display/redirect?page=changes>


Build failed in Jenkins: carbondata-master-spark-2.1 #1770

Posted by Apache Jenkins Server <je...@builds.apache.org>.
See <https://builds.apache.org/job/carbondata-master-spark-2.1/1770/display/redirect?page=changes>

Changes:

[jacky.likun] [CARBONDATA-1858][PARTITION] Support querying data from partition table.

------------------------------------------
[...truncated 9.63 KB...]
[INFO] 
[INFO] --- scalastyle-maven-plugin:0.8.0:check (default) @ carbondata-parent ---
[WARNING] sourceDirectory is not specified or does not exist value=<https://builds.apache.org/job/carbondata-master-spark-2.1/ws/src/main/scala>
Saving to outputFile=<https://builds.apache.org/job/carbondata-master-spark-2.1/ws/target/scalastyle-output.xml>
Processed 0 file(s)
Found 0 errors
Found 0 warnings
Found 0 infos
Finished in 177 ms
[INFO] 
[INFO] --- jacoco-maven-plugin:0.7.9:report (default-report) @ carbondata-parent ---
[INFO] Skipping JaCoCo execution due to missing execution data file.
[INFO] 
[INFO] --- jacoco-maven-plugin:0.7.9:report-integration (default-report-integration) @ carbondata-parent ---
[INFO] Skipping JaCoCo execution due to missing execution data file.
[INFO] 
[INFO] --- jacoco-maven-plugin:0.7.9:check (default-check) @ carbondata-parent ---
[INFO] Skipping JaCoCo execution due to missing execution data <https://builds.apache.org/job/carbondata-master-spark-2.1/ws/target/jacoco.exec>
[INFO] 
[INFO] --- maven-install-plugin:2.5.2:install (default-install) @ carbondata-parent ---
[INFO] Installing <https://builds.apache.org/job/carbondata-master-spark-2.1/ws/pom.xml> to /home/jenkins/jenkins-slave/maven-repositories/1/org/apache/carbondata/carbondata-parent/1.3.0-SNAPSHOT/carbondata-parent-1.3.0-SNAPSHOT.pom
[INFO]                                                                         
[INFO] ------------------------------------------------------------------------
[INFO] Building Apache CarbonData :: Common 1.3.0-SNAPSHOT
[INFO] ------------------------------------------------------------------------
[INFO] 
[INFO] --- maven-clean-plugin:2.5:clean (default-clean) @ carbondata-common ---
[INFO] Deleting <https://builds.apache.org/job/carbondata-master-spark-2.1/ws/common/target>
[INFO] 
[INFO] --- jacoco-maven-plugin:0.7.9:prepare-agent (default-prepare-agent) @ carbondata-common ---
[INFO] argLine set to -javaagent:/home/jenkins/jenkins-slave/maven-repositories/1/org/jacoco/org.jacoco.agent/0.7.9/org.jacoco.agent-0.7.9-runtime.jar=destfile=<https://builds.apache.org/job/carbondata-master-spark-2.1/ws/common/target/jacoco.exec>
[INFO] 
[INFO] --- maven-remote-resources-plugin:1.5:process (default) @ carbondata-common ---
[INFO] 
[INFO] --- maven-resources-plugin:2.7:resources (default-resources) @ carbondata-common ---
[INFO] Using 'UTF-8' encoding to copy filtered resources.
[INFO] skip non existing resourceDirectory <https://builds.apache.org/job/carbondata-master-spark-2.1/ws/common/src/main/resources>
[INFO] Copying 3 resources
[INFO] 
[INFO] --- maven-compiler-plugin:3.2:compile (default-compile) @ carbondata-common ---
[INFO] Changes detected - recompiling the module!
[INFO] Compiling 10 source files to <https://builds.apache.org/job/carbondata-master-spark-2.1/ws/common/target/classes>
[INFO] 
[INFO] >>> findbugs-maven-plugin:3.0.4:check (analyze-compile) > :findbugs @ carbondata-common >>>
[INFO] 
[INFO] --- findbugs-maven-plugin:3.0.4:findbugs (findbugs) @ carbondata-common ---
[INFO] Fork Value is true
[INFO] Done FindBugs Analysis....
[INFO] 
[INFO] <<< findbugs-maven-plugin:3.0.4:check (analyze-compile) < :findbugs @ carbondata-common <<<
[INFO] 
[INFO] --- findbugs-maven-plugin:3.0.4:check (analyze-compile) @ carbondata-common ---
[INFO] BugInstance size is 0
[INFO] Error size is 0
[INFO] No errors/warnings found
[INFO] 
[INFO] --- maven-resources-plugin:2.7:testResources (default-testResources) @ carbondata-common ---
[INFO] Using 'UTF-8' encoding to copy filtered resources.
[INFO] skip non existing resourceDirectory <https://builds.apache.org/job/carbondata-master-spark-2.1/ws/common/src/test/resources>
[INFO] Copying 3 resources
[INFO] 
[INFO] --- maven-compiler-plugin:3.2:testCompile (default-testCompile) @ carbondata-common ---
[INFO] Changes detected - recompiling the module!
[INFO] Compiling 7 source files to <https://builds.apache.org/job/carbondata-master-spark-2.1/ws/common/target/test-classes>
[INFO] 
[INFO] --- maven-surefire-plugin:2.18.1:test (default-test) @ carbondata-common ---
[JENKINS] Recording test results
[INFO] 
[INFO] --- maven-jar-plugin:2.5:jar (default-jar) @ carbondata-common ---
[INFO] Building jar: <https://builds.apache.org/job/carbondata-master-spark-2.1/ws/common/target/carbondata-common-1.3.0-SNAPSHOT.jar>
[INFO] 
[INFO] --- maven-site-plugin:3.4:attach-descriptor (attach-descriptor) @ carbondata-common ---
[INFO] 
[INFO] --- jacoco-maven-plugin:0.7.9:prepare-agent-integration (default-prepare-agent-integration) @ carbondata-common ---
[INFO] argLine set to -javaagent:/home/jenkins/jenkins-slave/maven-repositories/1/org/jacoco/org.jacoco.agent/0.7.9/org.jacoco.agent-0.7.9-runtime.jar=destfile=<https://builds.apache.org/job/carbondata-master-spark-2.1/ws/common/target/jacoco-it.exec>
[INFO] 
[INFO] --- maven-checkstyle-plugin:2.17:check (default) @ carbondata-common ---
[INFO] Starting audit...
Audit done.
[INFO] 
[INFO] --- scalastyle-maven-plugin:0.8.0:check (default) @ carbondata-common ---
[WARNING] sourceDirectory is not specified or does not exist value=<https://builds.apache.org/job/carbondata-master-spark-2.1/ws/common/src/main/scala>
Saving to outputFile=<https://builds.apache.org/job/carbondata-master-spark-2.1/ws/common/target/scalastyle-output.xml>
Processed 0 file(s)
Found 0 errors
Found 0 warnings
Found 0 infos
Finished in 2 ms
[INFO] 
[INFO] --- jacoco-maven-plugin:0.7.9:report (default-report) @ carbondata-common ---
[INFO] Skipping JaCoCo execution due to missing execution data file.
[INFO] 
[INFO] --- jacoco-maven-plugin:0.7.9:report-integration (default-report-integration) @ carbondata-common ---
[INFO] Skipping JaCoCo execution due to missing execution data file.
[INFO] 
[INFO] --- jacoco-maven-plugin:0.7.9:check (default-check) @ carbondata-common ---
[INFO] Skipping JaCoCo execution due to missing execution data <https://builds.apache.org/job/carbondata-master-spark-2.1/ws/common/target/jacoco.exec>
[INFO] 
[INFO] --- maven-install-plugin:2.5.2:install (default-install) @ carbondata-common ---
[INFO] Installing <https://builds.apache.org/job/carbondata-master-spark-2.1/ws/common/target/carbondata-common-1.3.0-SNAPSHOT.jar> to /home/jenkins/jenkins-slave/maven-repositories/1/org/apache/carbondata/carbondata-common/1.3.0-SNAPSHOT/carbondata-common-1.3.0-SNAPSHOT.jar
[INFO] Installing <https://builds.apache.org/job/carbondata-master-spark-2.1/ws/common/pom.xml> to /home/jenkins/jenkins-slave/maven-repositories/1/org/apache/carbondata/carbondata-common/1.3.0-SNAPSHOT/carbondata-common-1.3.0-SNAPSHOT.pom
[INFO]                                                                         
[INFO] ------------------------------------------------------------------------
[INFO] Building Apache CarbonData :: Core 1.3.0-SNAPSHOT
[INFO] ------------------------------------------------------------------------
[INFO] Downloading: http://repository.apache.org/snapshots/org/apache/carbondata/carbondata-format/1.3.0-SNAPSHOT/maven-metadata.xml
[INFO] Downloading: http://repo1.maven.org/maven2/org/apache/carbondata/carbondata-format/1.3.0-SNAPSHOT/maven-metadata.xml
[INFO] Downloaded: http://repository.apache.org/snapshots/org/apache/carbondata/carbondata-format/1.3.0-SNAPSHOT/maven-metadata.xml (791 B at 1.6 KB/sec)
[INFO] 
[INFO] --- maven-clean-plugin:2.5:clean (default-clean) @ carbondata-core ---
[INFO] Deleting <https://builds.apache.org/job/carbondata-master-spark-2.1/ws/core/target>
[INFO] 
[INFO] --- jacoco-maven-plugin:0.7.9:prepare-agent (default-prepare-agent) @ carbondata-core ---
[INFO] argLine set to -javaagent:/home/jenkins/jenkins-slave/maven-repositories/1/org/jacoco/org.jacoco.agent/0.7.9/org.jacoco.agent-0.7.9-runtime.jar=destfile=<https://builds.apache.org/job/carbondata-master-spark-2.1/ws/core/target/jacoco.exec>
[INFO] 
[INFO] --- maven-remote-resources-plugin:1.5:process (default) @ carbondata-core ---
[INFO] 
[INFO] --- maven-resources-plugin:2.7:resources (default-resources) @ carbondata-core ---
[INFO] Using 'UTF-8' encoding to copy filtered resources.
[INFO] Copying 1 resource
[INFO] Copying 3 resources
[INFO] 
[INFO] --- maven-compiler-plugin:3.2:compile (default-compile) @ carbondata-core ---
[INFO] Changes detected - recompiling the module!
[INFO] Compiling 573 source files to <https://builds.apache.org/job/carbondata-master-spark-2.1/ws/core/target/classes>
[INFO] <https://builds.apache.org/job/carbondata-master-spark-2.1/ws/core/src/main/java/org/apache/carbondata/core/util/ByteUtil.java>: <https://builds.apache.org/job/carbondata-master-spark-2.1/ws/core/src/main/java/org/apache/carbondata/core/util/ByteUtil.java> uses or overrides a deprecated API.
[INFO] <https://builds.apache.org/job/carbondata-master-spark-2.1/ws/core/src/main/java/org/apache/carbondata/core/util/ByteUtil.java>: Recompile with -Xlint:deprecation for details.
[INFO] <https://builds.apache.org/job/carbondata-master-spark-2.1/ws/core/src/main/java/org/apache/carbondata/core/datamap/DataMapStoreManager.java>: Some input files use unchecked or unsafe operations.
[INFO] <https://builds.apache.org/job/carbondata-master-spark-2.1/ws/core/src/main/java/org/apache/carbondata/core/datamap/DataMapStoreManager.java>: Recompile with -Xlint:unchecked for details.
[INFO] -------------------------------------------------------------
[WARNING] COMPILATION WARNING : 
[INFO] -------------------------------------------------------------
[WARNING] <https://builds.apache.org/job/carbondata-master-spark-2.1/ws/core/src/main/java/org/apache/carbondata/core/memory/CarbonUnsafe.java>:[23,16] sun.misc.Unsafe is internal proprietary API and may be removed in a future release
[WARNING] <https://builds.apache.org/job/carbondata-master-spark-2.1/ws/core/src/main/java/org/apache/carbondata/core/memory/CarbonUnsafe.java>:[43,18] sun.misc.Unsafe is internal proprietary API and may be removed in a future release
[WARNING] <https://builds.apache.org/job/carbondata-master-spark-2.1/ws/core/src/main/java/org/apache/carbondata/core/memory/CarbonUnsafe.java>:[47,21] sun.misc.Unsafe is internal proprietary API and may be removed in a future release
[WARNING] <https://builds.apache.org/job/carbondata-master-spark-2.1/ws/core/src/main/java/org/apache/carbondata/core/memory/CarbonUnsafe.java>:[49,17] sun.misc.Unsafe is internal proprietary API and may be removed in a future release
[WARNING] <https://builds.apache.org/job/carbondata-master-spark-2.1/ws/core/src/main/java/org/apache/carbondata/core/memory/CarbonUnsafe.java>:[70,17] sun.misc.Unsafe is internal proprietary API and may be removed in a future release
[INFO] 5 warnings 
[INFO] -------------------------------------------------------------
[INFO] -------------------------------------------------------------
[ERROR] COMPILATION ERROR : 
[INFO] -------------------------------------------------------------
[ERROR] <https://builds.apache.org/job/carbondata-master-spark-2.1/ws/core/src/main/java/org/apache/carbondata/core/metadata/converter/ThriftWrapperSchemaConverterImpl.java>:[236,58] cannot find symbol
  symbol:   variable NATIVE_HIVE
  location: class org.apache.carbondata.format.PartitionType
[ERROR] <https://builds.apache.org/job/carbondata-master-spark-2.1/ws/core/src/main/java/org/apache/carbondata/core/metadata/converter/ThriftWrapperSchemaConverterImpl.java>:[238,58] cannot find symbol
  symbol:   variable NATIVE_HIVE
  location: class org.apache.carbondata.format.PartitionType
[ERROR] <https://builds.apache.org/job/carbondata-master-spark-2.1/ws/core/src/main/java/org/apache/carbondata/core/metadata/converter/ThriftWrapperSchemaConverterImpl.java>:[559,12] an enum switch case label must be the unqualified name of an enumeration constant
[INFO] 3 errors 
[INFO] -------------------------------------------------------------
[INFO] ------------------------------------------------------------------------
[INFO] Reactor Summary:
[INFO] 
[INFO] Apache CarbonData :: Parent ........................ SUCCESS [ 10.483 s]
[INFO] Apache CarbonData :: Common ........................ SUCCESS [ 18.075 s]
[INFO] Apache CarbonData :: Core .......................... FAILURE [ 13.970 s]
[INFO] Apache CarbonData :: Processing .................... SKIPPED
[INFO] Apache CarbonData :: Hadoop ........................ SKIPPED
[INFO] Apache CarbonData :: Spark Common .................. SKIPPED
[INFO] Apache CarbonData :: Streaming ..................... SKIPPED
[INFO] Apache CarbonData :: Spark2 ........................ SKIPPED
[INFO] Apache CarbonData :: Spark Common Test ............. SKIPPED
[INFO] Apache CarbonData :: Assembly ...................... SKIPPED
[INFO] Apache CarbonData :: Hive .......................... SKIPPED
[INFO] Apache CarbonData :: presto ........................ SKIPPED
[INFO] Apache CarbonData :: Spark2 Examples ............... SKIPPED
[INFO] ------------------------------------------------------------------------
[INFO] BUILD FAILURE
[INFO] ------------------------------------------------------------------------
[INFO] Total time: 58.687 s
[INFO] Finished at: 2017-12-19T15:20:31+00:00
[INFO] Final Memory: 88M/1808M
[INFO] ------------------------------------------------------------------------
[ERROR] Failed to execute goal org.apache.maven.plugins:maven-compiler-plugin:3.2:compile (default-compile) on project carbondata-core: Compilation failure: Compilation failure:
[ERROR] <https://builds.apache.org/job/carbondata-master-spark-2.1/ws/core/src/main/java/org/apache/carbondata/core/metadata/converter/ThriftWrapperSchemaConverterImpl.java>:[236,58] cannot find symbol
[ERROR] symbol:   variable NATIVE_HIVE
[ERROR] location: class org.apache.carbondata.format.PartitionType
[ERROR] <https://builds.apache.org/job/carbondata-master-spark-2.1/ws/core/src/main/java/org/apache/carbondata/core/metadata/converter/ThriftWrapperSchemaConverterImpl.java>:[238,58] cannot find symbol
[ERROR] symbol:   variable NATIVE_HIVE
[ERROR] location: class org.apache.carbondata.format.PartitionType
[ERROR] <https://builds.apache.org/job/carbondata-master-spark-2.1/ws/core/src/main/java/org/apache/carbondata/core/metadata/converter/ThriftWrapperSchemaConverterImpl.java>:[559,12] an enum switch case label must be the unqualified name of an enumeration constant
[ERROR] -> [Help 1]
org.apache.maven.lifecycle.LifecycleExecutionException: Failed to execute goal org.apache.maven.plugins:maven-compiler-plugin:3.2:compile (default-compile) on project carbondata-core: Compilation failure
	at org.apache.maven.lifecycle.internal.MojoExecutor.execute(MojoExecutor.java:212)
	at org.apache.maven.lifecycle.internal.MojoExecutor.execute(MojoExecutor.java:153)
	at org.apache.maven.lifecycle.internal.MojoExecutor.execute(MojoExecutor.java:145)
	at org.apache.maven.lifecycle.internal.LifecycleModuleBuilder.buildProject(LifecycleModuleBuilder.java:116)
	at org.apache.maven.lifecycle.internal.LifecycleModuleBuilder.buildProject(LifecycleModuleBuilder.java:80)
	at org.apache.maven.lifecycle.internal.builder.singlethreaded.SingleThreadedBuilder.build(SingleThreadedBuilder.java:51)
	at org.apache.maven.lifecycle.internal.LifecycleStarter.execute(LifecycleStarter.java:128)
	at org.apache.maven.DefaultMaven.doExecute(DefaultMaven.java:307)
	at org.apache.maven.DefaultMaven.doExecute(DefaultMaven.java:193)
	at org.apache.maven.DefaultMaven.execute(DefaultMaven.java:106)
	at org.jvnet.hudson.maven3.launcher.Maven33Launcher.main(Maven33Launcher.java:129)
	at sun.reflect.NativeMethodAccessorImpl.invoke0(Native Method)
	at sun.reflect.NativeMethodAccessorImpl.invoke(NativeMethodAccessorImpl.java:62)
	at sun.reflect.DelegatingMethodAccessorImpl.invoke(DelegatingMethodAccessorImpl.java:43)
	at java.lang.reflect.Method.invoke(Method.java:498)
	at org.codehaus.plexus.classworlds.launcher.Launcher.launchStandard(Launcher.java:330)
	at org.codehaus.plexus.classworlds.launcher.Launcher.launch(Launcher.java:238)
	at jenkins.maven3.agent.Maven33Main.launch(Maven33Main.java:176)
	at sun.reflect.NativeMethodAccessorImpl.invoke0(Native Method)
	at sun.reflect.NativeMethodAccessorImpl.invoke(NativeMethodAccessorImpl.java:62)
	at sun.reflect.DelegatingMethodAccessorImpl.invoke(DelegatingMethodAccessorImpl.java:43)
	at java.lang.reflect.Method.invoke(Method.java:498)
	at hudson.maven.Maven3Builder.call(Maven3Builder.java:139)
	at hudson.maven.Maven3Builder.call(Maven3Builder.java:70)
	at hudson.remoting.UserRequest.perform(UserRequest.java:181)
	at hudson.remoting.UserRequest.perform(UserRequest.java:52)
	at hudson.remoting.Request$2.run(Request.java:336)
	at hudson.remoting.InterceptingExecutorService$1.call(InterceptingExecutorService.java:68)
	at java.util.concurrent.FutureTask.run(FutureTask.java:266)
	at java.util.concurrent.ThreadPoolExecutor.runWorker(ThreadPoolExecutor.java:1149)
	at java.util.concurrent.ThreadPoolExecutor$Worker.run(ThreadPoolExecutor.java:624)
	at java.lang.Thread.run(Thread.java:748)
Caused by: org.apache.maven.plugin.compiler.CompilationFailureException: Compilation failure
	at org.apache.maven.plugin.compiler.AbstractCompilerMojo.execute(AbstractCompilerMojo.java:909)
	at org.apache.maven.plugin.compiler.CompilerMojo.execute(CompilerMojo.java:129)
	at org.apache.maven.plugin.DefaultBuildPluginManager.executeMojo(DefaultBuildPluginManager.java:134)
	at org.apache.maven.lifecycle.internal.MojoExecutor.execute(MojoExecutor.java:207)
	... 31 more
[ERROR] 
[ERROR] Re-run Maven using the -X switch to enable full debug logging.
[ERROR] 
[ERROR] For more information about the errors and possible solutions, please read the following articles:
[ERROR] [Help 1] http://cwiki.apache.org/confluence/display/MAVEN/MojoFailureException
[ERROR] 
[ERROR] After correcting the problems, you can resume the build with the command
[ERROR]   mvn <goals> -rf :carbondata-core
[JENKINS] Archiving <https://builds.apache.org/job/carbondata-master-spark-2.1/ws/processing/pom.xml> to org.apache.carbondata/carbondata-processing/1.3.0-SNAPSHOT/carbondata-processing-1.3.0-SNAPSHOT.pom
[JENKINS] Archiving <https://builds.apache.org/job/carbondata-master-spark-2.1/ws/streaming/pom.xml> to org.apache.carbondata/carbondata-streaming/1.3.0-SNAPSHOT/carbondata-streaming-1.3.0-SNAPSHOT.pom
[JENKINS] Archiving <https://builds.apache.org/job/carbondata-master-spark-2.1/ws/integration/spark-common/pom.xml> to org.apache.carbondata/carbondata-spark-common/1.3.0-SNAPSHOT/carbondata-spark-common-1.3.0-SNAPSHOT.pom
[JENKINS] Archiving <https://builds.apache.org/job/carbondata-master-spark-2.1/ws/integration/hive/pom.xml> to org.apache.carbondata/carbondata-hive/1.3.0-SNAPSHOT/carbondata-hive-1.3.0-SNAPSHOT.pom
[JENKINS] Archiving <https://builds.apache.org/job/carbondata-master-spark-2.1/ws/common/pom.xml> to org.apache.carbondata/carbondata-common/1.3.0-SNAPSHOT/carbondata-common-1.3.0-SNAPSHOT.pom
[JENKINS] Archiving <https://builds.apache.org/job/carbondata-master-spark-2.1/ws/common/target/carbondata-common-1.3.0-SNAPSHOT.jar> to org.apache.carbondata/carbondata-common/1.3.0-SNAPSHOT/carbondata-common-1.3.0-SNAPSHOT.jar
[JENKINS] Archiving <https://builds.apache.org/job/carbondata-master-spark-2.1/ws/examples/spark2/pom.xml> to org.apache.carbondata/carbondata-examples-spark2/1.3.0-SNAPSHOT/carbondata-examples-spark2-1.3.0-SNAPSHOT.pom
[JENKINS] Archiving <https://builds.apache.org/job/carbondata-master-spark-2.1/ws/integration/spark2/pom.xml> to org.apache.carbondata/carbondata-spark2/1.3.0-SNAPSHOT/carbondata-spark2-1.3.0-SNAPSHOT.pom
[JENKINS] Archiving <https://builds.apache.org/job/carbondata-master-spark-2.1/ws/assembly/pom.xml> to org.apache.carbondata/carbondata-assembly/1.3.0-SNAPSHOT/carbondata-assembly-1.3.0-SNAPSHOT.pom
[JENKINS] Archiving <https://builds.apache.org/job/carbondata-master-spark-2.1/ws/pom.xml> to org.apache.carbondata/carbondata-parent/1.3.0-SNAPSHOT/carbondata-parent-1.3.0-SNAPSHOT.pom
[JENKINS] Archiving <https://builds.apache.org/job/carbondata-master-spark-2.1/ws/core/pom.xml> to org.apache.carbondata/carbondata-core/1.3.0-SNAPSHOT/carbondata-core-1.3.0-SNAPSHOT.pom
[JENKINS] Archiving <https://builds.apache.org/job/carbondata-master-spark-2.1/ws/hadoop/pom.xml> to org.apache.carbondata/carbondata-hadoop/1.3.0-SNAPSHOT/carbondata-hadoop-1.3.0-SNAPSHOT.pom
[JENKINS] Archiving <https://builds.apache.org/job/carbondata-master-spark-2.1/ws/integration/presto/pom.xml> to org.apache.carbondata/carbondata-presto/1.3.0-SNAPSHOT/carbondata-presto-1.3.0-SNAPSHOT.pom
[JENKINS] Archiving <https://builds.apache.org/job/carbondata-master-spark-2.1/ws/integration/spark-common-test/pom.xml> to org.apache.carbondata/carbondata-spark-common-test/1.3.0-SNAPSHOT/carbondata-spark-common-test-1.3.0-SNAPSHOT.pom
Not sending mail to unregistered user jacky.likun@huawei.com
Sending e-mails to: commits@carbondata.apache.org ravi.pesala@gmail.com tomanishgupta18@gmail.com
channel stopped
Not sending mail to unregistered user jacky.likun@huawei.com
Not sending mail to unregistered user kumarvishal.1802@gmail.com

Build failed in Jenkins: carbondata-master-spark-2.1 #1769

Posted by Apache Jenkins Server <je...@builds.apache.org>.
See <https://builds.apache.org/job/carbondata-master-spark-2.1/1769/display/redirect?page=changes>

Changes:

[kumarvishal.1802] [CARBONDATA-1743] fix conurrent pre-agg creation and query

------------------------------------------
[...truncated 9.62 KB...]
[INFO] 
[INFO] --- scalastyle-maven-plugin:0.8.0:check (default) @ carbondata-parent ---
[WARNING] sourceDirectory is not specified or does not exist value=<https://builds.apache.org/job/carbondata-master-spark-2.1/ws/src/main/scala>
Saving to outputFile=<https://builds.apache.org/job/carbondata-master-spark-2.1/ws/target/scalastyle-output.xml>
Processed 0 file(s)
Found 0 errors
Found 0 warnings
Found 0 infos
Finished in 150 ms
[INFO] 
[INFO] --- jacoco-maven-plugin:0.7.9:report (default-report) @ carbondata-parent ---
[INFO] Skipping JaCoCo execution due to missing execution data file.
[INFO] 
[INFO] --- jacoco-maven-plugin:0.7.9:report-integration (default-report-integration) @ carbondata-parent ---
[INFO] Skipping JaCoCo execution due to missing execution data file.
[INFO] 
[INFO] --- jacoco-maven-plugin:0.7.9:check (default-check) @ carbondata-parent ---
[INFO] Skipping JaCoCo execution due to missing execution data <https://builds.apache.org/job/carbondata-master-spark-2.1/ws/target/jacoco.exec>
[INFO] 
[INFO] --- maven-install-plugin:2.5.2:install (default-install) @ carbondata-parent ---
[INFO] Installing <https://builds.apache.org/job/carbondata-master-spark-2.1/ws/pom.xml> to /home/jenkins/jenkins-slave/maven-repositories/0/org/apache/carbondata/carbondata-parent/1.3.0-SNAPSHOT/carbondata-parent-1.3.0-SNAPSHOT.pom
[INFO]                                                                         
[INFO] ------------------------------------------------------------------------
[INFO] Building Apache CarbonData :: Common 1.3.0-SNAPSHOT
[INFO] ------------------------------------------------------------------------
[INFO] 
[INFO] --- maven-clean-plugin:2.5:clean (default-clean) @ carbondata-common ---
[INFO] Deleting <https://builds.apache.org/job/carbondata-master-spark-2.1/ws/common/target>
[INFO] 
[INFO] --- jacoco-maven-plugin:0.7.9:prepare-agent (default-prepare-agent) @ carbondata-common ---
[INFO] argLine set to -javaagent:/home/jenkins/jenkins-slave/maven-repositories/0/org/jacoco/org.jacoco.agent/0.7.9/org.jacoco.agent-0.7.9-runtime.jar=destfile=<https://builds.apache.org/job/carbondata-master-spark-2.1/ws/common/target/jacoco.exec>
[INFO] 
[INFO] --- maven-remote-resources-plugin:1.5:process (default) @ carbondata-common ---
[INFO] 
[INFO] --- maven-resources-plugin:2.7:resources (default-resources) @ carbondata-common ---
[INFO] Using 'UTF-8' encoding to copy filtered resources.
[INFO] skip non existing resourceDirectory <https://builds.apache.org/job/carbondata-master-spark-2.1/ws/common/src/main/resources>
[INFO] Copying 3 resources
[INFO] 
[INFO] --- maven-compiler-plugin:3.2:compile (default-compile) @ carbondata-common ---
[INFO] Changes detected - recompiling the module!
[INFO] Compiling 10 source files to <https://builds.apache.org/job/carbondata-master-spark-2.1/ws/common/target/classes>
[INFO] 
[INFO] >>> findbugs-maven-plugin:3.0.4:check (analyze-compile) > :findbugs @ carbondata-common >>>
[INFO] 
[INFO] --- findbugs-maven-plugin:3.0.4:findbugs (findbugs) @ carbondata-common ---
[INFO] Fork Value is true
[INFO] Done FindBugs Analysis....
[INFO] 
[INFO] <<< findbugs-maven-plugin:3.0.4:check (analyze-compile) < :findbugs @ carbondata-common <<<
[INFO] 
[INFO] --- findbugs-maven-plugin:3.0.4:check (analyze-compile) @ carbondata-common ---
[INFO] BugInstance size is 0
[INFO] Error size is 0
[INFO] No errors/warnings found
[INFO] 
[INFO] --- maven-resources-plugin:2.7:testResources (default-testResources) @ carbondata-common ---
[INFO] Using 'UTF-8' encoding to copy filtered resources.
[INFO] skip non existing resourceDirectory <https://builds.apache.org/job/carbondata-master-spark-2.1/ws/common/src/test/resources>
[INFO] Copying 3 resources
[INFO] 
[INFO] --- maven-compiler-plugin:3.2:testCompile (default-testCompile) @ carbondata-common ---
[INFO] Changes detected - recompiling the module!
[INFO] Compiling 7 source files to <https://builds.apache.org/job/carbondata-master-spark-2.1/ws/common/target/test-classes>
[INFO] 
[INFO] --- maven-surefire-plugin:2.18.1:test (default-test) @ carbondata-common ---
[JENKINS] Recording test results
[INFO] 
[INFO] --- maven-jar-plugin:2.5:jar (default-jar) @ carbondata-common ---
[INFO] Building jar: <https://builds.apache.org/job/carbondata-master-spark-2.1/ws/common/target/carbondata-common-1.3.0-SNAPSHOT.jar>
[INFO] 
[INFO] --- maven-site-plugin:3.4:attach-descriptor (attach-descriptor) @ carbondata-common ---
[INFO] 
[INFO] --- jacoco-maven-plugin:0.7.9:prepare-agent-integration (default-prepare-agent-integration) @ carbondata-common ---
[INFO] argLine set to -javaagent:/home/jenkins/jenkins-slave/maven-repositories/0/org/jacoco/org.jacoco.agent/0.7.9/org.jacoco.agent-0.7.9-runtime.jar=destfile=<https://builds.apache.org/job/carbondata-master-spark-2.1/ws/common/target/jacoco-it.exec>
[INFO] 
[INFO] --- maven-checkstyle-plugin:2.17:check (default) @ carbondata-common ---
[INFO] Starting audit...
Audit done.
[INFO] 
[INFO] --- scalastyle-maven-plugin:0.8.0:check (default) @ carbondata-common ---
[WARNING] sourceDirectory is not specified or does not exist value=<https://builds.apache.org/job/carbondata-master-spark-2.1/ws/common/src/main/scala>
Saving to outputFile=<https://builds.apache.org/job/carbondata-master-spark-2.1/ws/common/target/scalastyle-output.xml>
Processed 0 file(s)
Found 0 errors
Found 0 warnings
Found 0 infos
Finished in 1 ms
[INFO] 
[INFO] --- jacoco-maven-plugin:0.7.9:report (default-report) @ carbondata-common ---
[INFO] Skipping JaCoCo execution due to missing execution data file.
[INFO] 
[INFO] --- jacoco-maven-plugin:0.7.9:report-integration (default-report-integration) @ carbondata-common ---
[INFO] Skipping JaCoCo execution due to missing execution data file.
[INFO] 
[INFO] --- jacoco-maven-plugin:0.7.9:check (default-check) @ carbondata-common ---
[INFO] Skipping JaCoCo execution due to missing execution data <https://builds.apache.org/job/carbondata-master-spark-2.1/ws/common/target/jacoco.exec>
[INFO] 
[INFO] --- maven-install-plugin:2.5.2:install (default-install) @ carbondata-common ---
[INFO] Installing <https://builds.apache.org/job/carbondata-master-spark-2.1/ws/common/target/carbondata-common-1.3.0-SNAPSHOT.jar> to /home/jenkins/jenkins-slave/maven-repositories/0/org/apache/carbondata/carbondata-common/1.3.0-SNAPSHOT/carbondata-common-1.3.0-SNAPSHOT.jar
[INFO] Installing <https://builds.apache.org/job/carbondata-master-spark-2.1/ws/common/pom.xml> to /home/jenkins/jenkins-slave/maven-repositories/0/org/apache/carbondata/carbondata-common/1.3.0-SNAPSHOT/carbondata-common-1.3.0-SNAPSHOT.pom
[INFO]                                                                         
[INFO] ------------------------------------------------------------------------
[INFO] Building Apache CarbonData :: Core 1.3.0-SNAPSHOT
[INFO] ------------------------------------------------------------------------
[INFO] Downloading: http://repository.apache.org/snapshots/org/apache/carbondata/carbondata-format/1.3.0-SNAPSHOT/maven-metadata.xml
[INFO] Downloading: http://repo1.maven.org/maven2/org/apache/carbondata/carbondata-format/1.3.0-SNAPSHOT/maven-metadata.xml
[INFO] Downloaded: http://repository.apache.org/snapshots/org/apache/carbondata/carbondata-format/1.3.0-SNAPSHOT/maven-metadata.xml (791 B at 1.8 KB/sec)
[INFO] 
[INFO] --- maven-clean-plugin:2.5:clean (default-clean) @ carbondata-core ---
[INFO] Deleting <https://builds.apache.org/job/carbondata-master-spark-2.1/ws/core/target>
[INFO] 
[INFO] --- jacoco-maven-plugin:0.7.9:prepare-agent (default-prepare-agent) @ carbondata-core ---
[INFO] argLine set to -javaagent:/home/jenkins/jenkins-slave/maven-repositories/0/org/jacoco/org.jacoco.agent/0.7.9/org.jacoco.agent-0.7.9-runtime.jar=destfile=<https://builds.apache.org/job/carbondata-master-spark-2.1/ws/core/target/jacoco.exec>
[INFO] 
[INFO] --- maven-remote-resources-plugin:1.5:process (default) @ carbondata-core ---
[INFO] 
[INFO] --- maven-resources-plugin:2.7:resources (default-resources) @ carbondata-core ---
[INFO] Using 'UTF-8' encoding to copy filtered resources.
[INFO] Copying 1 resource
[INFO] Copying 3 resources
[INFO] 
[INFO] --- maven-compiler-plugin:3.2:compile (default-compile) @ carbondata-core ---
[INFO] Changes detected - recompiling the module!
[INFO] Compiling 573 source files to <https://builds.apache.org/job/carbondata-master-spark-2.1/ws/core/target/classes>
[INFO] <https://builds.apache.org/job/carbondata-master-spark-2.1/ws/core/src/main/java/org/apache/carbondata/core/util/ByteUtil.java>: <https://builds.apache.org/job/carbondata-master-spark-2.1/ws/core/src/main/java/org/apache/carbondata/core/util/ByteUtil.java> uses or overrides a deprecated API.
[INFO] <https://builds.apache.org/job/carbondata-master-spark-2.1/ws/core/src/main/java/org/apache/carbondata/core/util/ByteUtil.java>: Recompile with -Xlint:deprecation for details.
[INFO] <https://builds.apache.org/job/carbondata-master-spark-2.1/ws/core/src/main/java/org/apache/carbondata/core/datamap/DataMapStoreManager.java>: Some input files use unchecked or unsafe operations.
[INFO] <https://builds.apache.org/job/carbondata-master-spark-2.1/ws/core/src/main/java/org/apache/carbondata/core/datamap/DataMapStoreManager.java>: Recompile with -Xlint:unchecked for details.
[INFO] -------------------------------------------------------------
[WARNING] COMPILATION WARNING : 
[INFO] -------------------------------------------------------------
[WARNING] <https://builds.apache.org/job/carbondata-master-spark-2.1/ws/core/src/main/java/org/apache/carbondata/core/memory/CarbonUnsafe.java>:[23,16] sun.misc.Unsafe is internal proprietary API and may be removed in a future release
[WARNING] <https://builds.apache.org/job/carbondata-master-spark-2.1/ws/core/src/main/java/org/apache/carbondata/core/memory/CarbonUnsafe.java>:[43,18] sun.misc.Unsafe is internal proprietary API and may be removed in a future release
[WARNING] <https://builds.apache.org/job/carbondata-master-spark-2.1/ws/core/src/main/java/org/apache/carbondata/core/memory/CarbonUnsafe.java>:[47,21] sun.misc.Unsafe is internal proprietary API and may be removed in a future release
[WARNING] <https://builds.apache.org/job/carbondata-master-spark-2.1/ws/core/src/main/java/org/apache/carbondata/core/memory/CarbonUnsafe.java>:[49,17] sun.misc.Unsafe is internal proprietary API and may be removed in a future release
[WARNING] <https://builds.apache.org/job/carbondata-master-spark-2.1/ws/core/src/main/java/org/apache/carbondata/core/memory/CarbonUnsafe.java>:[70,17] sun.misc.Unsafe is internal proprietary API and may be removed in a future release
[INFO] 5 warnings 
[INFO] -------------------------------------------------------------
[INFO] -------------------------------------------------------------
[ERROR] COMPILATION ERROR : 
[INFO] -------------------------------------------------------------
[ERROR] <https://builds.apache.org/job/carbondata-master-spark-2.1/ws/core/src/main/java/org/apache/carbondata/core/metadata/converter/ThriftWrapperSchemaConverterImpl.java>:[236,58] cannot find symbol
  symbol:   variable NATIVE_HIVE
  location: class org.apache.carbondata.format.PartitionType
[ERROR] <https://builds.apache.org/job/carbondata-master-spark-2.1/ws/core/src/main/java/org/apache/carbondata/core/metadata/converter/ThriftWrapperSchemaConverterImpl.java>:[238,58] cannot find symbol
  symbol:   variable NATIVE_HIVE
  location: class org.apache.carbondata.format.PartitionType
[ERROR] <https://builds.apache.org/job/carbondata-master-spark-2.1/ws/core/src/main/java/org/apache/carbondata/core/metadata/converter/ThriftWrapperSchemaConverterImpl.java>:[559,12] an enum switch case label must be the unqualified name of an enumeration constant
[INFO] 3 errors 
[INFO] -------------------------------------------------------------
[INFO] ------------------------------------------------------------------------
[INFO] Reactor Summary:
[INFO] 
[INFO] Apache CarbonData :: Parent ........................ SUCCESS [ 10.065 s]
[INFO] Apache CarbonData :: Common ........................ SUCCESS [ 16.133 s]
[INFO] Apache CarbonData :: Core .......................... FAILURE [ 13.895 s]
[INFO] Apache CarbonData :: Processing .................... SKIPPED
[INFO] Apache CarbonData :: Hadoop ........................ SKIPPED
[INFO] Apache CarbonData :: Spark Common .................. SKIPPED
[INFO] Apache CarbonData :: Streaming ..................... SKIPPED
[INFO] Apache CarbonData :: Spark2 ........................ SKIPPED
[INFO] Apache CarbonData :: Spark Common Test ............. SKIPPED
[INFO] Apache CarbonData :: Assembly ...................... SKIPPED
[INFO] Apache CarbonData :: Hive .......................... SKIPPED
[INFO] Apache CarbonData :: presto ........................ SKIPPED
[INFO] Apache CarbonData :: Spark2 Examples ............... SKIPPED
[INFO] ------------------------------------------------------------------------
[INFO] BUILD FAILURE
[INFO] ------------------------------------------------------------------------
[INFO] Total time: 55.986 s
[INFO] Finished at: 2017-12-19T14:01:25+00:00
[INFO] Final Memory: 89M/1756M
[INFO] ------------------------------------------------------------------------
[ERROR] Failed to execute goal org.apache.maven.plugins:maven-compiler-plugin:3.2:compile (default-compile) on project carbondata-core: Compilation failure: Compilation failure:
[ERROR] <https://builds.apache.org/job/carbondata-master-spark-2.1/ws/core/src/main/java/org/apache/carbondata/core/metadata/converter/ThriftWrapperSchemaConverterImpl.java>:[236,58] cannot find symbol
[ERROR] symbol:   variable NATIVE_HIVE
[ERROR] location: class org.apache.carbondata.format.PartitionType
[ERROR] <https://builds.apache.org/job/carbondata-master-spark-2.1/ws/core/src/main/java/org/apache/carbondata/core/metadata/converter/ThriftWrapperSchemaConverterImpl.java>:[238,58] cannot find symbol
[ERROR] symbol:   variable NATIVE_HIVE
[ERROR] location: class org.apache.carbondata.format.PartitionType
[ERROR] <https://builds.apache.org/job/carbondata-master-spark-2.1/ws/core/src/main/java/org/apache/carbondata/core/metadata/converter/ThriftWrapperSchemaConverterImpl.java>:[559,12] an enum switch case label must be the unqualified name of an enumeration constant
[ERROR] -> [Help 1]
org.apache.maven.lifecycle.LifecycleExecutionException: Failed to execute goal org.apache.maven.plugins:maven-compiler-plugin:3.2:compile (default-compile) on project carbondata-core: Compilation failure
	at org.apache.maven.lifecycle.internal.MojoExecutor.execute(MojoExecutor.java:212)
	at org.apache.maven.lifecycle.internal.MojoExecutor.execute(MojoExecutor.java:153)
	at org.apache.maven.lifecycle.internal.MojoExecutor.execute(MojoExecutor.java:145)
	at org.apache.maven.lifecycle.internal.LifecycleModuleBuilder.buildProject(LifecycleModuleBuilder.java:116)
	at org.apache.maven.lifecycle.internal.LifecycleModuleBuilder.buildProject(LifecycleModuleBuilder.java:80)
	at org.apache.maven.lifecycle.internal.builder.singlethreaded.SingleThreadedBuilder.build(SingleThreadedBuilder.java:51)
	at org.apache.maven.lifecycle.internal.LifecycleStarter.execute(LifecycleStarter.java:128)
	at org.apache.maven.DefaultMaven.doExecute(DefaultMaven.java:307)
	at org.apache.maven.DefaultMaven.doExecute(DefaultMaven.java:193)
	at org.apache.maven.DefaultMaven.execute(DefaultMaven.java:106)
	at org.jvnet.hudson.maven3.launcher.Maven33Launcher.main(Maven33Launcher.java:129)
	at sun.reflect.NativeMethodAccessorImpl.invoke0(Native Method)
	at sun.reflect.NativeMethodAccessorImpl.invoke(NativeMethodAccessorImpl.java:62)
	at sun.reflect.DelegatingMethodAccessorImpl.invoke(DelegatingMethodAccessorImpl.java:43)
	at java.lang.reflect.Method.invoke(Method.java:498)
	at org.codehaus.plexus.classworlds.launcher.Launcher.launchStandard(Launcher.java:330)
	at org.codehaus.plexus.classworlds.launcher.Launcher.launch(Launcher.java:238)
	at jenkins.maven3.agent.Maven33Main.launch(Maven33Main.java:176)
	at sun.reflect.NativeMethodAccessorImpl.invoke0(Native Method)
	at sun.reflect.NativeMethodAccessorImpl.invoke(NativeMethodAccessorImpl.java:62)
	at sun.reflect.DelegatingMethodAccessorImpl.invoke(DelegatingMethodAccessorImpl.java:43)
	at java.lang.reflect.Method.invoke(Method.java:498)
	at hudson.maven.Maven3Builder.call(Maven3Builder.java:139)
	at hudson.maven.Maven3Builder.call(Maven3Builder.java:70)
	at hudson.remoting.UserRequest.perform(UserRequest.java:181)
	at hudson.remoting.UserRequest.perform(UserRequest.java:52)
	at hudson.remoting.Request$2.run(Request.java:336)
	at hudson.remoting.InterceptingExecutorService$1.call(InterceptingExecutorService.java:68)
	at java.util.concurrent.FutureTask.run(FutureTask.java:266)
	at java.util.concurrent.ThreadPoolExecutor.runWorker(ThreadPoolExecutor.java:1149)
	at java.util.concurrent.ThreadPoolExecutor$Worker.run(ThreadPoolExecutor.java:624)
	at java.lang.Thread.run(Thread.java:748)
Caused by: org.apache.maven.plugin.compiler.CompilationFailureException: Compilation failure
	at org.apache.maven.plugin.compiler.AbstractCompilerMojo.execute(AbstractCompilerMojo.java:909)
	at org.apache.maven.plugin.compiler.CompilerMojo.execute(CompilerMojo.java:129)
	at org.apache.maven.plugin.DefaultBuildPluginManager.executeMojo(DefaultBuildPluginManager.java:134)
	at org.apache.maven.lifecycle.internal.MojoExecutor.execute(MojoExecutor.java:207)
	... 31 more
[ERROR] 
[ERROR] Re-run Maven using the -X switch to enable full debug logging.
[ERROR] 
[ERROR] For more information about the errors and possible solutions, please read the following articles:
[ERROR] [Help 1] http://cwiki.apache.org/confluence/display/MAVEN/MojoFailureException
[ERROR] 
[ERROR] After correcting the problems, you can resume the build with the command
[ERROR]   mvn <goals> -rf :carbondata-core
[JENKINS] Archiving <https://builds.apache.org/job/carbondata-master-spark-2.1/ws/processing/pom.xml> to org.apache.carbondata/carbondata-processing/1.3.0-SNAPSHOT/carbondata-processing-1.3.0-SNAPSHOT.pom
[JENKINS] Archiving <https://builds.apache.org/job/carbondata-master-spark-2.1/ws/streaming/pom.xml> to org.apache.carbondata/carbondata-streaming/1.3.0-SNAPSHOT/carbondata-streaming-1.3.0-SNAPSHOT.pom
[JENKINS] Archiving <https://builds.apache.org/job/carbondata-master-spark-2.1/ws/integration/spark-common/pom.xml> to org.apache.carbondata/carbondata-spark-common/1.3.0-SNAPSHOT/carbondata-spark-common-1.3.0-SNAPSHOT.pom
[JENKINS] Archiving <https://builds.apache.org/job/carbondata-master-spark-2.1/ws/integration/hive/pom.xml> to org.apache.carbondata/carbondata-hive/1.3.0-SNAPSHOT/carbondata-hive-1.3.0-SNAPSHOT.pom
[JENKINS] Archiving <https://builds.apache.org/job/carbondata-master-spark-2.1/ws/common/pom.xml> to org.apache.carbondata/carbondata-common/1.3.0-SNAPSHOT/carbondata-common-1.3.0-SNAPSHOT.pom
[JENKINS] Archiving <https://builds.apache.org/job/carbondata-master-spark-2.1/ws/common/target/carbondata-common-1.3.0-SNAPSHOT.jar> to org.apache.carbondata/carbondata-common/1.3.0-SNAPSHOT/carbondata-common-1.3.0-SNAPSHOT.jar
[JENKINS] Archiving <https://builds.apache.org/job/carbondata-master-spark-2.1/ws/examples/spark2/pom.xml> to org.apache.carbondata/carbondata-examples-spark2/1.3.0-SNAPSHOT/carbondata-examples-spark2-1.3.0-SNAPSHOT.pom
[JENKINS] Archiving <https://builds.apache.org/job/carbondata-master-spark-2.1/ws/integration/spark2/pom.xml> to org.apache.carbondata/carbondata-spark2/1.3.0-SNAPSHOT/carbondata-spark2-1.3.0-SNAPSHOT.pom
[JENKINS] Archiving <https://builds.apache.org/job/carbondata-master-spark-2.1/ws/assembly/pom.xml> to org.apache.carbondata/carbondata-assembly/1.3.0-SNAPSHOT/carbondata-assembly-1.3.0-SNAPSHOT.pom
[JENKINS] Archiving <https://builds.apache.org/job/carbondata-master-spark-2.1/ws/pom.xml> to org.apache.carbondata/carbondata-parent/1.3.0-SNAPSHOT/carbondata-parent-1.3.0-SNAPSHOT.pom
[JENKINS] Archiving <https://builds.apache.org/job/carbondata-master-spark-2.1/ws/core/pom.xml> to org.apache.carbondata/carbondata-core/1.3.0-SNAPSHOT/carbondata-core-1.3.0-SNAPSHOT.pom
[JENKINS] Archiving <https://builds.apache.org/job/carbondata-master-spark-2.1/ws/hadoop/pom.xml> to org.apache.carbondata/carbondata-hadoop/1.3.0-SNAPSHOT/carbondata-hadoop-1.3.0-SNAPSHOT.pom
[JENKINS] Archiving <https://builds.apache.org/job/carbondata-master-spark-2.1/ws/integration/presto/pom.xml> to org.apache.carbondata/carbondata-presto/1.3.0-SNAPSHOT/carbondata-presto-1.3.0-SNAPSHOT.pom
[JENKINS] Archiving <https://builds.apache.org/job/carbondata-master-spark-2.1/ws/integration/spark-common-test/pom.xml> to org.apache.carbondata/carbondata-spark-common-test/1.3.0-SNAPSHOT/carbondata-spark-common-test-1.3.0-SNAPSHOT.pom
Not sending mail to unregistered user jacky.likun@huawei.com
Sending e-mails to: commits@carbondata.apache.org ravi.pesala@gmail.com tomanishgupta18@gmail.com
channel stopped
Not sending mail to unregistered user jacky.likun@huawei.com
Not sending mail to unregistered user kumarvishal.1802@gmail.com

Build failed in Jenkins: carbondata-master-spark-2.1 #1768

Posted by Apache Jenkins Server <je...@builds.apache.org>.
See <https://builds.apache.org/job/carbondata-master-spark-2.1/1768/display/redirect?page=changes>

Changes:

[manishgupta88] [CARBONDATA-1900][Core,processing] Modify loadmetadata to store

------------------------------------------
[...truncated 9.70 KB...]
Audit done.
[INFO] 
[INFO] --- scalastyle-maven-plugin:0.8.0:check (default) @ carbondata-parent ---
[WARNING] sourceDirectory is not specified or does not exist value=<https://builds.apache.org/job/carbondata-master-spark-2.1/ws/src/main/scala>
Saving to outputFile=<https://builds.apache.org/job/carbondata-master-spark-2.1/ws/target/scalastyle-output.xml>
Processed 0 file(s)
Found 0 errors
Found 0 warnings
Found 0 infos
Finished in 180 ms
[INFO] 
[INFO] --- jacoco-maven-plugin:0.7.9:report (default-report) @ carbondata-parent ---
[INFO] Skipping JaCoCo execution due to missing execution data file.
[INFO] 
[INFO] --- jacoco-maven-plugin:0.7.9:report-integration (default-report-integration) @ carbondata-parent ---
[INFO] Skipping JaCoCo execution due to missing execution data file.
[INFO] 
[INFO] --- jacoco-maven-plugin:0.7.9:check (default-check) @ carbondata-parent ---
[INFO] Skipping JaCoCo execution due to missing execution data <https://builds.apache.org/job/carbondata-master-spark-2.1/ws/target/jacoco.exec>
[INFO] 
[INFO] --- maven-install-plugin:2.5.2:install (default-install) @ carbondata-parent ---
[INFO] Installing <https://builds.apache.org/job/carbondata-master-spark-2.1/ws/pom.xml> to /home/jenkins/jenkins-slave/maven-repositories/1/org/apache/carbondata/carbondata-parent/1.3.0-SNAPSHOT/carbondata-parent-1.3.0-SNAPSHOT.pom
[INFO]                                                                         
[INFO] ------------------------------------------------------------------------
[INFO] Building Apache CarbonData :: Common 1.3.0-SNAPSHOT
[INFO] ------------------------------------------------------------------------
[INFO] 
[INFO] --- maven-clean-plugin:2.5:clean (default-clean) @ carbondata-common ---
[INFO] Deleting <https://builds.apache.org/job/carbondata-master-spark-2.1/ws/common/target>
[INFO] 
[INFO] --- jacoco-maven-plugin:0.7.9:prepare-agent (default-prepare-agent) @ carbondata-common ---
[INFO] argLine set to -javaagent:/home/jenkins/jenkins-slave/maven-repositories/1/org/jacoco/org.jacoco.agent/0.7.9/org.jacoco.agent-0.7.9-runtime.jar=destfile=<https://builds.apache.org/job/carbondata-master-spark-2.1/ws/common/target/jacoco.exec>
[INFO] 
[INFO] --- maven-remote-resources-plugin:1.5:process (default) @ carbondata-common ---
[INFO] 
[INFO] --- maven-resources-plugin:2.7:resources (default-resources) @ carbondata-common ---
[INFO] Using 'UTF-8' encoding to copy filtered resources.
[INFO] skip non existing resourceDirectory <https://builds.apache.org/job/carbondata-master-spark-2.1/ws/common/src/main/resources>
[INFO] Copying 3 resources
[INFO] 
[INFO] --- maven-compiler-plugin:3.2:compile (default-compile) @ carbondata-common ---
[INFO] Changes detected - recompiling the module!
[INFO] Compiling 10 source files to <https://builds.apache.org/job/carbondata-master-spark-2.1/ws/common/target/classes>
[INFO] 
[INFO] >>> findbugs-maven-plugin:3.0.4:check (analyze-compile) > :findbugs @ carbondata-common >>>
[INFO] 
[INFO] --- findbugs-maven-plugin:3.0.4:findbugs (findbugs) @ carbondata-common ---
[INFO] Fork Value is true
[INFO] Done FindBugs Analysis....
[INFO] 
[INFO] <<< findbugs-maven-plugin:3.0.4:check (analyze-compile) < :findbugs @ carbondata-common <<<
[INFO] 
[INFO] --- findbugs-maven-plugin:3.0.4:check (analyze-compile) @ carbondata-common ---
[INFO] BugInstance size is 0
[INFO] Error size is 0
[INFO] No errors/warnings found
[INFO] 
[INFO] --- maven-resources-plugin:2.7:testResources (default-testResources) @ carbondata-common ---
[INFO] Using 'UTF-8' encoding to copy filtered resources.
[INFO] skip non existing resourceDirectory <https://builds.apache.org/job/carbondata-master-spark-2.1/ws/common/src/test/resources>
[INFO] Copying 3 resources
[INFO] 
[INFO] --- maven-compiler-plugin:3.2:testCompile (default-testCompile) @ carbondata-common ---
[INFO] Changes detected - recompiling the module!
[INFO] Compiling 7 source files to <https://builds.apache.org/job/carbondata-master-spark-2.1/ws/common/target/test-classes>
[INFO] 
[INFO] --- maven-surefire-plugin:2.18.1:test (default-test) @ carbondata-common ---
[JENKINS] Recording test results
[INFO] 
[INFO] --- maven-jar-plugin:2.5:jar (default-jar) @ carbondata-common ---
[INFO] Building jar: <https://builds.apache.org/job/carbondata-master-spark-2.1/ws/common/target/carbondata-common-1.3.0-SNAPSHOT.jar>
[INFO] 
[INFO] --- maven-site-plugin:3.4:attach-descriptor (attach-descriptor) @ carbondata-common ---
[INFO] 
[INFO] --- jacoco-maven-plugin:0.7.9:prepare-agent-integration (default-prepare-agent-integration) @ carbondata-common ---
[INFO] argLine set to -javaagent:/home/jenkins/jenkins-slave/maven-repositories/1/org/jacoco/org.jacoco.agent/0.7.9/org.jacoco.agent-0.7.9-runtime.jar=destfile=<https://builds.apache.org/job/carbondata-master-spark-2.1/ws/common/target/jacoco-it.exec>
[INFO] 
[INFO] --- maven-checkstyle-plugin:2.17:check (default) @ carbondata-common ---
[INFO] Starting audit...
Audit done.
[INFO] 
[INFO] --- scalastyle-maven-plugin:0.8.0:check (default) @ carbondata-common ---
[WARNING] sourceDirectory is not specified or does not exist value=<https://builds.apache.org/job/carbondata-master-spark-2.1/ws/common/src/main/scala>
Saving to outputFile=<https://builds.apache.org/job/carbondata-master-spark-2.1/ws/common/target/scalastyle-output.xml>
Processed 0 file(s)
Found 0 errors
Found 0 warnings
Found 0 infos
Finished in 1 ms
[INFO] 
[INFO] --- jacoco-maven-plugin:0.7.9:report (default-report) @ carbondata-common ---
[INFO] Skipping JaCoCo execution due to missing execution data file.
[INFO] 
[INFO] --- jacoco-maven-plugin:0.7.9:report-integration (default-report-integration) @ carbondata-common ---
[INFO] Skipping JaCoCo execution due to missing execution data file.
[INFO] 
[INFO] --- jacoco-maven-plugin:0.7.9:check (default-check) @ carbondata-common ---
[INFO] Skipping JaCoCo execution due to missing execution data <https://builds.apache.org/job/carbondata-master-spark-2.1/ws/common/target/jacoco.exec>
[INFO] 
[INFO] --- maven-install-plugin:2.5.2:install (default-install) @ carbondata-common ---
[INFO] Installing <https://builds.apache.org/job/carbondata-master-spark-2.1/ws/common/target/carbondata-common-1.3.0-SNAPSHOT.jar> to /home/jenkins/jenkins-slave/maven-repositories/1/org/apache/carbondata/carbondata-common/1.3.0-SNAPSHOT/carbondata-common-1.3.0-SNAPSHOT.jar
[INFO] Installing <https://builds.apache.org/job/carbondata-master-spark-2.1/ws/common/pom.xml> to /home/jenkins/jenkins-slave/maven-repositories/1/org/apache/carbondata/carbondata-common/1.3.0-SNAPSHOT/carbondata-common-1.3.0-SNAPSHOT.pom
[INFO]                                                                         
[INFO] ------------------------------------------------------------------------
[INFO] Building Apache CarbonData :: Core 1.3.0-SNAPSHOT
[INFO] ------------------------------------------------------------------------
[INFO] Downloading: http://repo1.maven.org/maven2/org/apache/carbondata/carbondata-format/1.3.0-SNAPSHOT/maven-metadata.xml
[INFO] Downloading: http://repository.apache.org/snapshots/org/apache/carbondata/carbondata-format/1.3.0-SNAPSHOT/maven-metadata.xml
[INFO] Downloaded: http://repository.apache.org/snapshots/org/apache/carbondata/carbondata-format/1.3.0-SNAPSHOT/maven-metadata.xml (791 B at 1.8 KB/sec)
[INFO] 
[INFO] --- maven-clean-plugin:2.5:clean (default-clean) @ carbondata-core ---
[INFO] Deleting <https://builds.apache.org/job/carbondata-master-spark-2.1/ws/core/target>
[INFO] 
[INFO] --- jacoco-maven-plugin:0.7.9:prepare-agent (default-prepare-agent) @ carbondata-core ---
[INFO] argLine set to -javaagent:/home/jenkins/jenkins-slave/maven-repositories/1/org/jacoco/org.jacoco.agent/0.7.9/org.jacoco.agent-0.7.9-runtime.jar=destfile=<https://builds.apache.org/job/carbondata-master-spark-2.1/ws/core/target/jacoco.exec>
[INFO] 
[INFO] --- maven-remote-resources-plugin:1.5:process (default) @ carbondata-core ---
[INFO] 
[INFO] --- maven-resources-plugin:2.7:resources (default-resources) @ carbondata-core ---
[INFO] Using 'UTF-8' encoding to copy filtered resources.
[INFO] Copying 1 resource
[INFO] Copying 3 resources
[INFO] 
[INFO] --- maven-compiler-plugin:3.2:compile (default-compile) @ carbondata-core ---
[INFO] Changes detected - recompiling the module!
[INFO] Compiling 573 source files to <https://builds.apache.org/job/carbondata-master-spark-2.1/ws/core/target/classes>
[INFO] <https://builds.apache.org/job/carbondata-master-spark-2.1/ws/core/src/main/java/org/apache/carbondata/core/util/ByteUtil.java>: <https://builds.apache.org/job/carbondata-master-spark-2.1/ws/core/src/main/java/org/apache/carbondata/core/util/ByteUtil.java> uses or overrides a deprecated API.
[INFO] <https://builds.apache.org/job/carbondata-master-spark-2.1/ws/core/src/main/java/org/apache/carbondata/core/util/ByteUtil.java>: Recompile with -Xlint:deprecation for details.
[INFO] <https://builds.apache.org/job/carbondata-master-spark-2.1/ws/core/src/main/java/org/apache/carbondata/core/datamap/DataMapStoreManager.java>: Some input files use unchecked or unsafe operations.
[INFO] <https://builds.apache.org/job/carbondata-master-spark-2.1/ws/core/src/main/java/org/apache/carbondata/core/datamap/DataMapStoreManager.java>: Recompile with -Xlint:unchecked for details.
[INFO] -------------------------------------------------------------
[WARNING] COMPILATION WARNING : 
[INFO] -------------------------------------------------------------
[WARNING] <https://builds.apache.org/job/carbondata-master-spark-2.1/ws/core/src/main/java/org/apache/carbondata/core/memory/CarbonUnsafe.java>:[23,16] sun.misc.Unsafe is internal proprietary API and may be removed in a future release
[WARNING] <https://builds.apache.org/job/carbondata-master-spark-2.1/ws/core/src/main/java/org/apache/carbondata/core/memory/CarbonUnsafe.java>:[43,18] sun.misc.Unsafe is internal proprietary API and may be removed in a future release
[WARNING] <https://builds.apache.org/job/carbondata-master-spark-2.1/ws/core/src/main/java/org/apache/carbondata/core/memory/CarbonUnsafe.java>:[47,21] sun.misc.Unsafe is internal proprietary API and may be removed in a future release
[WARNING] <https://builds.apache.org/job/carbondata-master-spark-2.1/ws/core/src/main/java/org/apache/carbondata/core/memory/CarbonUnsafe.java>:[49,17] sun.misc.Unsafe is internal proprietary API and may be removed in a future release
[WARNING] <https://builds.apache.org/job/carbondata-master-spark-2.1/ws/core/src/main/java/org/apache/carbondata/core/memory/CarbonUnsafe.java>:[70,17] sun.misc.Unsafe is internal proprietary API and may be removed in a future release
[INFO] 5 warnings 
[INFO] -------------------------------------------------------------
[INFO] -------------------------------------------------------------
[ERROR] COMPILATION ERROR : 
[INFO] -------------------------------------------------------------
[ERROR] <https://builds.apache.org/job/carbondata-master-spark-2.1/ws/core/src/main/java/org/apache/carbondata/core/metadata/converter/ThriftWrapperSchemaConverterImpl.java>:[236,58] cannot find symbol
  symbol:   variable NATIVE_HIVE
  location: class org.apache.carbondata.format.PartitionType
[ERROR] <https://builds.apache.org/job/carbondata-master-spark-2.1/ws/core/src/main/java/org/apache/carbondata/core/metadata/converter/ThriftWrapperSchemaConverterImpl.java>:[238,58] cannot find symbol
  symbol:   variable NATIVE_HIVE
  location: class org.apache.carbondata.format.PartitionType
[ERROR] <https://builds.apache.org/job/carbondata-master-spark-2.1/ws/core/src/main/java/org/apache/carbondata/core/metadata/converter/ThriftWrapperSchemaConverterImpl.java>:[559,12] an enum switch case label must be the unqualified name of an enumeration constant
[INFO] 3 errors 
[INFO] -------------------------------------------------------------
[INFO] ------------------------------------------------------------------------
[INFO] Reactor Summary:
[INFO] 
[INFO] Apache CarbonData :: Parent ........................ SUCCESS [ 10.251 s]
[INFO] Apache CarbonData :: Common ........................ SUCCESS [ 15.857 s]
[INFO] Apache CarbonData :: Core .......................... FAILURE [ 12.361 s]
[INFO] Apache CarbonData :: Processing .................... SKIPPED
[INFO] Apache CarbonData :: Hadoop ........................ SKIPPED
[INFO] Apache CarbonData :: Spark Common .................. SKIPPED
[INFO] Apache CarbonData :: Streaming ..................... SKIPPED
[INFO] Apache CarbonData :: Spark2 ........................ SKIPPED
[INFO] Apache CarbonData :: Spark Common Test ............. SKIPPED
[INFO] Apache CarbonData :: Assembly ...................... SKIPPED
[INFO] Apache CarbonData :: Hive .......................... SKIPPED
[INFO] Apache CarbonData :: presto ........................ SKIPPED
[INFO] Apache CarbonData :: Spark2 Examples ............... SKIPPED
[INFO] ------------------------------------------------------------------------
[INFO] BUILD FAILURE
[INFO] ------------------------------------------------------------------------
[INFO] Total time: 54.477 s
[INFO] Finished at: 2017-12-19T10:19:34+00:00
[INFO] Final Memory: 88M/1790M
[INFO] ------------------------------------------------------------------------
[ERROR] Failed to execute goal org.apache.maven.plugins:maven-compiler-plugin:3.2:compile (default-compile) on project carbondata-core: Compilation failure: Compilation failure:
[ERROR] <https://builds.apache.org/job/carbondata-master-spark-2.1/ws/core/src/main/java/org/apache/carbondata/core/metadata/converter/ThriftWrapperSchemaConverterImpl.java>:[236,58] cannot find symbol
[ERROR] symbol:   variable NATIVE_HIVE
[ERROR] location: class org.apache.carbondata.format.PartitionType
[ERROR] <https://builds.apache.org/job/carbondata-master-spark-2.1/ws/core/src/main/java/org/apache/carbondata/core/metadata/converter/ThriftWrapperSchemaConverterImpl.java>:[238,58] cannot find symbol
[ERROR] symbol:   variable NATIVE_HIVE
[ERROR] location: class org.apache.carbondata.format.PartitionType
[ERROR] <https://builds.apache.org/job/carbondata-master-spark-2.1/ws/core/src/main/java/org/apache/carbondata/core/metadata/converter/ThriftWrapperSchemaConverterImpl.java>:[559,12] an enum switch case label must be the unqualified name of an enumeration constant
[ERROR] -> [Help 1]
org.apache.maven.lifecycle.LifecycleExecutionException: Failed to execute goal org.apache.maven.plugins:maven-compiler-plugin:3.2:compile (default-compile) on project carbondata-core: Compilation failure
	at org.apache.maven.lifecycle.internal.MojoExecutor.execute(MojoExecutor.java:212)
	at org.apache.maven.lifecycle.internal.MojoExecutor.execute(MojoExecutor.java:153)
	at org.apache.maven.lifecycle.internal.MojoExecutor.execute(MojoExecutor.java:145)
	at org.apache.maven.lifecycle.internal.LifecycleModuleBuilder.buildProject(LifecycleModuleBuilder.java:116)
	at org.apache.maven.lifecycle.internal.LifecycleModuleBuilder.buildProject(LifecycleModuleBuilder.java:80)
	at org.apache.maven.lifecycle.internal.builder.singlethreaded.SingleThreadedBuilder.build(SingleThreadedBuilder.java:51)
	at org.apache.maven.lifecycle.internal.LifecycleStarter.execute(LifecycleStarter.java:128)
	at org.apache.maven.DefaultMaven.doExecute(DefaultMaven.java:307)
	at org.apache.maven.DefaultMaven.doExecute(DefaultMaven.java:193)
	at org.apache.maven.DefaultMaven.execute(DefaultMaven.java:106)
	at org.jvnet.hudson.maven3.launcher.Maven33Launcher.main(Maven33Launcher.java:129)
	at sun.reflect.NativeMethodAccessorImpl.invoke0(Native Method)
	at sun.reflect.NativeMethodAccessorImpl.invoke(NativeMethodAccessorImpl.java:62)
	at sun.reflect.DelegatingMethodAccessorImpl.invoke(DelegatingMethodAccessorImpl.java:43)
	at java.lang.reflect.Method.invoke(Method.java:498)
	at org.codehaus.plexus.classworlds.launcher.Launcher.launchStandard(Launcher.java:330)
	at org.codehaus.plexus.classworlds.launcher.Launcher.launch(Launcher.java:238)
	at jenkins.maven3.agent.Maven33Main.launch(Maven33Main.java:176)
	at sun.reflect.NativeMethodAccessorImpl.invoke0(Native Method)
	at sun.reflect.NativeMethodAccessorImpl.invoke(NativeMethodAccessorImpl.java:62)
	at sun.reflect.DelegatingMethodAccessorImpl.invoke(DelegatingMethodAccessorImpl.java:43)
	at java.lang.reflect.Method.invoke(Method.java:498)
	at hudson.maven.Maven3Builder.call(Maven3Builder.java:139)
	at hudson.maven.Maven3Builder.call(Maven3Builder.java:70)
	at hudson.remoting.UserRequest.perform(UserRequest.java:181)
	at hudson.remoting.UserRequest.perform(UserRequest.java:52)
	at hudson.remoting.Request$2.run(Request.java:336)
	at hudson.remoting.InterceptingExecutorService$1.call(InterceptingExecutorService.java:68)
	at java.util.concurrent.FutureTask.run(FutureTask.java:266)
	at java.util.concurrent.ThreadPoolExecutor.runWorker(ThreadPoolExecutor.java:1149)
	at java.util.concurrent.ThreadPoolExecutor$Worker.run(ThreadPoolExecutor.java:624)
	at java.lang.Thread.run(Thread.java:748)
Caused by: org.apache.maven.plugin.compiler.CompilationFailureException: Compilation failure
	at org.apache.maven.plugin.compiler.AbstractCompilerMojo.execute(AbstractCompilerMojo.java:909)
	at org.apache.maven.plugin.compiler.CompilerMojo.execute(CompilerMojo.java:129)
	at org.apache.maven.plugin.DefaultBuildPluginManager.executeMojo(DefaultBuildPluginManager.java:134)
	at org.apache.maven.lifecycle.internal.MojoExecutor.execute(MojoExecutor.java:207)
	... 31 more
[ERROR] 
[ERROR] Re-run Maven using the -X switch to enable full debug logging.
[ERROR] 
[ERROR] For more information about the errors and possible solutions, please read the following articles:
[ERROR] [Help 1] http://cwiki.apache.org/confluence/display/MAVEN/MojoFailureException
[ERROR] 
[ERROR] After correcting the problems, you can resume the build with the command
[ERROR]   mvn <goals> -rf :carbondata-core
[JENKINS] Archiving <https://builds.apache.org/job/carbondata-master-spark-2.1/ws/processing/pom.xml> to org.apache.carbondata/carbondata-processing/1.3.0-SNAPSHOT/carbondata-processing-1.3.0-SNAPSHOT.pom
[JENKINS] Archiving <https://builds.apache.org/job/carbondata-master-spark-2.1/ws/streaming/pom.xml> to org.apache.carbondata/carbondata-streaming/1.3.0-SNAPSHOT/carbondata-streaming-1.3.0-SNAPSHOT.pom
[JENKINS] Archiving <https://builds.apache.org/job/carbondata-master-spark-2.1/ws/integration/spark-common/pom.xml> to org.apache.carbondata/carbondata-spark-common/1.3.0-SNAPSHOT/carbondata-spark-common-1.3.0-SNAPSHOT.pom
[JENKINS] Archiving <https://builds.apache.org/job/carbondata-master-spark-2.1/ws/integration/hive/pom.xml> to org.apache.carbondata/carbondata-hive/1.3.0-SNAPSHOT/carbondata-hive-1.3.0-SNAPSHOT.pom
[JENKINS] Archiving <https://builds.apache.org/job/carbondata-master-spark-2.1/ws/common/pom.xml> to org.apache.carbondata/carbondata-common/1.3.0-SNAPSHOT/carbondata-common-1.3.0-SNAPSHOT.pom
[JENKINS] Archiving <https://builds.apache.org/job/carbondata-master-spark-2.1/ws/common/target/carbondata-common-1.3.0-SNAPSHOT.jar> to org.apache.carbondata/carbondata-common/1.3.0-SNAPSHOT/carbondata-common-1.3.0-SNAPSHOT.jar
[JENKINS] Archiving <https://builds.apache.org/job/carbondata-master-spark-2.1/ws/examples/spark2/pom.xml> to org.apache.carbondata/carbondata-examples-spark2/1.3.0-SNAPSHOT/carbondata-examples-spark2-1.3.0-SNAPSHOT.pom
[JENKINS] Archiving <https://builds.apache.org/job/carbondata-master-spark-2.1/ws/integration/spark2/pom.xml> to org.apache.carbondata/carbondata-spark2/1.3.0-SNAPSHOT/carbondata-spark2-1.3.0-SNAPSHOT.pom
[JENKINS] Archiving <https://builds.apache.org/job/carbondata-master-spark-2.1/ws/assembly/pom.xml> to org.apache.carbondata/carbondata-assembly/1.3.0-SNAPSHOT/carbondata-assembly-1.3.0-SNAPSHOT.pom
[JENKINS] Archiving <https://builds.apache.org/job/carbondata-master-spark-2.1/ws/pom.xml> to org.apache.carbondata/carbondata-parent/1.3.0-SNAPSHOT/carbondata-parent-1.3.0-SNAPSHOT.pom
[JENKINS] Archiving <https://builds.apache.org/job/carbondata-master-spark-2.1/ws/core/pom.xml> to org.apache.carbondata/carbondata-core/1.3.0-SNAPSHOT/carbondata-core-1.3.0-SNAPSHOT.pom
[JENKINS] Archiving <https://builds.apache.org/job/carbondata-master-spark-2.1/ws/hadoop/pom.xml> to org.apache.carbondata/carbondata-hadoop/1.3.0-SNAPSHOT/carbondata-hadoop-1.3.0-SNAPSHOT.pom
[JENKINS] Archiving <https://builds.apache.org/job/carbondata-master-spark-2.1/ws/integration/presto/pom.xml> to org.apache.carbondata/carbondata-presto/1.3.0-SNAPSHOT/carbondata-presto-1.3.0-SNAPSHOT.pom
[JENKINS] Archiving <https://builds.apache.org/job/carbondata-master-spark-2.1/ws/integration/spark-common-test/pom.xml> to org.apache.carbondata/carbondata-spark-common-test/1.3.0-SNAPSHOT/carbondata-spark-common-test-1.3.0-SNAPSHOT.pom
Not sending mail to unregistered user jacky.likun@huawei.com
Sending e-mails to: commits@carbondata.apache.org ravi.pesala@gmail.com tomanishgupta18@gmail.com
channel stopped
Not sending mail to unregistered user jacky.likun@huawei.com

Build failed in Jenkins: carbondata-master-spark-2.1 #1767

Posted by Apache Jenkins Server <je...@builds.apache.org>.
See <https://builds.apache.org/job/carbondata-master-spark-2.1/1767/display/redirect>

------------------------------------------
[...truncated 9.58 KB...]
Audit done.
[INFO] 
[INFO] --- scalastyle-maven-plugin:0.8.0:check (default) @ carbondata-parent ---
[WARNING] sourceDirectory is not specified or does not exist value=<https://builds.apache.org/job/carbondata-master-spark-2.1/ws/src/main/scala>
Saving to outputFile=<https://builds.apache.org/job/carbondata-master-spark-2.1/ws/target/scalastyle-output.xml>
Processed 0 file(s)
Found 0 errors
Found 0 warnings
Found 0 infos
Finished in 169 ms
[INFO] 
[INFO] --- jacoco-maven-plugin:0.7.9:report (default-report) @ carbondata-parent ---
[INFO] Skipping JaCoCo execution due to missing execution data file.
[INFO] 
[INFO] --- jacoco-maven-plugin:0.7.9:report-integration (default-report-integration) @ carbondata-parent ---
[INFO] Skipping JaCoCo execution due to missing execution data file.
[INFO] 
[INFO] --- jacoco-maven-plugin:0.7.9:check (default-check) @ carbondata-parent ---
[INFO] Skipping JaCoCo execution due to missing execution data <https://builds.apache.org/job/carbondata-master-spark-2.1/ws/target/jacoco.exec>
[INFO] 
[INFO] --- maven-install-plugin:2.5.2:install (default-install) @ carbondata-parent ---
[INFO] Installing <https://builds.apache.org/job/carbondata-master-spark-2.1/ws/pom.xml> to /home/jenkins/jenkins-slave/maven-repositories/0/org/apache/carbondata/carbondata-parent/1.3.0-SNAPSHOT/carbondata-parent-1.3.0-SNAPSHOT.pom
[INFO]                                                                         
[INFO] ------------------------------------------------------------------------
[INFO] Building Apache CarbonData :: Common 1.3.0-SNAPSHOT
[INFO] ------------------------------------------------------------------------
[INFO] 
[INFO] --- maven-clean-plugin:2.5:clean (default-clean) @ carbondata-common ---
[INFO] Deleting <https://builds.apache.org/job/carbondata-master-spark-2.1/ws/common/target>
[INFO] 
[INFO] --- jacoco-maven-plugin:0.7.9:prepare-agent (default-prepare-agent) @ carbondata-common ---
[INFO] argLine set to -javaagent:/home/jenkins/jenkins-slave/maven-repositories/0/org/jacoco/org.jacoco.agent/0.7.9/org.jacoco.agent-0.7.9-runtime.jar=destfile=<https://builds.apache.org/job/carbondata-master-spark-2.1/ws/common/target/jacoco.exec>
[INFO] 
[INFO] --- maven-remote-resources-plugin:1.5:process (default) @ carbondata-common ---
[INFO] 
[INFO] --- maven-resources-plugin:2.7:resources (default-resources) @ carbondata-common ---
[INFO] Using 'UTF-8' encoding to copy filtered resources.
[INFO] skip non existing resourceDirectory <https://builds.apache.org/job/carbondata-master-spark-2.1/ws/common/src/main/resources>
[INFO] Copying 3 resources
[INFO] 
[INFO] --- maven-compiler-plugin:3.2:compile (default-compile) @ carbondata-common ---
[INFO] Changes detected - recompiling the module!
[INFO] Compiling 10 source files to <https://builds.apache.org/job/carbondata-master-spark-2.1/ws/common/target/classes>
[INFO] 
[INFO] >>> findbugs-maven-plugin:3.0.4:check (analyze-compile) > :findbugs @ carbondata-common >>>
[INFO] 
[INFO] --- findbugs-maven-plugin:3.0.4:findbugs (findbugs) @ carbondata-common ---
[INFO] Fork Value is true
[INFO] Done FindBugs Analysis....
[INFO] 
[INFO] <<< findbugs-maven-plugin:3.0.4:check (analyze-compile) < :findbugs @ carbondata-common <<<
[INFO] 
[INFO] --- findbugs-maven-plugin:3.0.4:check (analyze-compile) @ carbondata-common ---
[INFO] BugInstance size is 0
[INFO] Error size is 0
[INFO] No errors/warnings found
[INFO] 
[INFO] --- maven-resources-plugin:2.7:testResources (default-testResources) @ carbondata-common ---
[INFO] Using 'UTF-8' encoding to copy filtered resources.
[INFO] skip non existing resourceDirectory <https://builds.apache.org/job/carbondata-master-spark-2.1/ws/common/src/test/resources>
[INFO] Copying 3 resources
[INFO] 
[INFO] --- maven-compiler-plugin:3.2:testCompile (default-testCompile) @ carbondata-common ---
[INFO] Changes detected - recompiling the module!
[INFO] Compiling 7 source files to <https://builds.apache.org/job/carbondata-master-spark-2.1/ws/common/target/test-classes>
[INFO] 
[INFO] --- maven-surefire-plugin:2.18.1:test (default-test) @ carbondata-common ---
[JENKINS] Recording test results
[INFO] 
[INFO] --- maven-jar-plugin:2.5:jar (default-jar) @ carbondata-common ---
[INFO] Building jar: <https://builds.apache.org/job/carbondata-master-spark-2.1/ws/common/target/carbondata-common-1.3.0-SNAPSHOT.jar>
[INFO] 
[INFO] --- maven-site-plugin:3.4:attach-descriptor (attach-descriptor) @ carbondata-common ---
[INFO] 
[INFO] --- jacoco-maven-plugin:0.7.9:prepare-agent-integration (default-prepare-agent-integration) @ carbondata-common ---
[INFO] argLine set to -javaagent:/home/jenkins/jenkins-slave/maven-repositories/0/org/jacoco/org.jacoco.agent/0.7.9/org.jacoco.agent-0.7.9-runtime.jar=destfile=<https://builds.apache.org/job/carbondata-master-spark-2.1/ws/common/target/jacoco-it.exec>
[INFO] 
[INFO] --- maven-checkstyle-plugin:2.17:check (default) @ carbondata-common ---
[INFO] Starting audit...
Audit done.
[INFO] 
[INFO] --- scalastyle-maven-plugin:0.8.0:check (default) @ carbondata-common ---
[WARNING] sourceDirectory is not specified or does not exist value=<https://builds.apache.org/job/carbondata-master-spark-2.1/ws/common/src/main/scala>
Saving to outputFile=<https://builds.apache.org/job/carbondata-master-spark-2.1/ws/common/target/scalastyle-output.xml>
Processed 0 file(s)
Found 0 errors
Found 0 warnings
Found 0 infos
Finished in 1 ms
[INFO] 
[INFO] --- jacoco-maven-plugin:0.7.9:report (default-report) @ carbondata-common ---
[INFO] Skipping JaCoCo execution due to missing execution data file.
[INFO] 
[INFO] --- jacoco-maven-plugin:0.7.9:report-integration (default-report-integration) @ carbondata-common ---
[INFO] Skipping JaCoCo execution due to missing execution data file.
[INFO] 
[INFO] --- jacoco-maven-plugin:0.7.9:check (default-check) @ carbondata-common ---
[INFO] Skipping JaCoCo execution due to missing execution data <https://builds.apache.org/job/carbondata-master-spark-2.1/ws/common/target/jacoco.exec>
[INFO] 
[INFO] --- maven-install-plugin:2.5.2:install (default-install) @ carbondata-common ---
[INFO] Installing <https://builds.apache.org/job/carbondata-master-spark-2.1/ws/common/target/carbondata-common-1.3.0-SNAPSHOT.jar> to /home/jenkins/jenkins-slave/maven-repositories/0/org/apache/carbondata/carbondata-common/1.3.0-SNAPSHOT/carbondata-common-1.3.0-SNAPSHOT.jar
[INFO] Installing <https://builds.apache.org/job/carbondata-master-spark-2.1/ws/common/pom.xml> to /home/jenkins/jenkins-slave/maven-repositories/0/org/apache/carbondata/carbondata-common/1.3.0-SNAPSHOT/carbondata-common-1.3.0-SNAPSHOT.pom
[INFO]                                                                         
[INFO] ------------------------------------------------------------------------
[INFO] Building Apache CarbonData :: Core 1.3.0-SNAPSHOT
[INFO] ------------------------------------------------------------------------
[INFO] Downloading: http://repo1.maven.org/maven2/org/apache/carbondata/carbondata-format/1.3.0-SNAPSHOT/maven-metadata.xml
[INFO] Downloading: http://repository.apache.org/snapshots/org/apache/carbondata/carbondata-format/1.3.0-SNAPSHOT/maven-metadata.xml
[INFO] Downloaded: http://repository.apache.org/snapshots/org/apache/carbondata/carbondata-format/1.3.0-SNAPSHOT/maven-metadata.xml (791 B at 1.8 KB/sec)
[INFO] 
[INFO] --- maven-clean-plugin:2.5:clean (default-clean) @ carbondata-core ---
[INFO] Deleting <https://builds.apache.org/job/carbondata-master-spark-2.1/ws/core/target>
[INFO] 
[INFO] --- jacoco-maven-plugin:0.7.9:prepare-agent (default-prepare-agent) @ carbondata-core ---
[INFO] argLine set to -javaagent:/home/jenkins/jenkins-slave/maven-repositories/0/org/jacoco/org.jacoco.agent/0.7.9/org.jacoco.agent-0.7.9-runtime.jar=destfile=<https://builds.apache.org/job/carbondata-master-spark-2.1/ws/core/target/jacoco.exec>
[INFO] 
[INFO] --- maven-remote-resources-plugin:1.5:process (default) @ carbondata-core ---
[INFO] 
[INFO] --- maven-resources-plugin:2.7:resources (default-resources) @ carbondata-core ---
[INFO] Using 'UTF-8' encoding to copy filtered resources.
[INFO] Copying 1 resource
[INFO] Copying 3 resources
[INFO] 
[INFO] --- maven-compiler-plugin:3.2:compile (default-compile) @ carbondata-core ---
[INFO] Changes detected - recompiling the module!
[INFO] Compiling 573 source files to <https://builds.apache.org/job/carbondata-master-spark-2.1/ws/core/target/classes>
[INFO] <https://builds.apache.org/job/carbondata-master-spark-2.1/ws/core/src/main/java/org/apache/carbondata/core/util/ByteUtil.java>: <https://builds.apache.org/job/carbondata-master-spark-2.1/ws/core/src/main/java/org/apache/carbondata/core/util/ByteUtil.java> uses or overrides a deprecated API.
[INFO] <https://builds.apache.org/job/carbondata-master-spark-2.1/ws/core/src/main/java/org/apache/carbondata/core/util/ByteUtil.java>: Recompile with -Xlint:deprecation for details.
[INFO] <https://builds.apache.org/job/carbondata-master-spark-2.1/ws/core/src/main/java/org/apache/carbondata/core/datamap/DataMapStoreManager.java>: Some input files use unchecked or unsafe operations.
[INFO] <https://builds.apache.org/job/carbondata-master-spark-2.1/ws/core/src/main/java/org/apache/carbondata/core/datamap/DataMapStoreManager.java>: Recompile with -Xlint:unchecked for details.
[INFO] -------------------------------------------------------------
[WARNING] COMPILATION WARNING : 
[INFO] -------------------------------------------------------------
[WARNING] <https://builds.apache.org/job/carbondata-master-spark-2.1/ws/core/src/main/java/org/apache/carbondata/core/memory/CarbonUnsafe.java>:[23,16] sun.misc.Unsafe is internal proprietary API and may be removed in a future release
[WARNING] <https://builds.apache.org/job/carbondata-master-spark-2.1/ws/core/src/main/java/org/apache/carbondata/core/memory/CarbonUnsafe.java>:[43,18] sun.misc.Unsafe is internal proprietary API and may be removed in a future release
[WARNING] <https://builds.apache.org/job/carbondata-master-spark-2.1/ws/core/src/main/java/org/apache/carbondata/core/memory/CarbonUnsafe.java>:[47,21] sun.misc.Unsafe is internal proprietary API and may be removed in a future release
[WARNING] <https://builds.apache.org/job/carbondata-master-spark-2.1/ws/core/src/main/java/org/apache/carbondata/core/memory/CarbonUnsafe.java>:[49,17] sun.misc.Unsafe is internal proprietary API and may be removed in a future release
[WARNING] <https://builds.apache.org/job/carbondata-master-spark-2.1/ws/core/src/main/java/org/apache/carbondata/core/memory/CarbonUnsafe.java>:[70,17] sun.misc.Unsafe is internal proprietary API and may be removed in a future release
[INFO] 5 warnings 
[INFO] -------------------------------------------------------------
[INFO] -------------------------------------------------------------
[ERROR] COMPILATION ERROR : 
[INFO] -------------------------------------------------------------
[ERROR] <https://builds.apache.org/job/carbondata-master-spark-2.1/ws/core/src/main/java/org/apache/carbondata/core/metadata/converter/ThriftWrapperSchemaConverterImpl.java>:[236,58] cannot find symbol
  symbol:   variable NATIVE_HIVE
  location: class org.apache.carbondata.format.PartitionType
[ERROR] <https://builds.apache.org/job/carbondata-master-spark-2.1/ws/core/src/main/java/org/apache/carbondata/core/metadata/converter/ThriftWrapperSchemaConverterImpl.java>:[238,58] cannot find symbol
  symbol:   variable NATIVE_HIVE
  location: class org.apache.carbondata.format.PartitionType
[ERROR] <https://builds.apache.org/job/carbondata-master-spark-2.1/ws/core/src/main/java/org/apache/carbondata/core/metadata/converter/ThriftWrapperSchemaConverterImpl.java>:[559,12] an enum switch case label must be the unqualified name of an enumeration constant
[INFO] 3 errors 
[INFO] -------------------------------------------------------------
[INFO] ------------------------------------------------------------------------
[INFO] Reactor Summary:
[INFO] 
[INFO] Apache CarbonData :: Parent ........................ SUCCESS [ 10.145 s]
[INFO] Apache CarbonData :: Common ........................ SUCCESS [ 16.456 s]
[INFO] Apache CarbonData :: Core .......................... FAILURE [ 12.439 s]
[INFO] Apache CarbonData :: Processing .................... SKIPPED
[INFO] Apache CarbonData :: Hadoop ........................ SKIPPED
[INFO] Apache CarbonData :: Spark Common .................. SKIPPED
[INFO] Apache CarbonData :: Streaming ..................... SKIPPED
[INFO] Apache CarbonData :: Spark2 ........................ SKIPPED
[INFO] Apache CarbonData :: Spark Common Test ............. SKIPPED
[INFO] Apache CarbonData :: Assembly ...................... SKIPPED
[INFO] Apache CarbonData :: Hive .......................... SKIPPED
[INFO] Apache CarbonData :: presto ........................ SKIPPED
[INFO] Apache CarbonData :: Spark2 Examples ............... SKIPPED
[INFO] ------------------------------------------------------------------------
[INFO] BUILD FAILURE
[INFO] ------------------------------------------------------------------------
[INFO] Total time: 54.794 s
[INFO] Finished at: 2017-12-19T07:32:06+00:00
[INFO] Final Memory: 89M/1811M
[INFO] ------------------------------------------------------------------------
[ERROR] Failed to execute goal org.apache.maven.plugins:maven-compiler-plugin:3.2:compile (default-compile) on project carbondata-core: Compilation failure: Compilation failure:
[ERROR] <https://builds.apache.org/job/carbondata-master-spark-2.1/ws/core/src/main/java/org/apache/carbondata/core/metadata/converter/ThriftWrapperSchemaConverterImpl.java>:[236,58] cannot find symbol
[ERROR] symbol:   variable NATIVE_HIVE
[ERROR] location: class org.apache.carbondata.format.PartitionType
[ERROR] <https://builds.apache.org/job/carbondata-master-spark-2.1/ws/core/src/main/java/org/apache/carbondata/core/metadata/converter/ThriftWrapperSchemaConverterImpl.java>:[238,58] cannot find symbol
[ERROR] symbol:   variable NATIVE_HIVE
[ERROR] location: class org.apache.carbondata.format.PartitionType
[ERROR] <https://builds.apache.org/job/carbondata-master-spark-2.1/ws/core/src/main/java/org/apache/carbondata/core/metadata/converter/ThriftWrapperSchemaConverterImpl.java>:[559,12] an enum switch case label must be the unqualified name of an enumeration constant
[ERROR] -> [Help 1]
org.apache.maven.lifecycle.LifecycleExecutionException: Failed to execute goal org.apache.maven.plugins:maven-compiler-plugin:3.2:compile (default-compile) on project carbondata-core: Compilation failure
	at org.apache.maven.lifecycle.internal.MojoExecutor.execute(MojoExecutor.java:212)
	at org.apache.maven.lifecycle.internal.MojoExecutor.execute(MojoExecutor.java:153)
	at org.apache.maven.lifecycle.internal.MojoExecutor.execute(MojoExecutor.java:145)
	at org.apache.maven.lifecycle.internal.LifecycleModuleBuilder.buildProject(LifecycleModuleBuilder.java:116)
	at org.apache.maven.lifecycle.internal.LifecycleModuleBuilder.buildProject(LifecycleModuleBuilder.java:80)
	at org.apache.maven.lifecycle.internal.builder.singlethreaded.SingleThreadedBuilder.build(SingleThreadedBuilder.java:51)
	at org.apache.maven.lifecycle.internal.LifecycleStarter.execute(LifecycleStarter.java:128)
	at org.apache.maven.DefaultMaven.doExecute(DefaultMaven.java:307)
	at org.apache.maven.DefaultMaven.doExecute(DefaultMaven.java:193)
	at org.apache.maven.DefaultMaven.execute(DefaultMaven.java:106)
	at org.jvnet.hudson.maven3.launcher.Maven33Launcher.main(Maven33Launcher.java:129)
	at sun.reflect.NativeMethodAccessorImpl.invoke0(Native Method)
	at sun.reflect.NativeMethodAccessorImpl.invoke(NativeMethodAccessorImpl.java:62)
	at sun.reflect.DelegatingMethodAccessorImpl.invoke(DelegatingMethodAccessorImpl.java:43)
	at java.lang.reflect.Method.invoke(Method.java:498)
	at org.codehaus.plexus.classworlds.launcher.Launcher.launchStandard(Launcher.java:330)
	at org.codehaus.plexus.classworlds.launcher.Launcher.launch(Launcher.java:238)
	at jenkins.maven3.agent.Maven33Main.launch(Maven33Main.java:176)
	at sun.reflect.NativeMethodAccessorImpl.invoke0(Native Method)
	at sun.reflect.NativeMethodAccessorImpl.invoke(NativeMethodAccessorImpl.java:62)
	at sun.reflect.DelegatingMethodAccessorImpl.invoke(DelegatingMethodAccessorImpl.java:43)
	at java.lang.reflect.Method.invoke(Method.java:498)
	at hudson.maven.Maven3Builder.call(Maven3Builder.java:139)
	at hudson.maven.Maven3Builder.call(Maven3Builder.java:70)
	at hudson.remoting.UserRequest.perform(UserRequest.java:181)
	at hudson.remoting.UserRequest.perform(UserRequest.java:52)
	at hudson.remoting.Request$2.run(Request.java:336)
	at hudson.remoting.InterceptingExecutorService$1.call(InterceptingExecutorService.java:68)
	at java.util.concurrent.FutureTask.run(FutureTask.java:266)
	at java.util.concurrent.ThreadPoolExecutor.runWorker(ThreadPoolExecutor.java:1149)
	at java.util.concurrent.ThreadPoolExecutor$Worker.run(ThreadPoolExecutor.java:624)
	at java.lang.Thread.run(Thread.java:748)
Caused by: org.apache.maven.plugin.compiler.CompilationFailureException: Compilation failure
	at org.apache.maven.plugin.compiler.AbstractCompilerMojo.execute(AbstractCompilerMojo.java:909)
	at org.apache.maven.plugin.compiler.CompilerMojo.execute(CompilerMojo.java:129)
	at org.apache.maven.plugin.DefaultBuildPluginManager.executeMojo(DefaultBuildPluginManager.java:134)
	at org.apache.maven.lifecycle.internal.MojoExecutor.execute(MojoExecutor.java:207)
	... 31 more
[ERROR] 
[ERROR] Re-run Maven using the -X switch to enable full debug logging.
[ERROR] 
[ERROR] For more information about the errors and possible solutions, please read the following articles:
[ERROR] [Help 1] http://cwiki.apache.org/confluence/display/MAVEN/MojoFailureException
[ERROR] 
[ERROR] After correcting the problems, you can resume the build with the command
[ERROR]   mvn <goals> -rf :carbondata-core
[JENKINS] Archiving <https://builds.apache.org/job/carbondata-master-spark-2.1/ws/processing/pom.xml> to org.apache.carbondata/carbondata-processing/1.3.0-SNAPSHOT/carbondata-processing-1.3.0-SNAPSHOT.pom
[JENKINS] Archiving <https://builds.apache.org/job/carbondata-master-spark-2.1/ws/streaming/pom.xml> to org.apache.carbondata/carbondata-streaming/1.3.0-SNAPSHOT/carbondata-streaming-1.3.0-SNAPSHOT.pom
[JENKINS] Archiving <https://builds.apache.org/job/carbondata-master-spark-2.1/ws/integration/spark-common/pom.xml> to org.apache.carbondata/carbondata-spark-common/1.3.0-SNAPSHOT/carbondata-spark-common-1.3.0-SNAPSHOT.pom
[JENKINS] Archiving <https://builds.apache.org/job/carbondata-master-spark-2.1/ws/integration/hive/pom.xml> to org.apache.carbondata/carbondata-hive/1.3.0-SNAPSHOT/carbondata-hive-1.3.0-SNAPSHOT.pom
[JENKINS] Archiving <https://builds.apache.org/job/carbondata-master-spark-2.1/ws/common/pom.xml> to org.apache.carbondata/carbondata-common/1.3.0-SNAPSHOT/carbondata-common-1.3.0-SNAPSHOT.pom
[JENKINS] Archiving <https://builds.apache.org/job/carbondata-master-spark-2.1/ws/common/target/carbondata-common-1.3.0-SNAPSHOT.jar> to org.apache.carbondata/carbondata-common/1.3.0-SNAPSHOT/carbondata-common-1.3.0-SNAPSHOT.jar
[JENKINS] Archiving <https://builds.apache.org/job/carbondata-master-spark-2.1/ws/examples/spark2/pom.xml> to org.apache.carbondata/carbondata-examples-spark2/1.3.0-SNAPSHOT/carbondata-examples-spark2-1.3.0-SNAPSHOT.pom
[JENKINS] Archiving <https://builds.apache.org/job/carbondata-master-spark-2.1/ws/integration/spark2/pom.xml> to org.apache.carbondata/carbondata-spark2/1.3.0-SNAPSHOT/carbondata-spark2-1.3.0-SNAPSHOT.pom
[JENKINS] Archiving <https://builds.apache.org/job/carbondata-master-spark-2.1/ws/assembly/pom.xml> to org.apache.carbondata/carbondata-assembly/1.3.0-SNAPSHOT/carbondata-assembly-1.3.0-SNAPSHOT.pom
[JENKINS] Archiving <https://builds.apache.org/job/carbondata-master-spark-2.1/ws/pom.xml> to org.apache.carbondata/carbondata-parent/1.3.0-SNAPSHOT/carbondata-parent-1.3.0-SNAPSHOT.pom
[JENKINS] Archiving <https://builds.apache.org/job/carbondata-master-spark-2.1/ws/core/pom.xml> to org.apache.carbondata/carbondata-core/1.3.0-SNAPSHOT/carbondata-core-1.3.0-SNAPSHOT.pom
[JENKINS] Archiving <https://builds.apache.org/job/carbondata-master-spark-2.1/ws/hadoop/pom.xml> to org.apache.carbondata/carbondata-hadoop/1.3.0-SNAPSHOT/carbondata-hadoop-1.3.0-SNAPSHOT.pom
[JENKINS] Archiving <https://builds.apache.org/job/carbondata-master-spark-2.1/ws/integration/presto/pom.xml> to org.apache.carbondata/carbondata-presto/1.3.0-SNAPSHOT/carbondata-presto-1.3.0-SNAPSHOT.pom
[JENKINS] Archiving <https://builds.apache.org/job/carbondata-master-spark-2.1/ws/integration/spark-common-test/pom.xml> to org.apache.carbondata/carbondata-spark-common-test/1.3.0-SNAPSHOT/carbondata-spark-common-test-1.3.0-SNAPSHOT.pom
Not sending mail to unregistered user jacky.likun@huawei.com
Sending e-mails to: commits@carbondata.apache.org ravi.pesala@gmail.com
channel stopped
Not sending mail to unregistered user jacky.likun@huawei.com