You are viewing a plain text version of this content. The canonical link for it is here.
Posted to ci@bigtop.apache.org by Apache Jenkins Server <je...@builds.apache.org> on 2016/02/18 09:44:37 UTC

Build failed in Jenkins: Bigtop-trunk-iTest #2491

See <https://builds.apache.org/job/Bigtop-trunk-iTest/2491/changes>

Changes:

[cos] BIGTOP-2296. Provide a way to build Docker container with functional

------------------------------------------
[...truncated 64 lines...]
NODE_LABELS=Ubuntu legacy-ubuntu ubuntu ubuntu3
LOGNAME=jenkins
SSH_CONNECTION=140.211.11.14 57124 140.211.11.27 22
HUDSON_HOME=/x1/jenkins/jenkins-home
NODE_NAME=ubuntu3
BUILD_NUMBER=2491
HUDSON_COOKIE=b08da50d-0166-451f-905b-dd8ed267ed3d
GIT_AUTHOR_EMAIL=builds@apache.org
_=/usr/bin/env
Parsing POMs
Established TCP socket on 47427
maven3-agent.jar already up to date
maven3-interceptor.jar already up to date
maven3-interceptor-commons.jar already up to date
[bigtop-test-framework] $ /home/jenkins/tools/java/latest1.6/bin/java -Xmx2g -Xms256m -XX:MaxPermSize=512m -cp /home/jenkins/jenkins-slave/maven3-agent.jar:/home/jenkins/tools/maven/apache-maven-3.0.4/boot/plexus-classworlds-2.4.jar org.jvnet.hudson.maven3.agent.Maven3Main /home/jenkins/tools/maven/apache-maven-3.0.4 /x1/jenkins/jenkins-slave/slave.jar /home/jenkins/jenkins-slave/maven3-interceptor.jar /home/jenkins/jenkins-slave/maven3-interceptor-commons.jar 47427
<===[JENKINS REMOTING CAPACITY]===>   channel started
Executing Maven:  -B -f <https://builds.apache.org/job/Bigtop-trunk-iTest/ws/bigtop-test-framework/pom.xml> -Dmaven.repo.local=/home/jenkins/jenkins-slave/maven-repositories/1 clean deploy -DskipITs
[INFO] Scanning for projects...
Downloading: http://repository.codehaus.org/org/codehaus/groovy/groovy-eclipse-batch/maven-metadata.xml
Downloading: http://nexus.codehaus.org/snapshots/org/codehaus/groovy/groovy-eclipse-batch/maven-metadata.xml
[WARNING] Could not transfer metadata org.codehaus.groovy:groovy-eclipse-batch/maven-metadata.xml from/to codehaus.org (http://repository.codehaus.org): repository.codehaus.org
[WARNING] Could not transfer metadata org.codehaus.groovy:groovy-eclipse-batch/maven-metadata.xml from/to codehaus-snapshots (http://nexus.codehaus.org/snapshots/): nexus.codehaus.org
Downloading: http://repository.codehaus.org/org/codehaus/groovy/groovy-eclipse-batch/2.1.8-01-SNAPSHOT/maven-metadata.xml
Downloading: http://nexus.codehaus.org/snapshots/org/codehaus/groovy/groovy-eclipse-batch/2.1.8-01-SNAPSHOT/maven-metadata.xml
[WARNING] Could not transfer metadata org.codehaus.groovy:groovy-eclipse-batch:2.1.8-01-SNAPSHOT/maven-metadata.xml from/to codehaus.org (http://repository.codehaus.org): repository.codehaus.org
[WARNING] Could not transfer metadata org.codehaus.groovy:groovy-eclipse-batch:2.1.8-01-SNAPSHOT/maven-metadata.xml from/to codehaus-snapshots (http://nexus.codehaus.org/snapshots/): nexus.codehaus.org
Downloading: http://repository.codehaus.org/org/codehaus/groovy/groovy-eclipse-batch/2.2.1-01-SNAPSHOT/maven-metadata.xml
Downloading: http://nexus.codehaus.org/snapshots/org/codehaus/groovy/groovy-eclipse-batch/2.2.1-01-SNAPSHOT/maven-metadata.xml
[WARNING] Could not transfer metadata org.codehaus.groovy:groovy-eclipse-batch:2.2.1-01-SNAPSHOT/maven-metadata.xml from/to codehaus.org (http://repository.codehaus.org): repository.codehaus.org
[WARNING] Could not transfer metadata org.codehaus.groovy:groovy-eclipse-batch:2.2.1-01-SNAPSHOT/maven-metadata.xml from/to codehaus-snapshots (http://nexus.codehaus.org/snapshots/): nexus.codehaus.org
Downloading: http://repository.codehaus.org/org/codehaus/groovy/groovy-eclipse-batch/2.3.0-01-SNAPSHOT/maven-metadata.xml
Downloading: http://nexus.codehaus.org/snapshots/org/codehaus/groovy/groovy-eclipse-batch/2.3.0-01-SNAPSHOT/maven-metadata.xml
[WARNING] Could not transfer metadata org.codehaus.groovy:groovy-eclipse-batch:2.3.0-01-SNAPSHOT/maven-metadata.xml from/to codehaus.org (http://repository.codehaus.org): repository.codehaus.org
[WARNING] Could not transfer metadata org.codehaus.groovy:groovy-eclipse-batch:2.3.0-01-SNAPSHOT/maven-metadata.xml from/to codehaus-snapshots (http://nexus.codehaus.org/snapshots/): nexus.codehaus.org
Downloading: http://nexus.codehaus.org/snapshots/org/codehaus/groovy/groovy-eclipse-batch/2.3.1-01-SNAPSHOT/maven-metadata.xml
Downloading: http://repository.codehaus.org/org/codehaus/groovy/groovy-eclipse-batch/2.3.1-01-SNAPSHOT/maven-metadata.xml
[WARNING] Could not transfer metadata org.codehaus.groovy:groovy-eclipse-batch:2.3.1-01-SNAPSHOT/maven-metadata.xml from/to codehaus.org (http://repository.codehaus.org): repository.codehaus.org
[WARNING] Could not transfer metadata org.codehaus.groovy:groovy-eclipse-batch:2.3.1-01-SNAPSHOT/maven-metadata.xml from/to codehaus-snapshots (http://nexus.codehaus.org/snapshots/): nexus.codehaus.org
Downloading: http://repository.codehaus.org/org/codehaus/groovy/groovy-eclipse-batch/2.3.2-01-SNAPSHOT/maven-metadata.xml
Downloading: http://nexus.codehaus.org/snapshots/org/codehaus/groovy/groovy-eclipse-batch/2.3.2-01-SNAPSHOT/maven-metadata.xml
[WARNING] Could not transfer metadata org.codehaus.groovy:groovy-eclipse-batch:2.3.2-01-SNAPSHOT/maven-metadata.xml from/to codehaus.org (http://repository.codehaus.org): repository.codehaus.org
[WARNING] Could not transfer metadata org.codehaus.groovy:groovy-eclipse-batch:2.3.2-01-SNAPSHOT/maven-metadata.xml from/to codehaus-snapshots (http://nexus.codehaus.org/snapshots/): nexus.codehaus.org
Downloading: http://repository.codehaus.org/org/codehaus/groovy/groovy-eclipse-batch/2.3.3-01-SNAPSHOT/maven-metadata.xml
Downloading: http://nexus.codehaus.org/snapshots/org/codehaus/groovy/groovy-eclipse-batch/2.3.3-01-SNAPSHOT/maven-metadata.xml
[WARNING] Could not transfer metadata org.codehaus.groovy:groovy-eclipse-batch:2.3.3-01-SNAPSHOT/maven-metadata.xml from/to codehaus.org (http://repository.codehaus.org): repository.codehaus.org
[WARNING] Could not transfer metadata org.codehaus.groovy:groovy-eclipse-batch:2.3.3-01-SNAPSHOT/maven-metadata.xml from/to codehaus-snapshots (http://nexus.codehaus.org/snapshots/): nexus.codehaus.org
Downloading: http://repository.codehaus.org/org/codehaus/groovy/groovy-eclipse-batch/2.3.4-01-SNAPSHOT/maven-metadata.xml
Downloading: http://nexus.codehaus.org/snapshots/org/codehaus/groovy/groovy-eclipse-batch/2.3.4-01-SNAPSHOT/maven-metadata.xml
[WARNING] Could not transfer metadata org.codehaus.groovy:groovy-eclipse-batch:2.3.4-01-SNAPSHOT/maven-metadata.xml from/to codehaus.org (http://repository.codehaus.org): repository.codehaus.org
[WARNING] Could not transfer metadata org.codehaus.groovy:groovy-eclipse-batch:2.3.4-01-SNAPSHOT/maven-metadata.xml from/to codehaus-snapshots (http://nexus.codehaus.org/snapshots/): nexus.codehaus.org
[INFO]                                                                         
[INFO] ------------------------------------------------------------------------
[INFO] Building iTest: system and integration testing in the cloud 1.2.0-SNAPSHOT
[INFO] ------------------------------------------------------------------------
[INFO] 
[INFO] --- maven-clean-plugin:2.4.1:clean (default-clean) @ itest-common ---
[INFO] Deleting <https://builds.apache.org/job/Bigtop-trunk-iTest/ws/bigtop-test-framework/target>
[INFO] 
[INFO] --- groovy-eclipse-compiler:2.8.0-01:add-groovy-build-paths (default-add-groovy-build-paths) @ itest-common ---
[WARNING] Failure to transfer org.codehaus.groovy:groovy-eclipse-batch/maven-metadata.xml from http://repository.codehaus.org was cached in the local repository, resolution will not be reattempted until the update interval of codehaus.org has elapsed or updates are forced. Original error: Could not transfer metadata org.codehaus.groovy:groovy-eclipse-batch/maven-metadata.xml from/to codehaus.org (http://repository.codehaus.org): repository.codehaus.org
[WARNING] Failure to transfer org.codehaus.groovy:groovy-eclipse-batch/maven-metadata.xml from http://nexus.codehaus.org/snapshots/ was cached in the local repository, resolution will not be reattempted until the update interval of codehaus-snapshots has elapsed or updates are forced. Original error: Could not transfer metadata org.codehaus.groovy:groovy-eclipse-batch/maven-metadata.xml from/to codehaus-snapshots (http://nexus.codehaus.org/snapshots/): nexus.codehaus.org
[INFO] Adding /src/main/groovy to the list of source folders
[INFO] Adding /src/test/groovy to the list of test source folders
[INFO] 
[INFO] --- maven-remote-resources-plugin:1.1:process (default) @ itest-common ---
[INFO] Setting property: classpath.resource.loader.class => 'org.codehaus.plexus.velocity.ContextClassLoaderResourceLoader'.
[INFO] Setting property: velocimacro.messages.on => 'false'.
[INFO] Setting property: resource.loader => 'classpath'.
[INFO] Setting property: resource.manager.logwhenfound => 'false'.
[INFO] 
[INFO] --- maven-resources-plugin:2.4:resources (default-resources) @ itest-common ---
[INFO] Using 'UTF-8' encoding to copy filtered resources.
[INFO] skip non existing resourceDirectory <https://builds.apache.org/job/Bigtop-trunk-iTest/ws/bigtop-test-framework/src/main/resources>
[INFO] Copying 3 resources
[INFO] 
[INFO] --- maven-compiler-plugin:3.1:compile (default-compile) @ itest-common ---
[INFO] Changes detected - recompiling the module!
[INFO] Using Groovy-Eclipse compiler to compile both Java and Groovy files
[INFO] 
[INFO] --- maven-resources-plugin:2.4:testResources (default-testResources) @ itest-common ---
[INFO] Using 'UTF-8' encoding to copy filtered resources.
[INFO] skip non existing resourceDirectory <https://builds.apache.org/job/Bigtop-trunk-iTest/ws/bigtop-test-framework/src/test/resources>
[INFO] Copying 3 resources
[INFO] 
[INFO] --- maven-compiler-plugin:3.1:testCompile (default-testCompile) @ itest-common ---
[INFO] Changes detected - recompiling the module!
[INFO] Using Groovy-Eclipse compiler to compile both Java and Groovy files
[INFO] 
[INFO] --- maven-surefire-plugin:2.7:test (default-test) @ itest-common ---
[INFO] Surefire report directory: <https://builds.apache.org/job/Bigtop-trunk-iTest/ws/bigtop-test-framework/target/surefire-reports>

-------------------------------------------------------
 T E S T S
-------------------------------------------------------
Running org.apache.bigtop.itest.TestContractJavaProc
Tests run: 2, Failures: 0, Errors: 0, Skipped: 0, Time elapsed: 0.061 sec
Running org.apache.bigtop.itest.pmanager.PackageManagerTest
/etc/cron.weekly/.placeholder
/etc/init/cron.conf
/etc/cron.hourly/.placeholder
/etc/cron.monthly/.placeholder
/etc/default/cron
/etc/pam.d/cron
/etc/cron.daily/.placeholder
/etc/cron.daily/standard
/etc/cron.d/.placeholder
/etc/crontab
/.
/var
/var/spool
/var/spool/cron
/var/spool/cron/crontabs
/usr
/usr/sbin
/usr/sbin/cron
/usr/bin
/usr/bin/crontab
/usr/share
/usr/share/bug
/usr/share/bug/cron
/usr/share/bug/cron/control
/usr/share/bug/cron/script
/usr/share/doc
/usr/share/doc/cron
/usr/share/doc/cron/README
/usr/share/doc/cron/THANKS
/usr/share/doc/cron/TODO.Debian
/usr/share/doc/cron/changelog.Debian.gz
/usr/share/doc/cron/README.Debian
/usr/share/doc/cron/copyright
/usr/share/doc/cron/README.anacron
/usr/share/doc/cron/examples
/usr/share/doc/cron/examples/cron-stats.pl
/usr/share/doc/cron/examples/crontab2english.pl
/usr/share/doc/cron/examples/cron-tasks-review.sh
/usr/share/doc/cron/NEWS.Debian.gz
/usr/share/doc/cron/FEATURES
/usr/share/man
/usr/share/man/man1
/usr/share/man/man1/crontab.1.gz
/usr/share/man/man5
/usr/share/man/man5/crontab.5.gz
/usr/share/man/man8
/usr/share/man/man8/cron.8.gz
/etc
/etc/cron.weekly
/etc/cron.weekly/.placeholder
/etc/init.d
/etc/init
/etc/init/cron.conf
/etc/cron.hourly
/etc/cron.hourly/.placeholder
/etc/cron.monthly
/etc/cron.monthly/.placeholder
/etc/default
/etc/default/cron
/etc/pam.d
/etc/pam.d/cron
/etc/cron.daily
/etc/cron.daily/.placeholder
/etc/cron.daily/standard
/etc/cron.d
/etc/cron.d/.placeholder
/etc/crontab
/etc/init.d/cron
Tests run: 11, Failures: 0, Errors: 0, Skipped: 0, Time elapsed: 3.882 sec
Running org.apache.bigtop.itest.JarContentTest
log4j:WARN No appenders could be found for logger (org.apache.bigtop.itest.JarContent).
log4j:WARN Please initialize the log4j system properly.
Tests run: 6, Failures: 0, Errors: 0, Skipped: 0, Time elapsed: 1.242 sec
Running org.apache.bigtop.itest.JUnitUtilsTest
Disclaimer: This test expected to show a failure in an embeded testcase
    [junit] Running org.apache.bigtop.itest.DummyTestPassTests run: 1, Failures: 0, Errors: 0, Time elapsed: 0.255 secRunning org.apache.bigtop.itest.DummyTestFailTests run: 1, Failures: 1, Errors: 0, Time elapsed: 0.136 sec
    [junit] TEST org.apache.bigtop.itest.DummyTestFail FAILED
    [junit] Tests FAILED
Disclaimer: This test expected to show an error in an embeded testcase
    [junit] Running org.apache.bigtop.itest.DummyTestError
    [junit] Tests run: 1, Failures: 0, Errors: 1, Time elapsed: 0.272 sec
    [junit] Test org.apache.bigtop.itest.DummyTestError FAILED
    [junit] Running org.apache.bigtop.itest.DummyTestPassTests run: 1, Failures: 0, Errors: 0, Time elapsed: 0.252 sec
    [junit] Running org.apache.bigtop.itest.DummyTestPass
    [junit] Tests run: 1, Failures: 0, Errors: 0, Time elapsed: 0.285 sec
Tests run: 4, Failures: 0, Errors: 0, Skipped: 0, Time elapsed: 4.759 sec
Running org.apache.bigtop.itest.TestContractGroovy
Tests run: 2, Failures: 0, Errors: 0, Skipped: 0, Time elapsed: 0.02 sec
Running org.apache.bigtop.itest.posix.AlternativeTest
Tests run: 1, Failures: 0, Errors: 0, Skipped: 0, Time elapsed: 1.582 sec
Running org.apache.bigtop.itest.posix.UGITest
Tests run: 2, Failures: 0, Errors: 0, Skipped: 0, Time elapsed: 0.056 sec
Running org.apache.bigtop.itest.posix.ServiceTest
Status []
Tests run: 2, Failures: 0, Errors: 0, Skipped: 1, Time elapsed: 0.081 sec
Running org.apache.bigtop.itest.TestContractJava
Tests run: 2, Failures: 0, Errors: 0, Skipped: 0, Time elapsed: 0.002 sec
Running org.apache.bigtop.itest.shell.ShellTest
Tests run: 2, Failures: 0, Errors: 0, Skipped: 0, Time elapsed: 0.022 sec
Running org.apache.bigtop.itest.junit.OrderedParameterizedTest
Tests run: 3, Failures: 0, Errors: 0, Skipped: 0, Time elapsed: 0.042 sec
Running org.apache.bigtop.itest.junit.OrderedTest
Tests run: 3, Failures: 0, Errors: 0, Skipped: 0, Time elapsed: 0.008 sec
Running org.apache.bigtop.itest.TestListUtilsTest
Tests run: 1, Failures: 0, Errors: 0, Skipped: 0, Time elapsed: 0.021 sec

Results :

Tests run: 41, Failures: 0, Errors: 0, Skipped: 1

[JENKINS] Recording test results
log4j:WARN No appenders could be found for logger (org.apache.commons.beanutils.converters.BooleanConverter).
log4j:WARN Please initialize the log4j system properly.
[INFO] 
[INFO] --- maven-jar-plugin:2.2:jar (default-jar) @ itest-common ---
[INFO] Building jar: <https://builds.apache.org/job/Bigtop-trunk-iTest/ws/bigtop-test-framework/target/itest-common-1.2.0-SNAPSHOT.jar>
[INFO] 
[INFO] --- maven-jar-plugin:2.2:test-jar (default) @ itest-common ---
[INFO] Building jar: <https://builds.apache.org/job/Bigtop-trunk-iTest/ws/bigtop-test-framework/target/itest-common-1.2.0-SNAPSHOT-tests.jar>
[INFO] 
[INFO] --- maven-failsafe-plugin:2.17:verify (default) @ itest-common ---
[INFO] Tests are skipped.
[JENKINS] Recording test results
[INFO] 
[INFO] --- maven-install-plugin:2.3:install (default-install) @ itest-common ---
[INFO] Installing <https://builds.apache.org/job/Bigtop-trunk-iTest/ws/bigtop-test-framework/target/itest-common-1.2.0-SNAPSHOT.jar> to /home/jenkins/jenkins-slave/maven-repositories/1/org/apache/bigtop/itest/itest-common/1.2.0-SNAPSHOT/itest-common-1.2.0-SNAPSHOT.jar
[INFO] Installing <https://builds.apache.org/job/Bigtop-trunk-iTest/ws/bigtop-test-framework/pom.xml> to /home/jenkins/jenkins-slave/maven-repositories/1/org/apache/bigtop/itest/itest-common/1.2.0-SNAPSHOT/itest-common-1.2.0-SNAPSHOT.pom
[INFO] Installing <https://builds.apache.org/job/Bigtop-trunk-iTest/ws/bigtop-test-framework/target/itest-common-1.2.0-SNAPSHOT-tests.jar> to /home/jenkins/jenkins-slave/maven-repositories/1/org/apache/bigtop/itest/itest-common/1.2.0-SNAPSHOT/itest-common-1.2.0-SNAPSHOT-tests.jar
[INFO] 
[INFO] --- maven-deploy-plugin:2.5:deploy (default-deploy) @ itest-common ---
Downloading: https://repository.apache.org/content/repositories/snapshots/org/apache/bigtop/itest/itest-common/1.2.0-SNAPSHOT/maven-metadata.xml
[WARNING] Could not transfer metadata org.apache.bigtop.itest:itest-common:1.2.0-SNAPSHOT/maven-metadata.xml from/to apache.snapshots.https (https://repository.apache.org/content/repositories/snapshots): java.lang.RuntimeException: Could not generate DH keypair
[INFO] ------------------------------------------------------------------------
[INFO] BUILD FAILURE
[INFO] ------------------------------------------------------------------------
[INFO] Total time: 30.053s
[INFO] Finished at: Thu Feb 18 08:44:41 UTC 2016
[INFO] Final Memory: 22M/246M
[INFO] ------------------------------------------------------------------------
Waiting for Jenkins to finish collecting data
[ERROR] Failed to execute goal org.apache.maven.plugins:maven-deploy-plugin:2.5:deploy (default-deploy) on project itest-common: Failed to retrieve remote metadata org.apache.bigtop.itest:itest-common:1.2.0-SNAPSHOT/maven-metadata.xml: Could not transfer metadata org.apache.bigtop.itest:itest-common:1.2.0-SNAPSHOT/maven-metadata.xml from/to apache.snapshots.https (https://repository.apache.org/content/repositories/snapshots): java.lang.RuntimeException: Could not generate DH keypair: Prime size must be multiple of 64, and can only range from 512 to 1024 (inclusive) -> [Help 1]
[ERROR] 
[ERROR] To see the full stack trace of the errors, re-run Maven with the -e switch.
[ERROR] Re-run Maven using the -X switch to enable full debug logging.
[ERROR] 
[ERROR] For more information about the errors and possible solutions, please read the following articles:
[ERROR] [Help 1] http://cwiki.apache.org/confluence/display/MAVEN/MojoExecutionException
[JENKINS] Archiving <https://builds.apache.org/job/Bigtop-trunk-iTest/ws/bigtop-test-framework/pom.xml> to org.apache.bigtop.itest/itest-common/1.2.0-SNAPSHOT/itest-common-1.2.0-SNAPSHOT.pom
[JENKINS] Archiving <https://builds.apache.org/job/Bigtop-trunk-iTest/ws/bigtop-test-framework/target/itest-common-1.2.0-SNAPSHOT.jar> to org.apache.bigtop.itest/itest-common/1.2.0-SNAPSHOT/itest-common-1.2.0-SNAPSHOT.jar
[JENKINS] Archiving <https://builds.apache.org/job/Bigtop-trunk-iTest/ws/bigtop-test-framework/target/itest-common-1.2.0-SNAPSHOT-tests.jar> to org.apache.bigtop.itest/itest-common/1.2.0-SNAPSHOT/itest-common-1.2.0-SNAPSHOT-tests.jar
Sending e-mails to: ci@bigtop.apache.org
channel stopped

Jenkins build is back to normal : Bigtop-trunk-iTest #2496

Posted by Apache Jenkins Server <je...@builds.apache.org>.
See <https://builds.apache.org/job/Bigtop-trunk-iTest/2496/changes>


Build failed in Jenkins: Bigtop-trunk-iTest #2495

Posted by Apache Jenkins Server <je...@builds.apache.org>.
See <https://builds.apache.org/job/Bigtop-trunk-iTest/2495/changes>

Changes:

[of] BIGTOP-2344: distributions does not mention ppc64el, i386 obsolete

------------------------------------------
Started by an SCM change
[EnvInject] - Loading node environment variables.
Building remotely on ubuntu-us1 (Ubuntu ubuntu ubuntu-us) in workspace /home/jenkins/jenkins-slave/workspace/Bigtop-trunk-iTest
Cloning the remote Git repository
Cloning repository https://git-wip-us.apache.org/repos/asf/bigtop.git
 > git init /home/jenkins/jenkins-slave/workspace/Bigtop-trunk-iTest # timeout=10
Fetching upstream changes from https://git-wip-us.apache.org/repos/asf/bigtop.git
 > git --version # timeout=10
 > git -c core.askpass=true fetch --tags --progress https://git-wip-us.apache.org/repos/asf/bigtop.git +refs/heads/*:refs/remotes/origin/*
 > git config remote.origin.url https://git-wip-us.apache.org/repos/asf/bigtop.git # timeout=10
 > git config --add remote.origin.fetch +refs/heads/*:refs/remotes/origin/* # timeout=10
 > git config remote.origin.url https://git-wip-us.apache.org/repos/asf/bigtop.git # timeout=10
Fetching upstream changes from https://git-wip-us.apache.org/repos/asf/bigtop.git
 > git -c core.askpass=true fetch --tags --progress https://git-wip-us.apache.org/repos/asf/bigtop.git +refs/heads/*:refs/remotes/origin/*
 > git rev-parse origin/master^{commit} # timeout=10
Checking out Revision 3ff441726bc16d752a7532f06ca4e8293a9131af (origin/master)
 > git config core.sparsecheckout # timeout=10
 > git checkout -f 3ff441726bc16d752a7532f06ca4e8293a9131af
 > git rev-list 6a477395805aa5003cae6fda16a4d2284d965b9d # timeout=10
[Bigtop-trunk-iTest] $ /bin/bash -xe /tmp/hudson8348175258720723301.sh
+ export JAVA_HOME=/home/hudson/tools/java/latest
+ JAVA_HOME=/home/hudson/tools/java/latest
+ export PATH=/home/hudson/tools/java/latest/bin:/home/jenkins/tools/maven/apache-maven-3.0.4/bin:/home/jenkins/tools/java/latest1.6/bin:/usr/local/sbin:/usr/local/bin:/usr/sbin:/usr/bin:/sbin:/bin:/usr/games:/usr/local/games
+ PATH=/home/hudson/tools/java/latest/bin:/home/jenkins/tools/maven/apache-maven-3.0.4/bin:/home/jenkins/tools/java/latest1.6/bin:/usr/local/sbin:/usr/local/bin:/usr/sbin:/usr/bin:/sbin:/bin:/usr/games:/usr/local/games
+ env
BUILD_URL=https://builds.apache.org/job/Bigtop-trunk-iTest/2495/
XDG_SESSION_ID=42
POM_GROUPID=org.apache.bigtop.itest
HUDSON_SERVER_COOKIE=f4ebd1e6b0d976e8
SHELL=/bin/bash
SSH_CLIENT=140.211.11.14 59492 22
BUILD_TAG=jenkins-Bigtop-trunk-iTest-2495
POM_DISPLAYNAME=iTest: system and integration testing in the cloud
GIT_PREVIOUS_COMMIT=6a477395805aa5003cae6fda16a4d2284d965b9d
ROOT_BUILD_CAUSE=SCMTRIGGER
WORKSPACE=/home/jenkins/jenkins-slave/workspace/Bigtop-trunk-iTest
JOB_URL=https://builds.apache.org/job/Bigtop-trunk-iTest/
USER=jenkins
POM_ARTIFACTID=itest-common
GIT_AUTHOR_NAME=jenkins
GIT_COMMITTER_NAME=jenkins
MAVEN_OPTS=-Xmx2g -Xms256m -XX:MaxPermSize=512m
NLSPATH=/usr/dt/lib/nls/msg/%L/%N.cat
GIT_COMMIT=3ff441726bc16d752a7532f06ca4e8293a9131af
JENKINS_HOME=/x1/jenkins/jenkins-home
ROOT_BUILD_CAUSE_SCMTRIGGER=true
MAVEN_HOME=/home/jenkins/tools/maven/apache-maven-3.0.4
PATH=/home/hudson/tools/java/latest/bin:/home/jenkins/tools/maven/apache-maven-3.0.4/bin:/home/jenkins/tools/java/latest1.6/bin:/usr/local/sbin:/usr/local/bin:/usr/sbin:/usr/bin:/sbin:/bin:/usr/games:/usr/local/games
MAIL=/var/mail/jenkins
BUILD_CAUSE_SCMTRIGGER=true
GIT_COMMITTER_EMAIL=builds@apache.org
PWD=/home/jenkins/jenkins-slave/workspace/Bigtop-trunk-iTest
JAVA_HOME=/home/hudson/tools/java/latest
HUDSON_URL=https://builds.apache.org/
LANG=en_US.UTF-8
JOB_NAME=Bigtop-trunk-iTest
POM_VERSION=1.2.0-SNAPSHOT
BUILD_DISPLAY_NAME=#2495
XFILESEARCHPATH=/usr/dt/app-defaults/%L/Dt
BUILD_CAUSE=SCMTRIGGER
BUILD_ID=2495
JENKINS_URL=https://builds.apache.org/
GIT_PREVIOUS_SUCCESSFUL_COMMIT=73d4e98d29f9591b7cd3bebf1c9d07e7c06f5af5
POM_PACKAGING=jar
HOME=/home/jenkins
SHLVL=2
M2_HOME=/home/jenkins/tools/maven/apache-maven-3.0.4
LANGUAGE=en_US:
GIT_BRANCH=origin/master
JENKINS_SERVER_COOKIE=f4ebd1e6b0d976e8
EXECUTOR_NUMBER=1
GIT_URL=https://git-wip-us.apache.org/repos/asf/bigtop.git
NODE_LABELS=Ubuntu ubuntu ubuntu-us ubuntu-us1
LOGNAME=jenkins
SSH_CONNECTION=140.211.11.14 59492 10.10.3.184 22
HUDSON_HOME=/x1/jenkins/jenkins-home
NODE_NAME=ubuntu-us1
BUILD_NUMBER=2495
XDG_RUNTIME_DIR=/run/user/9997
HUDSON_COOKIE=efb3765c-453c-4711-a927-496318174a8e
GIT_AUTHOR_EMAIL=builds@apache.org
_=/usr/bin/env
Parsing POMs
ERROR: Processing failed due to a bug in the code. Please report this to jenkinsci-users@googlegroups.com
hudson.remoting.RequestAbortedException: java.io.IOException: Unexpected EOF
	at hudson.remoting.Request.abort(Request.java:297)
	at hudson.remoting.Channel.terminate(Channel.java:844)
	at hudson.remoting.SynchronousCommandTransport$ReaderThread.run(SynchronousCommandTransport.java:69)
	at ......remote call to ubuntu-us1(Native Method)
	at hudson.remoting.Channel.attachCallSiteStackTrace(Channel.java:1413)
	at hudson.remoting.Request.call(Request.java:172)
	at hudson.remoting.Channel.call(Channel.java:777)
	at hudson.FilePath.act(FilePath.java:978)
	at hudson.FilePath.act(FilePath.java:967)
	at hudson.maven.MavenModuleSetBuild$MavenModuleSetBuildExecution.parsePoms(MavenModuleSetBuild.java:960)
	at hudson.maven.MavenModuleSetBuild$MavenModuleSetBuildExecution.doRun(MavenModuleSetBuild.java:679)
	at hudson.model.AbstractBuild$AbstractBuildExecution.run(AbstractBuild.java:536)
	at hudson.model.Run.execute(Run.java:1738)
	at hudson.maven.MavenModuleSetBuild.run(MavenModuleSetBuild.java:531)
	at hudson.model.ResourceController.execute(ResourceController.java:98)
	at hudson.model.Executor.run(Executor.java:381)
Caused by: java.io.IOException: Unexpected EOF
	at hudson.remoting.ChunkedInputStream.readUntilBreak(ChunkedInputStream.java:99)
	at hudson.remoting.ChunkedCommandTransport.readBlock(ChunkedCommandTransport.java:39)
	at hudson.remoting.AbstractSynchronousByteArrayCommandTransport.read(AbstractSynchronousByteArrayCommandTransport.java:34)
	at hudson.remoting.SynchronousCommandTransport$ReaderThread.run(SynchronousCommandTransport.java:48)
project=hudson.maven.MavenModuleSet@38386523[Bigtop-trunk-iTest]
project.getModules()=[hudson.maven.MavenModule@3034973e[Bigtop-trunk-iTest/org.apache.bigtop.itest:itest-common][Bigtop-trunk-iTest/org.apache.bigtop.itest:itest-common][relativePath:bigtop-test-framework]]
project.getRootModule()=hudson.maven.MavenModule@3034973e[Bigtop-trunk-iTest/org.apache.bigtop.itest:itest-common][Bigtop-trunk-iTest/org.apache.bigtop.itest:itest-common][relativePath:bigtop-test-framework]
FATAL: java.io.IOException: Unexpected EOF
hudson.remoting.RequestAbortedException: java.io.IOException: Unexpected EOF
	at hudson.remoting.Request.abort(Request.java:297)
	at hudson.remoting.Channel.terminate(Channel.java:844)
	at hudson.remoting.SynchronousCommandTransport$ReaderThread.run(SynchronousCommandTransport.java:69)
	at ......remote call to ubuntu-us1(Native Method)
	at hudson.remoting.Channel.attachCallSiteStackTrace(Channel.java:1413)
	at hudson.remoting.Request.call(Request.java:172)
	at hudson.remoting.Channel.call(Channel.java:777)
	at hudson.FilePath.act(FilePath.java:978)
	at hudson.FilePath.act(FilePath.java:967)
	at hudson.maven.MavenModuleSetBuild$MavenModuleSetBuildExecution.parsePoms(MavenModuleSetBuild.java:960)
	at hudson.maven.MavenModuleSetBuild$MavenModuleSetBuildExecution.doRun(MavenModuleSetBuild.java:679)
	at hudson.model.AbstractBuild$AbstractBuildExecution.run(AbstractBuild.java:536)
	at hudson.model.Run.execute(Run.java:1738)
	at hudson.maven.MavenModuleSetBuild.run(MavenModuleSetBuild.java:531)
	at hudson.model.ResourceController.execute(ResourceController.java:98)
	at hudson.model.Executor.run(Executor.java:381)
Caused by: java.io.IOException: Unexpected EOF
	at hudson.remoting.ChunkedInputStream.readUntilBreak(ChunkedInputStream.java:99)
	at hudson.remoting.ChunkedCommandTransport.readBlock(ChunkedCommandTransport.java:39)
	at hudson.remoting.AbstractSynchronousByteArrayCommandTransport.read(AbstractSynchronousByteArrayCommandTransport.java:34)
	at hudson.remoting.SynchronousCommandTransport$ReaderThread.run(SynchronousCommandTransport.java:48)

Build failed in Jenkins: Bigtop-trunk-iTest #2494

Posted by Apache Jenkins Server <je...@builds.apache.org>.
See <https://builds.apache.org/job/Bigtop-trunk-iTest/2494/changes>

Changes:

[cos] BIGTOP-2229. bigtop deploy to support centos-7

[cos] BIGTOP-2340. BIGTOP-2319 is incomplete: the code for smoke-tests is

------------------------------------------
[...truncated 72 lines...]
LOGNAME=jenkins
TMP=/tmp/user/10021
SSH_CONNECTION=140.211.11.14 60837 67.195.81.155 22
HUDSON_HOME=/x1/jenkins/jenkins-home
NODE_NAME=H11
BUILD_NUMBER=2494
XDG_RUNTIME_DIR=/run/user/10021
HUDSON_COOKIE=36589c03-4207-4a15-a61a-4f800300b43c
GIT_AUTHOR_EMAIL=builds@apache.org
_=/usr/bin/env
Parsing POMs
Established TCP socket on 34262
maven3-agent.jar already up to date
maven3-interceptor.jar already up to date
maven3-interceptor-commons.jar already up to date
[bigtop-test-framework] $ /home/jenkins/tools/java/latest1.6/bin/java -Xmx2g -Xms256m -XX:MaxPermSize=512m -cp /home/jenkins/jenkins-slave/maven3-agent.jar:/home/jenkins/tools/maven/apache-maven-3.0.4/boot/plexus-classworlds-2.4.jar org.jvnet.hudson.maven3.agent.Maven3Main /home/jenkins/tools/maven/apache-maven-3.0.4 /home/jenkins/jenkins-slave/slave.jar /home/jenkins/jenkins-slave/maven3-interceptor.jar /home/jenkins/jenkins-slave/maven3-interceptor-commons.jar 34262
<===[JENKINS REMOTING CAPACITY]===>   channel started
Executing Maven:  -B -f <https://builds.apache.org/job/Bigtop-trunk-iTest/ws/bigtop-test-framework/pom.xml> -Dmaven.repo.local=/home/jenkins/jenkins-slave/maven-repositories/1 clean deploy -DskipITs
[INFO] Scanning for projects...
Downloading: http://repository.codehaus.org/org/codehaus/groovy/groovy-eclipse-batch/maven-metadata.xml
Downloading: http://nexus.codehaus.org/snapshots/org/codehaus/groovy/groovy-eclipse-batch/maven-metadata.xml
[WARNING] Could not transfer metadata org.codehaus.groovy:groovy-eclipse-batch/maven-metadata.xml from/to codehaus.org (http://repository.codehaus.org): repository.codehaus.org
[WARNING] Could not transfer metadata org.codehaus.groovy:groovy-eclipse-batch/maven-metadata.xml from/to codehaus-snapshots (http://nexus.codehaus.org/snapshots/): nexus.codehaus.org
Downloading: http://repository.codehaus.org/org/codehaus/groovy/groovy-eclipse-batch/2.1.8-01-SNAPSHOT/maven-metadata.xml
Downloading: http://nexus.codehaus.org/snapshots/org/codehaus/groovy/groovy-eclipse-batch/2.1.8-01-SNAPSHOT/maven-metadata.xml
[WARNING] Could not transfer metadata org.codehaus.groovy:groovy-eclipse-batch:2.1.8-01-SNAPSHOT/maven-metadata.xml from/to codehaus.org (http://repository.codehaus.org): repository.codehaus.org
[WARNING] Could not transfer metadata org.codehaus.groovy:groovy-eclipse-batch:2.1.8-01-SNAPSHOT/maven-metadata.xml from/to codehaus-snapshots (http://nexus.codehaus.org/snapshots/): nexus.codehaus.org
Downloading: http://repository.codehaus.org/org/codehaus/groovy/groovy-eclipse-batch/2.2.1-01-SNAPSHOT/maven-metadata.xml
Downloading: http://nexus.codehaus.org/snapshots/org/codehaus/groovy/groovy-eclipse-batch/2.2.1-01-SNAPSHOT/maven-metadata.xml
[WARNING] Could not transfer metadata org.codehaus.groovy:groovy-eclipse-batch:2.2.1-01-SNAPSHOT/maven-metadata.xml from/to codehaus.org (http://repository.codehaus.org): repository.codehaus.org
[WARNING] Could not transfer metadata org.codehaus.groovy:groovy-eclipse-batch:2.2.1-01-SNAPSHOT/maven-metadata.xml from/to codehaus-snapshots (http://nexus.codehaus.org/snapshots/): nexus.codehaus.org
Downloading: http://repository.codehaus.org/org/codehaus/groovy/groovy-eclipse-batch/2.3.0-01-SNAPSHOT/maven-metadata.xml
Downloading: http://nexus.codehaus.org/snapshots/org/codehaus/groovy/groovy-eclipse-batch/2.3.0-01-SNAPSHOT/maven-metadata.xml
[WARNING] Could not transfer metadata org.codehaus.groovy:groovy-eclipse-batch:2.3.0-01-SNAPSHOT/maven-metadata.xml from/to codehaus.org (http://repository.codehaus.org): repository.codehaus.org
[WARNING] Could not transfer metadata org.codehaus.groovy:groovy-eclipse-batch:2.3.0-01-SNAPSHOT/maven-metadata.xml from/to codehaus-snapshots (http://nexus.codehaus.org/snapshots/): nexus.codehaus.org
Downloading: http://repository.codehaus.org/org/codehaus/groovy/groovy-eclipse-batch/2.3.1-01-SNAPSHOT/maven-metadata.xml
Downloading: http://nexus.codehaus.org/snapshots/org/codehaus/groovy/groovy-eclipse-batch/2.3.1-01-SNAPSHOT/maven-metadata.xml
[WARNING] Could not transfer metadata org.codehaus.groovy:groovy-eclipse-batch:2.3.1-01-SNAPSHOT/maven-metadata.xml from/to codehaus.org (http://repository.codehaus.org): repository.codehaus.org
[WARNING] Could not transfer metadata org.codehaus.groovy:groovy-eclipse-batch:2.3.1-01-SNAPSHOT/maven-metadata.xml from/to codehaus-snapshots (http://nexus.codehaus.org/snapshots/): nexus.codehaus.org
Downloading: http://repository.codehaus.org/org/codehaus/groovy/groovy-eclipse-batch/2.3.2-01-SNAPSHOT/maven-metadata.xml
Downloading: http://nexus.codehaus.org/snapshots/org/codehaus/groovy/groovy-eclipse-batch/2.3.2-01-SNAPSHOT/maven-metadata.xml
[WARNING] Could not transfer metadata org.codehaus.groovy:groovy-eclipse-batch:2.3.2-01-SNAPSHOT/maven-metadata.xml from/to codehaus.org (http://repository.codehaus.org): repository.codehaus.org
[WARNING] Could not transfer metadata org.codehaus.groovy:groovy-eclipse-batch:2.3.2-01-SNAPSHOT/maven-metadata.xml from/to codehaus-snapshots (http://nexus.codehaus.org/snapshots/): nexus.codehaus.org
Downloading: http://repository.codehaus.org/org/codehaus/groovy/groovy-eclipse-batch/2.3.3-01-SNAPSHOT/maven-metadata.xml
Downloading: http://nexus.codehaus.org/snapshots/org/codehaus/groovy/groovy-eclipse-batch/2.3.3-01-SNAPSHOT/maven-metadata.xml
[WARNING] Could not transfer metadata org.codehaus.groovy:groovy-eclipse-batch:2.3.3-01-SNAPSHOT/maven-metadata.xml from/to codehaus.org (http://repository.codehaus.org): repository.codehaus.org
[WARNING] Could not transfer metadata org.codehaus.groovy:groovy-eclipse-batch:2.3.3-01-SNAPSHOT/maven-metadata.xml from/to codehaus-snapshots (http://nexus.codehaus.org/snapshots/): nexus.codehaus.org
Downloading: http://repository.codehaus.org/org/codehaus/groovy/groovy-eclipse-batch/2.3.4-01-SNAPSHOT/maven-metadata.xml
Downloading: http://nexus.codehaus.org/snapshots/org/codehaus/groovy/groovy-eclipse-batch/2.3.4-01-SNAPSHOT/maven-metadata.xml
[WARNING] Could not transfer metadata org.codehaus.groovy:groovy-eclipse-batch:2.3.4-01-SNAPSHOT/maven-metadata.xml from/to codehaus.org (http://repository.codehaus.org): repository.codehaus.org
[WARNING] Could not transfer metadata org.codehaus.groovy:groovy-eclipse-batch:2.3.4-01-SNAPSHOT/maven-metadata.xml from/to codehaus-snapshots (http://nexus.codehaus.org/snapshots/): nexus.codehaus.org
[INFO]                                                                         
[INFO] ------------------------------------------------------------------------
[INFO] Building iTest: system and integration testing in the cloud 1.2.0-SNAPSHOT
[INFO] ------------------------------------------------------------------------
[INFO] 
[INFO] --- maven-clean-plugin:2.4.1:clean (default-clean) @ itest-common ---
[INFO] Deleting <https://builds.apache.org/job/Bigtop-trunk-iTest/ws/bigtop-test-framework/target>
[INFO] 
[INFO] --- groovy-eclipse-compiler:2.8.0-01:add-groovy-build-paths (default-add-groovy-build-paths) @ itest-common ---
[WARNING] Failure to transfer org.codehaus.groovy:groovy-eclipse-batch/maven-metadata.xml from http://repository.codehaus.org was cached in the local repository, resolution will not be reattempted until the update interval of codehaus.org has elapsed or updates are forced. Original error: Could not transfer metadata org.codehaus.groovy:groovy-eclipse-batch/maven-metadata.xml from/to codehaus.org (http://repository.codehaus.org): repository.codehaus.org
[WARNING] Failure to transfer org.codehaus.groovy:groovy-eclipse-batch/maven-metadata.xml from http://nexus.codehaus.org/snapshots/ was cached in the local repository, resolution will not be reattempted until the update interval of codehaus-snapshots has elapsed or updates are forced. Original error: Could not transfer metadata org.codehaus.groovy:groovy-eclipse-batch/maven-metadata.xml from/to codehaus-snapshots (http://nexus.codehaus.org/snapshots/): nexus.codehaus.org
[INFO] Adding /src/main/groovy to the list of source folders
[INFO] Adding /src/test/groovy to the list of test source folders
[INFO] 
[INFO] --- maven-remote-resources-plugin:1.1:process (default) @ itest-common ---
[INFO] Setting property: classpath.resource.loader.class => 'org.codehaus.plexus.velocity.ContextClassLoaderResourceLoader'.
[INFO] Setting property: velocimacro.messages.on => 'false'.
[INFO] Setting property: resource.loader => 'classpath'.
[INFO] Setting property: resource.manager.logwhenfound => 'false'.
[INFO] 
[INFO] --- maven-resources-plugin:2.4:resources (default-resources) @ itest-common ---
[INFO] Using 'UTF-8' encoding to copy filtered resources.
[INFO] skip non existing resourceDirectory <https://builds.apache.org/job/Bigtop-trunk-iTest/ws/bigtop-test-framework/src/main/resources>
[INFO] Copying 3 resources
[INFO] 
[INFO] --- maven-compiler-plugin:3.1:compile (default-compile) @ itest-common ---
[INFO] Changes detected - recompiling the module!
[INFO] Using Groovy-Eclipse compiler to compile both Java and Groovy files
[INFO] 
[INFO] --- maven-resources-plugin:2.4:testResources (default-testResources) @ itest-common ---
[INFO] Using 'UTF-8' encoding to copy filtered resources.
[INFO] skip non existing resourceDirectory <https://builds.apache.org/job/Bigtop-trunk-iTest/ws/bigtop-test-framework/src/test/resources>
[INFO] Copying 3 resources
[INFO] 
[INFO] --- maven-compiler-plugin:3.1:testCompile (default-testCompile) @ itest-common ---
[INFO] Changes detected - recompiling the module!
[INFO] Using Groovy-Eclipse compiler to compile both Java and Groovy files
[INFO] 
[INFO] --- maven-surefire-plugin:2.7:test (default-test) @ itest-common ---
[INFO] Surefire report directory: <https://builds.apache.org/job/Bigtop-trunk-iTest/ws/bigtop-test-framework/target/surefire-reports>

-------------------------------------------------------
 T E S T S
-------------------------------------------------------
Running org.apache.bigtop.itest.JUnitUtilsTest
Disclaimer: This test expected to show a failure in an embeded testcase
    [junit] Running org.apache.bigtop.itest.DummyTestPassTests run: 1, Failures: 0, Errors: 0, Time elapsed: 0.455 secRunning org.apache.bigtop.itest.DummyTestFailTests run: 1, Failures: 1, Errors: 0, Time elapsed: 0.237 sec
    [junit] TEST org.apache.bigtop.itest.DummyTestFail FAILED
    [junit] Tests FAILED
Disclaimer: This test expected to show an error in an embeded testcase
    [junit] Running org.apache.bigtop.itest.DummyTestError
    [junit] Tests run: 1, Failures: 0, Errors: 1, Time elapsed: 0.42 sec
    [junit] Test org.apache.bigtop.itest.DummyTestError FAILED
    [junit] Running org.apache.bigtop.itest.DummyTestPass
    [junit] Tests run: 1, Failures: 0, Errors: 0, Time elapsed: 1.275 sec
    [junit] Running org.apache.bigtop.itest.DummyTestPass
    [junit] Tests run: 1, Failures: 0, Errors: 0, Time elapsed: 1.041 sec
Tests run: 4, Failures: 0, Errors: 0, Skipped: 0, Time elapsed: 12.256 sec
Running org.apache.bigtop.itest.junit.OrderedParameterizedTest
Tests run: 3, Failures: 0, Errors: 0, Skipped: 0, Time elapsed: 0.227 sec
Running org.apache.bigtop.itest.junit.OrderedTest
Tests run: 3, Failures: 0, Errors: 0, Skipped: 0, Time elapsed: 0.011 sec
Running org.apache.bigtop.itest.posix.UGITest
Tests run: 2, Failures: 0, Errors: 0, Skipped: 0, Time elapsed: 0.351 sec
Running org.apache.bigtop.itest.posix.ServiceTest
Status []
Tests run: 2, Failures: 0, Errors: 0, Skipped: 1, Time elapsed: 0.6 sec
Running org.apache.bigtop.itest.posix.AlternativeTest
Tests run: 1, Failures: 0, Errors: 0, Skipped: 0, Time elapsed: 7.747 sec
Running org.apache.bigtop.itest.TestContractGroovy
Tests run: 2, Failures: 0, Errors: 0, Skipped: 0, Time elapsed: 0.161 sec
Running org.apache.bigtop.itest.pmanager.PackageManagerTest
/etc/cron.monthly/.placeholder
/etc/cron.hourly/.placeholder
/etc/default/cron
/etc/cron.weekly/.placeholder
/etc/cron.d/.placeholder
/etc/cron.daily/.placeholder
/etc/pam.d/cron
/etc/init/cron.conf
/etc/crontab
/.
/etc
/etc/cron.monthly
/etc/cron.monthly/.placeholder
/etc/cron.hourly
/etc/cron.hourly/.placeholder
/etc/default
/etc/default/cron
/etc/cron.weekly
/etc/cron.weekly/.placeholder
/etc/cron.d
/etc/cron.d/.placeholder
/etc/cron.daily
/etc/cron.daily/.placeholder
/etc/pam.d
/etc/pam.d/cron
/etc/init
/etc/init/cron.conf
/etc/init.d
/etc/crontab
/usr
/usr/share
/usr/share/bug
/usr/share/bug/cron
/usr/share/bug/cron/script
/usr/share/bug/cron/control
/usr/share/man
/usr/share/man/man1
/usr/share/man/man1/crontab.1.gz
/usr/share/man/man5
/usr/share/man/man5/crontab.5.gz
/usr/share/man/man8
/usr/share/man/man8/cron.8.gz
/usr/share/doc
/usr/share/doc/cron
/usr/share/doc/cron/README
/usr/share/doc/cron/README.anacron
/usr/share/doc/cron/README.Debian
/usr/share/doc/cron/FEATURES
/usr/share/doc/cron/copyright
/usr/share/doc/cron/examples
/usr/share/doc/cron/examples/crontab2english.pl
/usr/share/doc/cron/examples/cron-stats.pl
/usr/share/doc/cron/examples/cron-tasks-review.sh
/usr/share/doc/cron/NEWS.Debian.gz
/usr/share/doc/cron/changelog.Debian.gz
/usr/share/doc/cron/THANKS
/usr/share/doc/cron/TODO.Debian
/usr/sbin
/usr/sbin/cron
/usr/bin
/usr/bin/crontab
/var
/var/spool
/var/spool/cron
/var/spool/cron/crontabs
/etc/init.d/cron
Tests run: 11, Failures: 0, Errors: 0, Skipped: 0, Time elapsed: 5.514 sec
Running org.apache.bigtop.itest.TestContractJava
Tests run: 2, Failures: 0, Errors: 0, Skipped: 0, Time elapsed: 0.002 sec
Running org.apache.bigtop.itest.TestListUtilsTest
Tests run: 1, Failures: 0, Errors: 0, Skipped: 0, Time elapsed: 0.073 sec
Running org.apache.bigtop.itest.shell.ShellTest
Tests run: 2, Failures: 0, Errors: 0, Skipped: 0, Time elapsed: 0.163 sec
Running org.apache.bigtop.itest.JarContentTest
log4j:WARN No appenders could be found for logger (org.apache.bigtop.itest.JarContent).
log4j:WARN Please initialize the log4j system properly.
Tests run: 6, Failures: 0, Errors: 0, Skipped: 0, Time elapsed: 2.872 sec
Running org.apache.bigtop.itest.TestContractJavaProc
Tests run: 2, Failures: 0, Errors: 0, Skipped: 0, Time elapsed: 0.002 sec

Results :

Tests run: 41, Failures: 0, Errors: 0, Skipped: 1

[JENKINS] Recording test results
log4j:WARN No appenders could be found for logger (org.apache.commons.beanutils.converters.BooleanConverter).
log4j:WARN Please initialize the log4j system properly.
[INFO] 
[INFO] --- maven-jar-plugin:2.2:jar (default-jar) @ itest-common ---
[INFO] Building jar: <https://builds.apache.org/job/Bigtop-trunk-iTest/ws/bigtop-test-framework/target/itest-common-1.2.0-SNAPSHOT.jar>
[INFO] 
[INFO] --- maven-jar-plugin:2.2:test-jar (default) @ itest-common ---
[INFO] Building jar: <https://builds.apache.org/job/Bigtop-trunk-iTest/ws/bigtop-test-framework/target/itest-common-1.2.0-SNAPSHOT-tests.jar>
[INFO] 
[INFO] --- maven-failsafe-plugin:2.17:verify (default) @ itest-common ---
[INFO] Tests are skipped.
[JENKINS] Recording test results[INFO] 
[INFO] --- maven-install-plugin:2.3:install (default-install) @ itest-common ---

[INFO] Installing <https://builds.apache.org/job/Bigtop-trunk-iTest/ws/bigtop-test-framework/target/itest-common-1.2.0-SNAPSHOT.jar> to /home/jenkins/jenkins-slave/maven-repositories/1/org/apache/bigtop/itest/itest-common/1.2.0-SNAPSHOT/itest-common-1.2.0-SNAPSHOT.jar
[INFO] Installing <https://builds.apache.org/job/Bigtop-trunk-iTest/ws/bigtop-test-framework/pom.xml> to /home/jenkins/jenkins-slave/maven-repositories/1/org/apache/bigtop/itest/itest-common/1.2.0-SNAPSHOT/itest-common-1.2.0-SNAPSHOT.pom
[INFO] Installing <https://builds.apache.org/job/Bigtop-trunk-iTest/ws/bigtop-test-framework/target/itest-common-1.2.0-SNAPSHOT-tests.jar> to /home/jenkins/jenkins-slave/maven-repositories/1/org/apache/bigtop/itest/itest-common/1.2.0-SNAPSHOT/itest-common-1.2.0-SNAPSHOT-tests.jar
[INFO] 
[INFO] --- maven-deploy-plugin:2.5:deploy (default-deploy) @ itest-common ---
Downloading: https://repository.apache.org/content/repositories/snapshots/org/apache/bigtop/itest/itest-common/1.2.0-SNAPSHOT/maven-metadata.xml
[WARNING] Could not transfer metadata org.apache.bigtop.itest:itest-common:1.2.0-SNAPSHOT/maven-metadata.xml from/to apache.snapshots.https (https://repository.apache.org/content/repositories/snapshots): java.lang.RuntimeException: Could not generate DH keypair
[INFO] ------------------------------------------------------------------------
[INFO] BUILD FAILURE
[INFO] ------------------------------------------------------------------------
[INFO] Total time: 1:14.051s
[INFO] Finished at: Mon Feb 22 15:30:29 UTC 2016
[INFO] Final Memory: 21M/437M
[INFO] ------------------------------------------------------------------------
Waiting for Jenkins to finish collecting data
[ERROR] Failed to execute goal org.apache.maven.plugins:maven-deploy-plugin:2.5:deploy (default-deploy) on project itest-common: Failed to retrieve remote metadata org.apache.bigtop.itest:itest-common:1.2.0-SNAPSHOT/maven-metadata.xml: Could not transfer metadata org.apache.bigtop.itest:itest-common:1.2.0-SNAPSHOT/maven-metadata.xml from/to apache.snapshots.https (https://repository.apache.org/content/repositories/snapshots): java.lang.RuntimeException: Could not generate DH keypair: Prime size must be multiple of 64, and can only range from 512 to 1024 (inclusive) -> [Help 1]
[ERROR] 
[ERROR] To see the full stack trace of the errors, re-run Maven with the -e switch.
[ERROR] Re-run Maven using the -X switch to enable full debug logging.
[ERROR] 
[ERROR] For more information about the errors and possible solutions, please read the following articles:
[ERROR] [Help 1] http://cwiki.apache.org/confluence/display/MAVEN/MojoExecutionException
[JENKINS] Archiving <https://builds.apache.org/job/Bigtop-trunk-iTest/ws/bigtop-test-framework/pom.xml> to org.apache.bigtop.itest/itest-common/1.2.0-SNAPSHOT/itest-common-1.2.0-SNAPSHOT.pom
[JENKINS] Archiving <https://builds.apache.org/job/Bigtop-trunk-iTest/ws/bigtop-test-framework/target/itest-common-1.2.0-SNAPSHOT.jar> to org.apache.bigtop.itest/itest-common/1.2.0-SNAPSHOT/itest-common-1.2.0-SNAPSHOT.jar
[JENKINS] Archiving <https://builds.apache.org/job/Bigtop-trunk-iTest/ws/bigtop-test-framework/target/itest-common-1.2.0-SNAPSHOT-tests.jar> to org.apache.bigtop.itest/itest-common/1.2.0-SNAPSHOT/itest-common-1.2.0-SNAPSHOT-tests.jar
Sending e-mails to: ci@bigtop.apache.org
channel stopped

Build failed in Jenkins: Bigtop-trunk-iTest #2493

Posted by Apache Jenkins Server <je...@builds.apache.org>.
See <https://builds.apache.org/job/Bigtop-trunk-iTest/2493/changes>

Changes:

[of] BIGTOP-2265: adding dockerfile for bigtop/slaves for x86_64 platform

------------------------------------------
[...truncated 70 lines...]
GIT_URL=https://git-wip-us.apache.org/repos/asf/bigtop.git
NODE_LABELS=H11 Ubuntu docker ubuntu yahoo-not-h2
LOGNAME=jenkins
TMP=/tmp/user/10021
SSH_CONNECTION=140.211.11.14 60837 67.195.81.155 22
HUDSON_HOME=/x1/jenkins/jenkins-home
NODE_NAME=H11
BUILD_NUMBER=2493
XDG_RUNTIME_DIR=/run/user/10021
HUDSON_COOKIE=853c9cc3-c9d5-48ad-9212-693b12aa1867
GIT_AUTHOR_EMAIL=builds@apache.org
_=/usr/bin/env
Parsing POMs
Established TCP socket on 49843
maven3-agent.jar already up to date
maven3-interceptor.jar already up to date
maven3-interceptor-commons.jar already up to date
[bigtop-test-framework] $ /home/jenkins/tools/java/latest1.6/bin/java -Xmx2g -Xms256m -XX:MaxPermSize=512m -cp /home/jenkins/jenkins-slave/maven3-agent.jar:/home/jenkins/tools/maven/apache-maven-3.0.4/boot/plexus-classworlds-2.4.jar org.jvnet.hudson.maven3.agent.Maven3Main /home/jenkins/tools/maven/apache-maven-3.0.4 /home/jenkins/jenkins-slave/slave.jar /home/jenkins/jenkins-slave/maven3-interceptor.jar /home/jenkins/jenkins-slave/maven3-interceptor-commons.jar 49843
<===[JENKINS REMOTING CAPACITY]===>   channel started
Executing Maven:  -B -f <https://builds.apache.org/job/Bigtop-trunk-iTest/ws/bigtop-test-framework/pom.xml> -Dmaven.repo.local=/home/jenkins/jenkins-slave/maven-repositories/0 clean deploy -DskipITs
[INFO] Scanning for projects...
Downloading: http://nexus.codehaus.org/snapshots/org/codehaus/groovy/groovy-eclipse-batch/maven-metadata.xml
Downloading: http://repository.codehaus.org/org/codehaus/groovy/groovy-eclipse-batch/maven-metadata.xml
[WARNING] Could not transfer metadata org.codehaus.groovy:groovy-eclipse-batch/maven-metadata.xml from/to codehaus.org (http://repository.codehaus.org): repository.codehaus.org
[WARNING] Could not transfer metadata org.codehaus.groovy:groovy-eclipse-batch/maven-metadata.xml from/to codehaus-snapshots (http://nexus.codehaus.org/snapshots/): nexus.codehaus.org
Downloading: http://repository.codehaus.org/org/codehaus/groovy/groovy-eclipse-batch/2.1.8-01-SNAPSHOT/maven-metadata.xml
Downloading: http://nexus.codehaus.org/snapshots/org/codehaus/groovy/groovy-eclipse-batch/2.1.8-01-SNAPSHOT/maven-metadata.xml
[WARNING] Could not transfer metadata org.codehaus.groovy:groovy-eclipse-batch:2.1.8-01-SNAPSHOT/maven-metadata.xml from/to codehaus.org (http://repository.codehaus.org): repository.codehaus.org
[WARNING] Could not transfer metadata org.codehaus.groovy:groovy-eclipse-batch:2.1.8-01-SNAPSHOT/maven-metadata.xml from/to codehaus-snapshots (http://nexus.codehaus.org/snapshots/): nexus.codehaus.org
Downloading: http://nexus.codehaus.org/snapshots/org/codehaus/groovy/groovy-eclipse-batch/2.2.1-01-SNAPSHOT/maven-metadata.xml
Downloading: http://repository.codehaus.org/org/codehaus/groovy/groovy-eclipse-batch/2.2.1-01-SNAPSHOT/maven-metadata.xml
[WARNING] Could not transfer metadata org.codehaus.groovy:groovy-eclipse-batch:2.2.1-01-SNAPSHOT/maven-metadata.xml from/to codehaus.org (http://repository.codehaus.org): repository.codehaus.org
[WARNING] Could not transfer metadata org.codehaus.groovy:groovy-eclipse-batch:2.2.1-01-SNAPSHOT/maven-metadata.xml from/to codehaus-snapshots (http://nexus.codehaus.org/snapshots/): nexus.codehaus.org
Downloading: http://repository.codehaus.org/org/codehaus/groovy/groovy-eclipse-batch/2.3.0-01-SNAPSHOT/maven-metadata.xml
Downloading: http://nexus.codehaus.org/snapshots/org/codehaus/groovy/groovy-eclipse-batch/2.3.0-01-SNAPSHOT/maven-metadata.xml
[WARNING] Could not transfer metadata org.codehaus.groovy:groovy-eclipse-batch:2.3.0-01-SNAPSHOT/maven-metadata.xml from/to codehaus.org (http://repository.codehaus.org): repository.codehaus.org
[WARNING] Could not transfer metadata org.codehaus.groovy:groovy-eclipse-batch:2.3.0-01-SNAPSHOT/maven-metadata.xml from/to codehaus-snapshots (http://nexus.codehaus.org/snapshots/): nexus.codehaus.org
Downloading: http://repository.codehaus.org/org/codehaus/groovy/groovy-eclipse-batch/2.3.1-01-SNAPSHOT/maven-metadata.xml
Downloading: http://nexus.codehaus.org/snapshots/org/codehaus/groovy/groovy-eclipse-batch/2.3.1-01-SNAPSHOT/maven-metadata.xml
[WARNING] Could not transfer metadata org.codehaus.groovy:groovy-eclipse-batch:2.3.1-01-SNAPSHOT/maven-metadata.xml from/to codehaus.org (http://repository.codehaus.org): repository.codehaus.org
[WARNING] Could not transfer metadata org.codehaus.groovy:groovy-eclipse-batch:2.3.1-01-SNAPSHOT/maven-metadata.xml from/to codehaus-snapshots (http://nexus.codehaus.org/snapshots/): nexus.codehaus.org
Downloading: http://repository.codehaus.org/org/codehaus/groovy/groovy-eclipse-batch/2.3.2-01-SNAPSHOT/maven-metadata.xml
Downloading: http://nexus.codehaus.org/snapshots/org/codehaus/groovy/groovy-eclipse-batch/2.3.2-01-SNAPSHOT/maven-metadata.xml
[WARNING] Could not transfer metadata org.codehaus.groovy:groovy-eclipse-batch:2.3.2-01-SNAPSHOT/maven-metadata.xml from/to codehaus.org (http://repository.codehaus.org): repository.codehaus.org
[WARNING] Could not transfer metadata org.codehaus.groovy:groovy-eclipse-batch:2.3.2-01-SNAPSHOT/maven-metadata.xml from/to codehaus-snapshots (http://nexus.codehaus.org/snapshots/): nexus.codehaus.org
Downloading: http://nexus.codehaus.org/snapshots/org/codehaus/groovy/groovy-eclipse-batch/2.3.3-01-SNAPSHOT/maven-metadata.xml
Downloading: http://repository.codehaus.org/org/codehaus/groovy/groovy-eclipse-batch/2.3.3-01-SNAPSHOT/maven-metadata.xml
[WARNING] Could not transfer metadata org.codehaus.groovy:groovy-eclipse-batch:2.3.3-01-SNAPSHOT/maven-metadata.xml from/to codehaus.org (http://repository.codehaus.org): repository.codehaus.org
[WARNING] Could not transfer metadata org.codehaus.groovy:groovy-eclipse-batch:2.3.3-01-SNAPSHOT/maven-metadata.xml from/to codehaus-snapshots (http://nexus.codehaus.org/snapshots/): nexus.codehaus.org
Downloading: http://repository.codehaus.org/org/codehaus/groovy/groovy-eclipse-batch/2.3.4-01-SNAPSHOT/maven-metadata.xml
Downloading: http://nexus.codehaus.org/snapshots/org/codehaus/groovy/groovy-eclipse-batch/2.3.4-01-SNAPSHOT/maven-metadata.xml
[WARNING] Could not transfer metadata org.codehaus.groovy:groovy-eclipse-batch:2.3.4-01-SNAPSHOT/maven-metadata.xml from/to codehaus.org (http://repository.codehaus.org): repository.codehaus.org
[WARNING] Could not transfer metadata org.codehaus.groovy:groovy-eclipse-batch:2.3.4-01-SNAPSHOT/maven-metadata.xml from/to codehaus-snapshots (http://nexus.codehaus.org/snapshots/): nexus.codehaus.org
[INFO]                                                                         
[INFO] ------------------------------------------------------------------------
[INFO] Building iTest: system and integration testing in the cloud 1.2.0-SNAPSHOT
[INFO] ------------------------------------------------------------------------
[INFO] 
[INFO] --- maven-clean-plugin:2.4.1:clean (default-clean) @ itest-common ---
[INFO] Deleting <https://builds.apache.org/job/Bigtop-trunk-iTest/ws/bigtop-test-framework/target>
[INFO] 
[INFO] --- groovy-eclipse-compiler:2.8.0-01:add-groovy-build-paths (default-add-groovy-build-paths) @ itest-common ---
[WARNING] Failure to transfer org.codehaus.groovy:groovy-eclipse-batch/maven-metadata.xml from http://repository.codehaus.org was cached in the local repository, resolution will not be reattempted until the update interval of codehaus.org has elapsed or updates are forced. Original error: Could not transfer metadata org.codehaus.groovy:groovy-eclipse-batch/maven-metadata.xml from/to codehaus.org (http://repository.codehaus.org): repository.codehaus.org
[WARNING] Failure to transfer org.codehaus.groovy:groovy-eclipse-batch/maven-metadata.xml from http://nexus.codehaus.org/snapshots/ was cached in the local repository, resolution will not be reattempted until the update interval of codehaus-snapshots has elapsed or updates are forced. Original error: Could not transfer metadata org.codehaus.groovy:groovy-eclipse-batch/maven-metadata.xml from/to codehaus-snapshots (http://nexus.codehaus.org/snapshots/): nexus.codehaus.org
[INFO] Adding /src/main/groovy to the list of source folders
[INFO] Adding /src/test/groovy to the list of test source folders
[INFO] 
[INFO] --- maven-remote-resources-plugin:1.1:process (default) @ itest-common ---
[INFO] Setting property: classpath.resource.loader.class => 'org.codehaus.plexus.velocity.ContextClassLoaderResourceLoader'.
[INFO] Setting property: velocimacro.messages.on => 'false'.
[INFO] Setting property: resource.loader => 'classpath'.
[INFO] Setting property: resource.manager.logwhenfound => 'false'.
[INFO] 
[INFO] --- maven-resources-plugin:2.4:resources (default-resources) @ itest-common ---
[INFO] Using 'UTF-8' encoding to copy filtered resources.
[INFO] skip non existing resourceDirectory <https://builds.apache.org/job/Bigtop-trunk-iTest/ws/bigtop-test-framework/src/main/resources>
[INFO] Copying 3 resources
[INFO] 
[INFO] --- maven-compiler-plugin:3.1:compile (default-compile) @ itest-common ---
[INFO] Changes detected - recompiling the module!
[INFO] Using Groovy-Eclipse compiler to compile both Java and Groovy files
[INFO] 
[INFO] --- maven-resources-plugin:2.4:testResources (default-testResources) @ itest-common ---
[INFO] Using 'UTF-8' encoding to copy filtered resources.
[INFO] skip non existing resourceDirectory <https://builds.apache.org/job/Bigtop-trunk-iTest/ws/bigtop-test-framework/src/test/resources>
[INFO] Copying 3 resources
[INFO] 
[INFO] --- maven-compiler-plugin:3.1:testCompile (default-testCompile) @ itest-common ---
[INFO] Changes detected - recompiling the module!
[INFO] Using Groovy-Eclipse compiler to compile both Java and Groovy files
[INFO] 
[INFO] --- maven-surefire-plugin:2.7:test (default-test) @ itest-common ---
[INFO] Surefire report directory: <https://builds.apache.org/job/Bigtop-trunk-iTest/ws/bigtop-test-framework/target/surefire-reports>

-------------------------------------------------------
 T E S T S
-------------------------------------------------------
Running org.apache.bigtop.itest.JUnitUtilsTest
Disclaimer: This test expected to show a failure in an embeded testcase
    [junit] Running org.apache.bigtop.itest.DummyTestPassTests run: 1, Failures: 0, Errors: 0, Time elapsed: 0.496 secRunning org.apache.bigtop.itest.DummyTestFail
    [junit] Tests run: 1, Failures: 1, Errors: 0, Time elapsed: 0.669 secTEST org.apache.bigtop.itest.DummyTestFail FAILED
    [junit] Tests FAILED
Disclaimer: This test expected to show an error in an embeded testcase
    [junit] Running org.apache.bigtop.itest.DummyTestErrorTests run: 1, Failures: 0, Errors: 1, Time elapsed: 0.467 sec
    [junit] Test org.apache.bigtop.itest.DummyTestError FAILED
    [junit] Running org.apache.bigtop.itest.DummyTestPassTests run: 1, Failures: 0, Errors: 0, Time elapsed: 0.568 sec
    [junit] Running org.apache.bigtop.itest.DummyTestPass
    [junit] Tests run: 1, Failures: 0, Errors: 0, Time elapsed: 0.67 sec
Tests run: 4, Failures: 0, Errors: 0, Skipped: 0, Time elapsed: 11.278 sec
Running org.apache.bigtop.itest.junit.OrderedParameterizedTest
Tests run: 3, Failures: 0, Errors: 0, Skipped: 0, Time elapsed: 0.193 sec
Running org.apache.bigtop.itest.junit.OrderedTest
Tests run: 3, Failures: 0, Errors: 0, Skipped: 0, Time elapsed: 0.027 sec
Running org.apache.bigtop.itest.posix.UGITest
Tests run: 2, Failures: 0, Errors: 0, Skipped: 0, Time elapsed: 0.226 sec
Running org.apache.bigtop.itest.posix.ServiceTest
Status []
Tests run: 2, Failures: 0, Errors: 0, Skipped: 1, Time elapsed: 0.752 sec
Running org.apache.bigtop.itest.posix.AlternativeTest
Tests run: 1, Failures: 0, Errors: 0, Skipped: 0, Time elapsed: 7.296 sec
Running org.apache.bigtop.itest.TestContractGroovy
Tests run: 2, Failures: 0, Errors: 0, Skipped: 0, Time elapsed: 0.04 sec
Running org.apache.bigtop.itest.pmanager.PackageManagerTest
/etc/cron.monthly/.placeholder
/etc/cron.hourly/.placeholder
/etc/default/cron
/etc/cron.weekly/.placeholder
/etc/cron.d/.placeholder
/etc/cron.daily/.placeholder
/etc/pam.d/cron
/etc/init/cron.conf
/etc/crontab
/.
/etc
/etc/cron.monthly
/etc/cron.monthly/.placeholder
/etc/cron.hourly
/etc/cron.hourly/.placeholder
/etc/default
/etc/default/cron
/etc/cron.weekly
/etc/cron.weekly/.placeholder
/etc/cron.d
/etc/cron.d/.placeholder
/etc/cron.daily
/etc/cron.daily/.placeholder
/etc/pam.d
/etc/pam.d/cron
/etc/init
/etc/init/cron.conf
/etc/init.d
/etc/crontab
/usr
/usr/share
/usr/share/bug
/usr/share/bug/cron
/usr/share/bug/cron/script
/usr/share/bug/cron/control
/usr/share/man
/usr/share/man/man1
/usr/share/man/man1/crontab.1.gz
/usr/share/man/man5
/usr/share/man/man5/crontab.5.gz
/usr/share/man/man8
/usr/share/man/man8/cron.8.gz
/usr/share/doc
/usr/share/doc/cron
/usr/share/doc/cron/README
/usr/share/doc/cron/README.anacron
/usr/share/doc/cron/README.Debian
/usr/share/doc/cron/FEATURES
/usr/share/doc/cron/copyright
/usr/share/doc/cron/examples
/usr/share/doc/cron/examples/crontab2english.pl
/usr/share/doc/cron/examples/cron-stats.pl
/usr/share/doc/cron/examples/cron-tasks-review.sh
/usr/share/doc/cron/NEWS.Debian.gz
/usr/share/doc/cron/changelog.Debian.gz
/usr/share/doc/cron/THANKS
/usr/share/doc/cron/TODO.Debian
/usr/sbin
/usr/sbin/cron
/usr/bin
/usr/bin/crontab
/var
/var/spool
/var/spool/cron
/var/spool/cron/crontabs
/etc/init.d/cron
Tests run: 11, Failures: 0, Errors: 0, Skipped: 0, Time elapsed: 6.902 sec
Running org.apache.bigtop.itest.TestContractJava
Tests run: 2, Failures: 0, Errors: 0, Skipped: 0, Time elapsed: 0.003 sec
Running org.apache.bigtop.itest.TestListUtilsTest
Tests run: 1, Failures: 0, Errors: 0, Skipped: 0, Time elapsed: 0.042 sec
Running org.apache.bigtop.itest.shell.ShellTest
Tests run: 2, Failures: 0, Errors: 0, Skipped: 0, Time elapsed: 0.059 sec
Running org.apache.bigtop.itest.JarContentTest
log4j:WARN No appenders could be found for logger (org.apache.bigtop.itest.JarContent).
log4j:WARN Please initialize the log4j system properly.
Tests run: 6, Failures: 0, Errors: 0, Skipped: 0, Time elapsed: 3.019 sec
Running org.apache.bigtop.itest.TestContractJavaProc
Tests run: 2, Failures: 0, Errors: 0, Skipped: 0, Time elapsed: 0.002 sec

Results :

Tests run: 41, Failures: 0, Errors: 0, Skipped: 1

[JENKINS] Recording test results
log4j:WARN No appenders could be found for logger (org.apache.commons.beanutils.converters.BooleanConverter).
log4j:WARN Please initialize the log4j system properly.
[INFO] 
[INFO] --- maven-jar-plugin:2.2:jar (default-jar) @ itest-common ---
[INFO] Building jar: <https://builds.apache.org/job/Bigtop-trunk-iTest/ws/bigtop-test-framework/target/itest-common-1.2.0-SNAPSHOT.jar>
[INFO] 
[INFO] --- maven-jar-plugin:2.2:test-jar (default) @ itest-common ---
[INFO] Building jar: <https://builds.apache.org/job/Bigtop-trunk-iTest/ws/bigtop-test-framework/target/itest-common-1.2.0-SNAPSHOT-tests.jar>
[INFO] 
[INFO] --- maven-failsafe-plugin:2.17:verify (default) @ itest-common ---
[INFO] Tests are skipped.
[JENKINS] Recording test results[INFO] 
[INFO] --- maven-install-plugin:2.3:install (default-install) @ itest-common ---

[INFO] Installing <https://builds.apache.org/job/Bigtop-trunk-iTest/ws/bigtop-test-framework/target/itest-common-1.2.0-SNAPSHOT.jar> to /home/jenkins/jenkins-slave/maven-repositories/0/org/apache/bigtop/itest/itest-common/1.2.0-SNAPSHOT/itest-common-1.2.0-SNAPSHOT.jar
[INFO] Installing <https://builds.apache.org/job/Bigtop-trunk-iTest/ws/bigtop-test-framework/pom.xml> to /home/jenkins/jenkins-slave/maven-repositories/0/org/apache/bigtop/itest/itest-common/1.2.0-SNAPSHOT/itest-common-1.2.0-SNAPSHOT.pom
[INFO] Installing <https://builds.apache.org/job/Bigtop-trunk-iTest/ws/bigtop-test-framework/target/itest-common-1.2.0-SNAPSHOT-tests.jar> to /home/jenkins/jenkins-slave/maven-repositories/0/org/apache/bigtop/itest/itest-common/1.2.0-SNAPSHOT/itest-common-1.2.0-SNAPSHOT-tests.jar
[INFO] 
[INFO] --- maven-deploy-plugin:2.5:deploy (default-deploy) @ itest-common ---
Downloading: https://repository.apache.org/content/repositories/snapshots/org/apache/bigtop/itest/itest-common/1.2.0-SNAPSHOT/maven-metadata.xml
[WARNING] Could not transfer metadata org.apache.bigtop.itest:itest-common:1.2.0-SNAPSHOT/maven-metadata.xml from/to apache.snapshots.https (https://repository.apache.org/content/repositories/snapshots): java.lang.RuntimeException: Could not generate DH keypair
[INFO] ------------------------------------------------------------------------
[INFO] BUILD FAILURE
[INFO] ------------------------------------------------------------------------
[INFO] Total time: 1:12.032s
[INFO] Finished at: Sat Feb 20 22:45:25 UTC 2016
[INFO] Final Memory: 23M/245M
[INFO] ------------------------------------------------------------------------
Waiting for Jenkins to finish collecting data[ERROR] Failed to execute goal org.apache.maven.plugins:maven-deploy-plugin:2.5:deploy (default-deploy) on project itest-common: Failed to retrieve remote metadata org.apache.bigtop.itest:itest-common:1.2.0-SNAPSHOT/maven-metadata.xml: Could not transfer metadata org.apache.bigtop.itest:itest-common:1.2.0-SNAPSHOT/maven-metadata.xml from/to apache.snapshots.https (https://repository.apache.org/content/repositories/snapshots): java.lang.RuntimeException: Could not generate DH keypair: Prime size must be multiple of 64, and can only range from 512 to 1024 (inclusive) -> [Help 1]
[ERROR] 
[ERROR] To see the full stack trace of the errors, re-run Maven with the -e switch.
[ERROR] Re-run Maven using the -X switch to enable full debug logging.
[ERROR] 
[ERROR] For more information about the errors and possible solutions, please read the following articles:
[ERROR] [Help 1] http://cwiki.apache.org/confluence/display/MAVEN/MojoExecutionException

[JENKINS] Archiving <https://builds.apache.org/job/Bigtop-trunk-iTest/ws/bigtop-test-framework/pom.xml> to org.apache.bigtop.itest/itest-common/1.2.0-SNAPSHOT/itest-common-1.2.0-SNAPSHOT.pom
[JENKINS] Archiving <https://builds.apache.org/job/Bigtop-trunk-iTest/ws/bigtop-test-framework/target/itest-common-1.2.0-SNAPSHOT.jar> to org.apache.bigtop.itest/itest-common/1.2.0-SNAPSHOT/itest-common-1.2.0-SNAPSHOT.jar
[JENKINS] Archiving <https://builds.apache.org/job/Bigtop-trunk-iTest/ws/bigtop-test-framework/target/itest-common-1.2.0-SNAPSHOT-tests.jar> to org.apache.bigtop.itest/itest-common/1.2.0-SNAPSHOT/itest-common-1.2.0-SNAPSHOT-tests.jar
Sending e-mails to: ci@bigtop.apache.org
channel stopped

Build failed in Jenkins: Bigtop-trunk-iTest #2492

Posted by Apache Jenkins Server <je...@builds.apache.org>.
See <https://builds.apache.org/job/Bigtop-trunk-iTest/2492/changes>

Changes:

[of] BIGTOP-2264: adding dockerfile for bigtop/puppet for x86_64 platform

------------------------------------------
[...truncated 65 lines...]
LOGNAME=jenkins
SSH_CONNECTION=140.211.11.14 57124 140.211.11.27 22
HUDSON_HOME=/x1/jenkins/jenkins-home
NODE_NAME=ubuntu3
BUILD_NUMBER=2492
HUDSON_COOKIE=965d4588-31ce-485d-9199-a37f6d301d3c
GIT_AUTHOR_EMAIL=builds@apache.org
_=/usr/bin/env
Parsing POMs
Established TCP socket on 46081
maven3-agent.jar already up to date
maven3-interceptor.jar already up to date
maven3-interceptor-commons.jar already up to date
[bigtop-test-framework] $ /home/jenkins/tools/java/latest1.6/bin/java -Xmx2g -Xms256m -XX:MaxPermSize=512m -cp /home/jenkins/jenkins-slave/maven3-agent.jar:/home/jenkins/tools/maven/apache-maven-3.0.4/boot/plexus-classworlds-2.4.jar org.jvnet.hudson.maven3.agent.Maven3Main /home/jenkins/tools/maven/apache-maven-3.0.4 /x1/jenkins/jenkins-slave/slave.jar /home/jenkins/jenkins-slave/maven3-interceptor.jar /home/jenkins/jenkins-slave/maven3-interceptor-commons.jar 46081
<===[JENKINS REMOTING CAPACITY]===>   channel started
Executing Maven:  -B -f <https://builds.apache.org/job/Bigtop-trunk-iTest/ws/bigtop-test-framework/pom.xml> -Dmaven.repo.local=/home/jenkins/jenkins-slave/maven-repositories/1 clean deploy -DskipITs
[INFO] Scanning for projects...
Downloading: http://nexus.codehaus.org/snapshots/org/codehaus/groovy/groovy-eclipse-batch/maven-metadata.xml
Downloading: http://repository.codehaus.org/org/codehaus/groovy/groovy-eclipse-batch/maven-metadata.xml
[WARNING] Could not transfer metadata org.codehaus.groovy:groovy-eclipse-batch/maven-metadata.xml from/to codehaus.org (http://repository.codehaus.org): repository.codehaus.org
[WARNING] Could not transfer metadata org.codehaus.groovy:groovy-eclipse-batch/maven-metadata.xml from/to codehaus-snapshots (http://nexus.codehaus.org/snapshots/): nexus.codehaus.org
Downloading: http://repository.codehaus.org/org/codehaus/groovy/groovy-eclipse-batch/2.1.8-01-SNAPSHOT/maven-metadata.xml
Downloading: http://nexus.codehaus.org/snapshots/org/codehaus/groovy/groovy-eclipse-batch/2.1.8-01-SNAPSHOT/maven-metadata.xml
[WARNING] Could not transfer metadata org.codehaus.groovy:groovy-eclipse-batch:2.1.8-01-SNAPSHOT/maven-metadata.xml from/to codehaus.org (http://repository.codehaus.org): repository.codehaus.org
[WARNING] Could not transfer metadata org.codehaus.groovy:groovy-eclipse-batch:2.1.8-01-SNAPSHOT/maven-metadata.xml from/to codehaus-snapshots (http://nexus.codehaus.org/snapshots/): nexus.codehaus.org
Downloading: http://nexus.codehaus.org/snapshots/org/codehaus/groovy/groovy-eclipse-batch/2.2.1-01-SNAPSHOT/maven-metadata.xml
Downloading: http://repository.codehaus.org/org/codehaus/groovy/groovy-eclipse-batch/2.2.1-01-SNAPSHOT/maven-metadata.xml
[WARNING] Could not transfer metadata org.codehaus.groovy:groovy-eclipse-batch:2.2.1-01-SNAPSHOT/maven-metadata.xml from/to codehaus.org (http://repository.codehaus.org): repository.codehaus.org
[WARNING] Could not transfer metadata org.codehaus.groovy:groovy-eclipse-batch:2.2.1-01-SNAPSHOT/maven-metadata.xml from/to codehaus-snapshots (http://nexus.codehaus.org/snapshots/): nexus.codehaus.org
Downloading: http://repository.codehaus.org/org/codehaus/groovy/groovy-eclipse-batch/2.3.0-01-SNAPSHOT/maven-metadata.xml
Downloading: http://nexus.codehaus.org/snapshots/org/codehaus/groovy/groovy-eclipse-batch/2.3.0-01-SNAPSHOT/maven-metadata.xml
[WARNING] Could not transfer metadata org.codehaus.groovy:groovy-eclipse-batch:2.3.0-01-SNAPSHOT/maven-metadata.xml from/to codehaus.org (http://repository.codehaus.org): repository.codehaus.org
[WARNING] Could not transfer metadata org.codehaus.groovy:groovy-eclipse-batch:2.3.0-01-SNAPSHOT/maven-metadata.xml from/to codehaus-snapshots (http://nexus.codehaus.org/snapshots/): nexus.codehaus.org
Downloading: http://nexus.codehaus.org/snapshots/org/codehaus/groovy/groovy-eclipse-batch/2.3.1-01-SNAPSHOT/maven-metadata.xml
Downloading: http://repository.codehaus.org/org/codehaus/groovy/groovy-eclipse-batch/2.3.1-01-SNAPSHOT/maven-metadata.xml
[WARNING] Could not transfer metadata org.codehaus.groovy:groovy-eclipse-batch:2.3.1-01-SNAPSHOT/maven-metadata.xml from/to codehaus.org (http://repository.codehaus.org): repository.codehaus.org
[WARNING] Could not transfer metadata org.codehaus.groovy:groovy-eclipse-batch:2.3.1-01-SNAPSHOT/maven-metadata.xml from/to codehaus-snapshots (http://nexus.codehaus.org/snapshots/): nexus.codehaus.org
Downloading: http://nexus.codehaus.org/snapshots/org/codehaus/groovy/groovy-eclipse-batch/2.3.2-01-SNAPSHOT/maven-metadata.xml
Downloading: http://repository.codehaus.org/org/codehaus/groovy/groovy-eclipse-batch/2.3.2-01-SNAPSHOT/maven-metadata.xml
[WARNING] Could not transfer metadata org.codehaus.groovy:groovy-eclipse-batch:2.3.2-01-SNAPSHOT/maven-metadata.xml from/to codehaus.org (http://repository.codehaus.org): repository.codehaus.org
[WARNING] Could not transfer metadata org.codehaus.groovy:groovy-eclipse-batch:2.3.2-01-SNAPSHOT/maven-metadata.xml from/to codehaus-snapshots (http://nexus.codehaus.org/snapshots/): nexus.codehaus.org
Downloading: http://repository.codehaus.org/org/codehaus/groovy/groovy-eclipse-batch/2.3.3-01-SNAPSHOT/maven-metadata.xml
Downloading: http://nexus.codehaus.org/snapshots/org/codehaus/groovy/groovy-eclipse-batch/2.3.3-01-SNAPSHOT/maven-metadata.xml
[WARNING] Could not transfer metadata org.codehaus.groovy:groovy-eclipse-batch:2.3.3-01-SNAPSHOT/maven-metadata.xml from/to codehaus.org (http://repository.codehaus.org): repository.codehaus.org
[WARNING] Could not transfer metadata org.codehaus.groovy:groovy-eclipse-batch:2.3.3-01-SNAPSHOT/maven-metadata.xml from/to codehaus-snapshots (http://nexus.codehaus.org/snapshots/): nexus.codehaus.org
Downloading: http://nexus.codehaus.org/snapshots/org/codehaus/groovy/groovy-eclipse-batch/2.3.4-01-SNAPSHOT/maven-metadata.xml
Downloading: http://repository.codehaus.org/org/codehaus/groovy/groovy-eclipse-batch/2.3.4-01-SNAPSHOT/maven-metadata.xml
[WARNING] Could not transfer metadata org.codehaus.groovy:groovy-eclipse-batch:2.3.4-01-SNAPSHOT/maven-metadata.xml from/to codehaus.org (http://repository.codehaus.org): repository.codehaus.org
[WARNING] Could not transfer metadata org.codehaus.groovy:groovy-eclipse-batch:2.3.4-01-SNAPSHOT/maven-metadata.xml from/to codehaus-snapshots (http://nexus.codehaus.org/snapshots/): nexus.codehaus.org
[INFO]                                                                         
[INFO] ------------------------------------------------------------------------
[INFO] Building iTest: system and integration testing in the cloud 1.2.0-SNAPSHOT
[INFO] ------------------------------------------------------------------------
[INFO] 
[INFO] --- maven-clean-plugin:2.4.1:clean (default-clean) @ itest-common ---
[INFO] Deleting <https://builds.apache.org/job/Bigtop-trunk-iTest/ws/bigtop-test-framework/target>
[INFO] 
[INFO] --- groovy-eclipse-compiler:2.8.0-01:add-groovy-build-paths (default-add-groovy-build-paths) @ itest-common ---
[WARNING] Failure to transfer org.codehaus.groovy:groovy-eclipse-batch/maven-metadata.xml from http://repository.codehaus.org was cached in the local repository, resolution will not be reattempted until the update interval of codehaus.org has elapsed or updates are forced. Original error: Could not transfer metadata org.codehaus.groovy:groovy-eclipse-batch/maven-metadata.xml from/to codehaus.org (http://repository.codehaus.org): repository.codehaus.org
[WARNING] Failure to transfer org.codehaus.groovy:groovy-eclipse-batch/maven-metadata.xml from http://nexus.codehaus.org/snapshots/ was cached in the local repository, resolution will not be reattempted until the update interval of codehaus-snapshots has elapsed or updates are forced. Original error: Could not transfer metadata org.codehaus.groovy:groovy-eclipse-batch/maven-metadata.xml from/to codehaus-snapshots (http://nexus.codehaus.org/snapshots/): nexus.codehaus.org
[INFO] Adding /src/main/groovy to the list of source folders
[INFO] Adding /src/test/groovy to the list of test source folders
[INFO] 
[INFO] --- maven-remote-resources-plugin:1.1:process (default) @ itest-common ---
[INFO] Setting property: classpath.resource.loader.class => 'org.codehaus.plexus.velocity.ContextClassLoaderResourceLoader'.
[INFO] Setting property: velocimacro.messages.on => 'false'.
[INFO] Setting property: resource.loader => 'classpath'.
[INFO] Setting property: resource.manager.logwhenfound => 'false'.
[INFO] 
[INFO] --- maven-resources-plugin:2.4:resources (default-resources) @ itest-common ---
[INFO] Using 'UTF-8' encoding to copy filtered resources.
[INFO] skip non existing resourceDirectory <https://builds.apache.org/job/Bigtop-trunk-iTest/ws/bigtop-test-framework/src/main/resources>
[INFO] Copying 3 resources
[INFO] 
[INFO] --- maven-compiler-plugin:3.1:compile (default-compile) @ itest-common ---
[INFO] Changes detected - recompiling the module!
[INFO] Using Groovy-Eclipse compiler to compile both Java and Groovy files
[INFO] 
[INFO] --- maven-resources-plugin:2.4:testResources (default-testResources) @ itest-common ---
[INFO] Using 'UTF-8' encoding to copy filtered resources.
[INFO] skip non existing resourceDirectory <https://builds.apache.org/job/Bigtop-trunk-iTest/ws/bigtop-test-framework/src/test/resources>
[INFO] Copying 3 resources
[INFO] 
[INFO] --- maven-compiler-plugin:3.1:testCompile (default-testCompile) @ itest-common ---
[INFO] Changes detected - recompiling the module!
[INFO] Using Groovy-Eclipse compiler to compile both Java and Groovy files
[INFO] 
[INFO] --- maven-surefire-plugin:2.7:test (default-test) @ itest-common ---
[INFO] Surefire report directory: <https://builds.apache.org/job/Bigtop-trunk-iTest/ws/bigtop-test-framework/target/surefire-reports>

-------------------------------------------------------
 T E S T S
-------------------------------------------------------
Running org.apache.bigtop.itest.TestContractJavaProc
Tests run: 2, Failures: 0, Errors: 0, Skipped: 0, Time elapsed: 0.055 sec
Running org.apache.bigtop.itest.pmanager.PackageManagerTest
/etc/cron.weekly/.placeholder
/etc/init/cron.conf
/etc/cron.hourly/.placeholder
/etc/cron.monthly/.placeholder
/etc/default/cron
/etc/pam.d/cron
/etc/cron.daily/.placeholder
/etc/cron.daily/standard
/etc/cron.d/.placeholder
/etc/crontab
/.
/var
/var/spool
/var/spool/cron
/var/spool/cron/crontabs
/usr
/usr/sbin
/usr/sbin/cron
/usr/bin
/usr/bin/crontab
/usr/share
/usr/share/bug
/usr/share/bug/cron
/usr/share/bug/cron/control
/usr/share/bug/cron/script
/usr/share/doc
/usr/share/doc/cron
/usr/share/doc/cron/README
/usr/share/doc/cron/THANKS
/usr/share/doc/cron/TODO.Debian
/usr/share/doc/cron/changelog.Debian.gz
/usr/share/doc/cron/README.Debian
/usr/share/doc/cron/copyright
/usr/share/doc/cron/README.anacron
/usr/share/doc/cron/examples
/usr/share/doc/cron/examples/cron-stats.pl
/usr/share/doc/cron/examples/crontab2english.pl
/usr/share/doc/cron/examples/cron-tasks-review.sh
/usr/share/doc/cron/NEWS.Debian.gz
/usr/share/doc/cron/FEATURES
/usr/share/man
/usr/share/man/man1
/usr/share/man/man1/crontab.1.gz
/usr/share/man/man5
/usr/share/man/man5/crontab.5.gz
/usr/share/man/man8
/usr/share/man/man8/cron.8.gz
/etc
/etc/cron.weekly
/etc/cron.weekly/.placeholder
/etc/init.d
/etc/init
/etc/init/cron.conf
/etc/cron.hourly
/etc/cron.hourly/.placeholder
/etc/cron.monthly
/etc/cron.monthly/.placeholder
/etc/default
/etc/default/cron
/etc/pam.d
/etc/pam.d/cron
/etc/cron.daily
/etc/cron.daily/.placeholder
/etc/cron.daily/standard
/etc/cron.d
/etc/cron.d/.placeholder
/etc/crontab
/etc/init.d/cron
Tests run: 11, Failures: 0, Errors: 0, Skipped: 0, Time elapsed: 4.058 sec
Running org.apache.bigtop.itest.JarContentTest
log4j:WARN No appenders could be found for logger (org.apache.bigtop.itest.JarContent).
log4j:WARN Please initialize the log4j system properly.
Tests run: 6, Failures: 0, Errors: 0, Skipped: 0, Time elapsed: 1.247 sec
Running org.apache.bigtop.itest.JUnitUtilsTest
Disclaimer: This test expected to show a failure in an embeded testcase
    [junit] Running org.apache.bigtop.itest.DummyTestPassTests run: 1, Failures: 0, Errors: 0, Time elapsed: 0.254 secRunning org.apache.bigtop.itest.DummyTestFail
    [junit] Tests run: 1, Failures: 1, Errors: 0, Time elapsed: 0.135 secTEST org.apache.bigtop.itest.DummyTestFail FAILED
    [junit] Tests FAILED
Disclaimer: This test expected to show an error in an embeded testcase
    [junit] Running org.apache.bigtop.itest.DummyTestError
    [junit] Tests run: 1, Failures: 0, Errors: 1, Time elapsed: 0.267 sec
    [junit] Test org.apache.bigtop.itest.DummyTestError FAILED
    [junit] Running org.apache.bigtop.itest.DummyTestPass
    [junit] Tests run: 1, Failures: 0, Errors: 0, Time elapsed: 0.318 sec
    [junit] Running org.apache.bigtop.itest.DummyTestPass
    [junit] Tests run: 1, Failures: 0, Errors: 0, Time elapsed: 0.276 sec
Tests run: 4, Failures: 0, Errors: 0, Skipped: 0, Time elapsed: 4.613 sec
Running org.apache.bigtop.itest.TestContractGroovy
Tests run: 2, Failures: 0, Errors: 0, Skipped: 0, Time elapsed: 0.028 sec
Running org.apache.bigtop.itest.posix.AlternativeTest
Tests run: 1, Failures: 0, Errors: 0, Skipped: 0, Time elapsed: 1.578 sec
Running org.apache.bigtop.itest.posix.UGITest
Tests run: 2, Failures: 0, Errors: 0, Skipped: 0, Time elapsed: 0.031 sec
Running org.apache.bigtop.itest.posix.ServiceTest
Status []
Tests run: 2, Failures: 0, Errors: 0, Skipped: 1, Time elapsed: 0.093 sec
Running org.apache.bigtop.itest.TestContractJava
Tests run: 2, Failures: 0, Errors: 0, Skipped: 0, Time elapsed: 0.001 sec
Running org.apache.bigtop.itest.shell.ShellTest
Tests run: 2, Failures: 0, Errors: 0, Skipped: 0, Time elapsed: 0.02 sec
Running org.apache.bigtop.itest.junit.OrderedParameterizedTest
Tests run: 3, Failures: 0, Errors: 0, Skipped: 0, Time elapsed: 0.038 sec
Running org.apache.bigtop.itest.junit.OrderedTest
Tests run: 3, Failures: 0, Errors: 0, Skipped: 0, Time elapsed: 0.008 sec
Running org.apache.bigtop.itest.TestListUtilsTest
Tests run: 1, Failures: 0, Errors: 0, Skipped: 0, Time elapsed: 0.015 sec

Results :

Tests run: 41, Failures: 0, Errors: 0, Skipped: 1

[JENKINS] Recording test results
log4j:WARN No appenders could be found for logger (org.apache.commons.beanutils.converters.BooleanConverter).
log4j:WARN Please initialize the log4j system properly.
[INFO] 
[INFO] --- maven-jar-plugin:2.2:jar (default-jar) @ itest-common ---
[INFO] Building jar: <https://builds.apache.org/job/Bigtop-trunk-iTest/ws/bigtop-test-framework/target/itest-common-1.2.0-SNAPSHOT.jar>
[INFO] 
[INFO] --- maven-jar-plugin:2.2:test-jar (default) @ itest-common ---
[INFO] Building jar: <https://builds.apache.org/job/Bigtop-trunk-iTest/ws/bigtop-test-framework/target/itest-common-1.2.0-SNAPSHOT-tests.jar>
[INFO] 
[INFO] --- maven-failsafe-plugin:2.17:verify (default) @ itest-common ---
[INFO] Tests are skipped.
[JENKINS] Recording test results
[INFO] 
[INFO] --- maven-install-plugin:2.3:install (default-install) @ itest-common ---
[INFO] Installing <https://builds.apache.org/job/Bigtop-trunk-iTest/ws/bigtop-test-framework/target/itest-common-1.2.0-SNAPSHOT.jar> to /home/jenkins/jenkins-slave/maven-repositories/1/org/apache/bigtop/itest/itest-common/1.2.0-SNAPSHOT/itest-common-1.2.0-SNAPSHOT.jar
[INFO] Installing <https://builds.apache.org/job/Bigtop-trunk-iTest/ws/bigtop-test-framework/pom.xml> to /home/jenkins/jenkins-slave/maven-repositories/1/org/apache/bigtop/itest/itest-common/1.2.0-SNAPSHOT/itest-common-1.2.0-SNAPSHOT.pom
[INFO] Installing <https://builds.apache.org/job/Bigtop-trunk-iTest/ws/bigtop-test-framework/target/itest-common-1.2.0-SNAPSHOT-tests.jar> to /home/jenkins/jenkins-slave/maven-repositories/1/org/apache/bigtop/itest/itest-common/1.2.0-SNAPSHOT/itest-common-1.2.0-SNAPSHOT-tests.jar
[INFO] 
[INFO] --- maven-deploy-plugin:2.5:deploy (default-deploy) @ itest-common ---
Downloading: https://repository.apache.org/content/repositories/snapshots/org/apache/bigtop/itest/itest-common/1.2.0-SNAPSHOT/maven-metadata.xml
[WARNING] Could not transfer metadata org.apache.bigtop.itest:itest-common:1.2.0-SNAPSHOT/maven-metadata.xml from/to apache.snapshots.https (https://repository.apache.org/content/repositories/snapshots): java.lang.RuntimeException: Could not generate DH keypair
[INFO] ------------------------------------------------------------------------
[INFO] BUILD FAILURE
[INFO] ------------------------------------------------------------------------
[INFO] Total time: 30.301s
[INFO] Finished at: Sat Feb 20 16:29:35 UTC 2016
[INFO] Final Memory: 16M/244M
[INFO] ------------------------------------------------------------------------
Waiting for Jenkins to finish collecting data
[ERROR] Failed to execute goal org.apache.maven.plugins:maven-deploy-plugin:2.5:deploy (default-deploy) on project itest-common: Failed to retrieve remote metadata org.apache.bigtop.itest:itest-common:1.2.0-SNAPSHOT/maven-metadata.xml: Could not transfer metadata org.apache.bigtop.itest:itest-common:1.2.0-SNAPSHOT/maven-metadata.xml from/to apache.snapshots.https (https://repository.apache.org/content/repositories/snapshots): java.lang.RuntimeException: Could not generate DH keypair: Prime size must be multiple of 64, and can only range from 512 to 1024 (inclusive) -> [Help 1]
[ERROR] 
[ERROR] To see the full stack trace of the errors, re-run Maven with the -e switch.
[ERROR] Re-run Maven using the -X switch to enable full debug logging.
[ERROR] 
[ERROR] For more information about the errors and possible solutions, please read the following articles:
[ERROR] [Help 1] http://cwiki.apache.org/confluence/display/MAVEN/MojoExecutionException
[JENKINS] Archiving <https://builds.apache.org/job/Bigtop-trunk-iTest/ws/bigtop-test-framework/pom.xml> to org.apache.bigtop.itest/itest-common/1.2.0-SNAPSHOT/itest-common-1.2.0-SNAPSHOT.pom
[JENKINS] Archiving <https://builds.apache.org/job/Bigtop-trunk-iTest/ws/bigtop-test-framework/target/itest-common-1.2.0-SNAPSHOT.jar> to org.apache.bigtop.itest/itest-common/1.2.0-SNAPSHOT/itest-common-1.2.0-SNAPSHOT.jar
[JENKINS] Archiving <https://builds.apache.org/job/Bigtop-trunk-iTest/ws/bigtop-test-framework/target/itest-common-1.2.0-SNAPSHOT-tests.jar> to org.apache.bigtop.itest/itest-common/1.2.0-SNAPSHOT/itest-common-1.2.0-SNAPSHOT-tests.jar
Sending e-mails to: ci@bigtop.apache.org
channel stopped