You are viewing a plain text version of this content. The canonical link for it is here.
Posted to dev@ace.apache.org by Apache Jenkins Server <je...@builds.apache.org> on 2014/03/05 17:51:11 UTC
Build failed in Jenkins: ACE-trunk #215
See <https://builds.apache.org/job/ACE-trunk/215/changes>
Changes:
[Jan Willem Janssen] Reverted accidentally checked in change.
[Jan Willem Janssen] Added time function to time the total execution time of other functions.
------------------------------------------
[...truncated 3122 lines...]
template.init:
[echo] Enter project org.apache.ace.configurator
init:
dependencies:
compile:
test:
template.init:
[echo] Enter project org.apache.ace.authentication.itest
init:
dependencies:
compile:
test:
[bndtest] Testing /zonestorage/hudson_solaris/home/hudson/hudson-slave/workspace/ACE-trunk/org.apache.ace.authentication.itest/bnd.bnd
[bndtest] 2014-03-05 16:48:24.298:INFO:oejs.Server:jetty-7.x.y-SNAPSHOT
[bndtest] 2014-03-05 16:48:24.333:INFO:oejsh.ContextHandler:started o.e.j.s.ServletContextHandler{/,null}
[bndtest] 2014-03-05 16:48:24.361:INFO:oejs.AbstractConnector:Started SelectChannelConnector@0.0.0.0:8080
[bndtest] ____________________________
[bndtest] Welcome to Apache Felix Gogo
[bndtest]
[bndtest] Got response code 401 for http://localhost:8080/auditlog
[bndtest] Got response code 401 for http://localhost:8080/auditlog
[bndtest] Got response code 404 for http://localhost:8080/obr/repository.xml
[bndtest] Bundle Indexer | v2.2
[bndtest] (c) 2007 OSGi, All Rights Reserved
[bndtest] Got response code 401 for http://localhost:8080/obr/repository.xml
[bndtest] Got response code 404 for http://localhost:8080/obr/repository.xml
[bndtest] Bundle Indexer | v2.2
[bndtest] (c) 2007 OSGi, All Rights Reserved
[bndtest] Got response code 401 for http://localhost:8080/obr/repository.xml
[bndtest] Got response code 401 for http://localhost:8080/obr/repository.xml
[bndtest] Bundle Indexer | v2.2
[bndtest] (c) 2007 OSGi, All Rights Reserved
[bndtest] Got response code 401 for http://localhost:8080/obr/repository.xml
[bndtest] Bundle Indexer | v2.2
[bndtest] (c) 2007 OSGi, All Rights Reserved
[bndtest] Got response code 401 for http://localhost:8080/obr/repository.xml
[bndtest] Bundle Indexer | v2.2
[bndtest] (c) 2007 OSGi, All Rights Reserved
[bndtest] Tests run : 7
[bndtest] Passed : 7
[bndtest] Errors : 0
[bndtest] Failures : 0
[bndtest] All tests passed
template.init:
[echo] Enter project org.apache.ace.bnd
init:
dependencies:
compile:
test:
template.init:
[echo] Enter project org.apache.ace.client.automation
init:
dependencies:
compile:
test:
template.init:
[echo] Enter project org.apache.ace.client.repository.itest
init:
dependencies:
compile:
test:
[bndtest] Testing /zonestorage/hudson_solaris/home/hudson/hudson-slave/workspace/ACE-trunk/org.apache.ace.client.repository.itest/bnd.bnd
[bndtest] 2014-03-05 16:48:37.728:INFO:oejs.Server:jetty-7.x.y-SNAPSHOT
[bndtest] 2014-03-05 16:48:37.765:INFO:oejsh.ContextHandler:started o.e.j.s.ServletContextHandler{/,null}
[bndtest] 2014-03-05 16:48:37.845:INFO:oejs.AbstractConnector:Started SelectChannelConnector@0.0.0.0:8080
[bndtest] ____________________________
[bndtest] Welcome to Apache Felix Gogo
[bndtest]
[bndtest] Bundle Indexer | v2.2
[bndtest] (c) 2007 OSGi, All Rights Reserved
[bndtest] Bundle Indexer | v2.2
[bndtest] (c) 2007 OSGi, All Rights Reserved
[bndtest] Tests run : 20
[bndtest] Passed : 20
[bndtest] Errors : 0
[bndtest] Failures : 0
[bndtest] All tests passed
template.init:
[echo] Enter project org.apache.ace.client.workspace
init:
dependencies:
compile:
test:
template.init:
[echo] Enter project org.apache.ace.client.rest
init:
dependencies:
compile:
test:
template.init:
[echo] Enter project org.apache.ace.client.rest.itest
init:
dependencies:
compile:
test:
[bndtest] Testing /zonestorage/hudson_solaris/home/hudson/hudson-slave/workspace/ACE-trunk/org.apache.ace.client.rest.itest/bnd.bnd
[bndtest] 2014-03-05 16:49:01.979:INFO:oejs.Server:jetty-7.x.y-SNAPSHOT
[bndtest] 2014-03-05 16:49:02.056:INFO:oejsh.ContextHandler:started o.e.j.s.ServletContextHandler{/,null}
[bndtest] 2014-03-05 16:49:02.089:INFO:oejs.AbstractConnector:Started SelectChannelConnector@0.0.0.0:8080
[bndtest] ____________________________
[bndtest] Welcome to Apache Felix Gogo
[bndtest]
[bndtest] g! store: /zonestorage/hudson_solaris/home/hudson/hudson-slave/workspace/ACE-trunk/build/generated/store
[bndtest] Bundle Indexer | v2.2
[bndtest] (c) 2007 OSGi, All Rights Reserved
[bndtest] http://localhost:8080/client/work/rest-43/artifact/artifact-Bundle-SymbolicName-foo.b1-Bundle-Version-1.0.0
[bndtest] http://localhost:8080/client/work/rest-43/artifact/artifact-Bundle-SymbolicName-foo.b2-Bundle-Version-1.0.0
[bndtest] http://localhost:8080/client/work/rest-43/artifact/artifact-Bundle-SymbolicName-foo.b3-Bundle-Version-1.0.0
[bndtest] http://localhost:8080/client/work/rest-43/artifact2feature/artifact2feature-leftEndpoint-%28artifactName%3Dfoo.a1%29-rightEndpoint-%28name%3Dfoo.f1%29-rightCardinality-1-leftCardinality-1
[bndtest] http://localhost:8080/client/work/rest-43/artifact2feature/artifact2feature-leftEndpoint-%28artifactName%3Dfoo.a2%29-rightEndpoint-%28name%3Dfoo.f2%29-rightCardinality-1-leftCardinality-1
[bndtest] http://localhost:8080/client/work/rest-43/artifact2feature/artifact2feature-leftEndpoint-%28artifactName%3Dfoo.a3%29-rightEndpoint-%28name%3Dfoo.f3%29-rightCardinality-1-leftCardinality-1
[bndtest] http://localhost:8080/client/work/rest-43/feature/feature-name-foo.f1
[bndtest] http://localhost:8080/client/work/rest-43/feature/feature-name-foo.f2
[bndtest] http://localhost:8080/client/work/rest-43/feature/feature-name-foo.f3
[bndtest] http://localhost:8080/client/work/rest-43/feature2distribution/feature2distribution-leftEndpoint-%28name%3Dfoo.f1%29-rightEndpoint-%28name%3Dfoo.d1%29-rightCardinality-1-leftCardinality-1
[bndtest] http://localhost:8080/client/work/rest-43/feature2distribution/feature2distribution-leftEndpoint-%28name%3Dfoo.f2%29-rightEndpoint-%28name%3Dfoo.d1%29-rightCardinality-1-leftCardinality-1
[bndtest] http://localhost:8080/client/work/rest-43/feature2distribution/feature2distribution-leftEndpoint-%28name%3Dfoo.f3%29-rightEndpoint-%28name%3Dfoo.d1%29-rightCardinality-1-leftCardinality-1
[bndtest] http://localhost:8080/client/work/rest-43/distribution/distribution-name-foo.d1
[bndtest] http://localhost:8080/client/work/rest-43/distribution2target/distribution2target-leftEndpoint-%28name%3Dfoo.d1%29-rightEndpoint-%28id%3Dfoo.t1%29-rightCardinality-1-leftCardinality-1
[bndtest] http://localhost:8080/client/work/rest-43/target/target-id-foo.t1
[bndtest] Tests run : 5
[bndtest] Passed : 5
[bndtest] Errors : 0
[bndtest] Failures : 0
[bndtest] All tests passed
template.init:
[echo] Enter project org.apache.ace.configurator.useradmin.itest
init:
dependencies:
compile:
test:
[bndtest] Testing /zonestorage/hudson_solaris/home/hudson/hudson-slave/workspace/ACE-trunk/org.apache.ace.configurator.useradmin.itest/bnd.bnd
[bndtest] 2014-03-05 16:49:33.634:INFO:oejs.Server:jetty-7.x.y-SNAPSHOT
[bndtest] 2014-03-05 16:49:33.664:INFO:oejsh.ContextHandler:started o.e.j.s.ServletContextHandler{/,null}
[bndtest] 2014-03-05 16:49:33.692:INFO:oejs.AbstractConnector:Started SelectChannelConnector@0.0.0.0:8080
[bndtest] Tests run : 1
[bndtest] Passed : 0
[bndtest] Errors : 0
[bndtest] Failures : 1
[bndtest] 1 Error(s)
[bndtest] Tests failed
[bndtest] at aQute.bnd.ant.TestTask.executeProject(TestTask.java:78)
[bndtest] at aQute.bnd.ant.TestTask.execute(TestTask.java:49)
[bndtest] at org.apache.tools.ant.UnknownElement.execute(UnknownElement.java:291)
[bndtest] at sun.reflect.GeneratedMethodAccessor4.invoke(Unknown Source)
[bndtest] at sun.reflect.DelegatingMethodAccessorImpl.invoke(DelegatingMethodAccessorImpl.java:25)
[bndtest] at java.lang.reflect.Method.invoke(Method.java:597)
[bndtest] at org.apache.tools.ant.dispatch.DispatchUtils.execute(DispatchUtils.java:106)
[bndtest] at org.apache.tools.ant.Task.perform(Task.java:348)
[bndtest] at org.apache.tools.ant.Target.execute(Target.java:390)
[bndtest] at org.apache.tools.ant.Target.performTasks(Target.java:411)
[bndtest] at org.apache.tools.ant.Project.executeSortedTargets(Project.java:1399)
[bndtest] at org.apache.tools.ant.helper.SingleCheckExecutor.executeTargets(SingleCheckExecutor.java:38)
[bndtest] at org.apache.tools.ant.Project.executeTargets(Project.java:1251)
[bndtest] at org.apache.tools.ant.taskdefs.Ant.execute(Ant.java:442)
[bndtest] at org.apache.tools.ant.taskdefs.SubAnt.execute(SubAnt.java:302)
[bndtest] at org.apache.tools.ant.taskdefs.SubAnt.execute(SubAnt.java:221)
[bndtest] at org.apache.tools.ant.UnknownElement.execute(UnknownElement.java:291)
[bndtest] at sun.reflect.GeneratedMethodAccessor4.invoke(Unknown Source)
[bndtest] at sun.reflect.DelegatingMethodAccessorImpl.invoke(DelegatingMethodAccessorImpl.java:25)
[bndtest] at java.lang.reflect.Method.invoke(Method.java:597)
[bndtest] at org.apache.tools.ant.dispatch.DispatchUtils.execute(DispatchUtils.java:106)
[bndtest] at org.apache.tools.ant.Task.perform(Task.java:348)
[bndtest] at org.apache.tools.ant.Target.execute(Target.java:390)
[bndtest] at org.apache.tools.ant.Target.performTasks(Target.java:411)
[bndtest] at org.apache.tools.ant.Project.executeSortedTargets(Project.java:1399)
[bndtest] at org.apache.tools.ant.Project.executeTarget(Project.java:1368)
[bndtest] at org.apache.tools.ant.helper.DefaultExecutor.executeTargets(DefaultExecutor.java:41)
[bndtest] at org.apache.tools.ant.Project.executeTargets(Project.java:1251)
[bndtest] at org.apache.tools.ant.Main.runBuild(Main.java:809)
[bndtest] at org.apache.tools.ant.Main.startAnt(Main.java:217)
[bndtest] at org.apache.tools.ant.launch.Launcher.run(Launcher.java:280)
[bndtest] at org.apache.tools.ant.launch.Launcher.main(Launcher.java:109)
BUILD FAILED
/zonestorage/hudson_solaris/home/hudson/hudson-slave/workspace/ACE-trunk/cnf/build.xml:55: The following error occurred while executing this line:
/zonestorage/hudson_solaris/home/hudson/hudson-slave/workspace/ACE-trunk/cnf/build-template.xml:67: Tests failed
Total time: 16 minutes 16 seconds
Build step 'Invoke Ant' marked build as failure
Recording test results
TestNG Reports Processing: START
Looking for TestNG results report in workspace using pattern: **/testng/testng-results.xml
Saving reports...
Processing '/x1/jenkins/jenkins-home/jobs/ACE-trunk/builds/2014-03-05_16-32-45/testng/testng-results-1.xml'
Processing '/x1/jenkins/jenkins-home/jobs/ACE-trunk/builds/2014-03-05_16-32-45/testng/testng-results-10.xml'
Processing '/x1/jenkins/jenkins-home/jobs/ACE-trunk/builds/2014-03-05_16-32-45/testng/testng-results-11.xml'
Processing '/x1/jenkins/jenkins-home/jobs/ACE-trunk/builds/2014-03-05_16-32-45/testng/testng-results-12.xml'
Processing '/x1/jenkins/jenkins-home/jobs/ACE-trunk/builds/2014-03-05_16-32-45/testng/testng-results-13.xml'
Processing '/x1/jenkins/jenkins-home/jobs/ACE-trunk/builds/2014-03-05_16-32-45/testng/testng-results-14.xml'
Processing '/x1/jenkins/jenkins-home/jobs/ACE-trunk/builds/2014-03-05_16-32-45/testng/testng-results-15.xml'
Processing '/x1/jenkins/jenkins-home/jobs/ACE-trunk/builds/2014-03-05_16-32-45/testng/testng-results-16.xml'
Processing '/x1/jenkins/jenkins-home/jobs/ACE-trunk/builds/2014-03-05_16-32-45/testng/testng-results-17.xml'
Processing '/x1/jenkins/jenkins-home/jobs/ACE-trunk/builds/2014-03-05_16-32-45/testng/testng-results-18.xml'
Processing '/x1/jenkins/jenkins-home/jobs/ACE-trunk/builds/2014-03-05_16-32-45/testng/testng-results-19.xml'
Processing '/x1/jenkins/jenkins-home/jobs/ACE-trunk/builds/2014-03-05_16-32-45/testng/testng-results-2.xml'
Processing '/x1/jenkins/jenkins-home/jobs/ACE-trunk/builds/2014-03-05_16-32-45/testng/testng-results-3.xml'
Processing '/x1/jenkins/jenkins-home/jobs/ACE-trunk/builds/2014-03-05_16-32-45/testng/testng-results-4.xml'
Processing '/x1/jenkins/jenkins-home/jobs/ACE-trunk/builds/2014-03-05_16-32-45/testng/testng-results-5.xml'
Processing '/x1/jenkins/jenkins-home/jobs/ACE-trunk/builds/2014-03-05_16-32-45/testng/testng-results-6.xml'
Processing '/x1/jenkins/jenkins-home/jobs/ACE-trunk/builds/2014-03-05_16-32-45/testng/testng-results-7.xml'
Processing '/x1/jenkins/jenkins-home/jobs/ACE-trunk/builds/2014-03-05_16-32-45/testng/testng-results-8.xml'
Processing '/x1/jenkins/jenkins-home/jobs/ACE-trunk/builds/2014-03-05_16-32-45/testng/testng-results-9.xml'
Processing '/x1/jenkins/jenkins-home/jobs/ACE-trunk/builds/2014-03-05_16-32-45/testng/testng-results.xml'
TestNG Reports Processing: FINISH
Build failed in Jenkins: ACE-trunk #217
Posted by Apache Jenkins Server <je...@builds.apache.org>.
See <https://builds.apache.org/job/ACE-trunk/217/changes>
Changes:
[marrs] ACE-424 Deleted the management agent project.
[marrs] ACE-424 Removed the project from the central build.
[marrs] Renamed member to comply with coding standard.
------------------------------------------
Started by an SCM change
Building remotely on solaris1 in workspace <https://builds.apache.org/job/ACE-trunk/ws/>
Updating https://svn.apache.org/repos/asf/ace/trunk at revision '2014-03-06T09:35:38.647 +0000'
D org.apache.ace.managementagent
U build/bnd.bnd
U org.apache.ace.client.rest/src/org/apache/ace/client/rest/RESTClientServlet.java
U org.apache.ace.client.rest/src/org/apache/ace/client/rest/RepositoryValueObject.java
At revision 1574817
[build] $ /home/hudson/tools/ant/latest/bin/ant -file build.xml deepclean deeptestng deeptest
Buildfile: /zonestorage/hudson_solaris/home/hudson/hudson-slave/workspace/ACE-trunk/build/build.xml
template.init:
[echo] Enter project build
init:
clean:
[bnd] Warnings
[bnd] org.apache.ace.log.itest:Multiple bundles with the same final URL: /zonestorage/hudson_solaris/home/hudson/hudson-slave/workspace/ACE-trunk/org.apache.ace.feedback.common/generated/org.apache.ace.feedback.common.jar, dropped duplicate
[bnd] 1 Errors
[bnd] org.apache.ace.deployment.rp.autoconf.itest:org.apache.ace.managementagent;version=latest Not found in [bnd-cache, Release, Local, Library Repository, /zonestorage/hudson_solaris/home/hudson/hudson-slave/workspace/ACE-trunk/cnf/buildrepo r/w=true]
BUILD FAILED
/zonestorage/hudson_solaris/home/hudson/hudson-slave/workspace/ACE-trunk/cnf/build-template.xml:140: Command clean failed
Total time: 5 seconds
Build step 'Invoke Ant' marked build as failure
Recording test results
TestNG Reports Processing: START
Looking for TestNG results report in workspace using pattern: **/testng/testng-results.xml
testng-results.xml was last modified before this build started. Ignoring it.
testng-results.xml was last modified before this build started. Ignoring it.
testng-results.xml was last modified before this build started. Ignoring it.
testng-results.xml was last modified before this build started. Ignoring it.
testng-results.xml was last modified before this build started. Ignoring it.
testng-results.xml was last modified before this build started. Ignoring it.
testng-results.xml was last modified before this build started. Ignoring it.
testng-results.xml was last modified before this build started. Ignoring it.
testng-results.xml was last modified before this build started. Ignoring it.
testng-results.xml was last modified before this build started. Ignoring it.
testng-results.xml was last modified before this build started. Ignoring it.
testng-results.xml was last modified before this build started. Ignoring it.
testng-results.xml was last modified before this build started. Ignoring it.
testng-results.xml was last modified before this build started. Ignoring it.
testng-results.xml was last modified before this build started. Ignoring it.
testng-results.xml was last modified before this build started. Ignoring it.
testng-results.xml was last modified before this build started. Ignoring it.
testng-results.xml was last modified before this build started. Ignoring it.
testng-results.xml was last modified before this build started. Ignoring it.
testng-results.xml was last modified before this build started. Ignoring it.
Saving reports...
Found matching files but did not find any TestNG results.
Build failed in Jenkins: ACE-trunk #216
Posted by Apache Jenkins Server <je...@builds.apache.org>.
See <https://builds.apache.org/job/ACE-trunk/216/changes>
Changes:
[marrs] ACE-458 Applied the patch with some changes: there were more locations where the error messages could benefit from more information.
------------------------------------------
[...truncated 5051 lines...]
test:
template.init:
[echo] Enter project org.apache.ace.repository
init:
dependencies:
compile:
test:
template.init:
[echo] Enter project org.apache.ace.deployment
init:
dependencies:
compile:
test:
template.init:
[echo] Enter project org.apache.ace.http
init:
dependencies:
compile:
test:
template.init:
[echo] Enter project org.apache.ace.log
init:
dependencies:
compile:
test:
template.init:
[echo] Enter project org.apache.ace.agent.update.itest
init:
dependencies:
compile:
test:
[bndtest] Testing <https://builds.apache.org/job/ACE-trunk/ws/org.apache.ace.agent.update.itest/bnd.bnd>
[bndtest] 2014-03-06 08:58:22.816:INFO:oejs.Server:jetty-7.x.y-SNAPSHOT
[bndtest] 2014-03-06 08:58:22.884:INFO:oejsh.ContextHandler:started o.e.j.s.ServletContextHandler{/,null}
[bndtest] 2014-03-06 08:58:23.099:INFO:oejs.AbstractConnector:Started SelectChannelConnector@0.0.0.0:8080
[bndtest] [INFO] Started Jetty 7.6.13.v20130916 at port(s) HTTP:8080 on context path /
[bndtest] Updating in phase: CORRUPT_STREAM
[bndtest] Updating in phase: BUNDLE_DOES_NOT_RESOLVE
[bndtest] Updating in phase: BUNDLE_DOES_NOT_START
[bndtest] [ERROR] 08:58:33 (controller) Deployment update aborted due to Exception.
[bndtest] java.io.IOException: Unable to handle server responsecode: 404, for http://localhost:8080/deployment/defaultTargetID/versions/
[bndtest] at org.apache.ace.agent.impl.ConnectionUtil.checkConnectionResponse(ConnectionUtil.java:67)
[bndtest] at org.apache.ace.agent.impl.UpdateHandlerBase.getAvailableVersions(UpdateHandlerBase.java:60)
[bndtest] at org.apache.ace.agent.impl.DeploymentHandlerImpl.getAvailableVersions(DeploymentHandlerImpl.java:189)
[bndtest] at org.apache.ace.agent.impl.UpdateHandlerBase.getHighestAvailableVersion(UpdateHandlerBase.java:49)
[bndtest] at org.apache.ace.agent.impl.DefaultController$UpdateInstaller.installUpdate(DefaultController.java:238)
[bndtest] at org.apache.ace.agent.impl.DefaultController.runDeploymentUpdate(DefaultController.java:610)
[bndtest] at org.apache.ace.agent.impl.DefaultController.run(DefaultController.java:460)
[bndtest] at org.apache.ace.agent.impl.AgentContextImpl$1.run(AgentContextImpl.java:252)
[bndtest] at java.util.concurrent.Executors$RunnableAdapter.call(Executors.java:439)
[bndtest] at java.util.concurrent.FutureTask$Sync.innerRun(FutureTask.java:303)
[bndtest] at java.util.concurrent.FutureTask.run(FutureTask.java:138)
[bndtest] at java.util.concurrent.ScheduledThreadPoolExecutor$ScheduledFutureTask.access$301(ScheduledThreadPoolExecutor.java:98)
[bndtest] at java.util.concurrent.ScheduledThreadPoolExecutor$ScheduledFutureTask.run(ScheduledThreadPoolExecutor.java:206)
[bndtest] at java.util.concurrent.ThreadPoolExecutor$Worker.runTask(ThreadPoolExecutor.java:895)
[bndtest] at java.util.concurrent.ThreadPoolExecutor$Worker.run(ThreadPoolExecutor.java:918)
[bndtest] at java.lang.Thread.run(Thread.java:662)
[bndtest] Updating in phase: BUNDLE_WORKS
[bndtest] Tests run : 1
[bndtest] Passed : 1
[bndtest] Errors : 0
[bndtest] Failures : 0
[bndtest] All tests passed
template.init:
[echo] Enter project org.apache.ace.ant.tasks
init:
dependencies:
compile:
test:
template.init:
[echo] Enter project org.apache.ace.client.repository
init:
dependencies:
compile:
test:
template.init:
[echo] Enter project org.apache.ace.obr
init:
dependencies:
compile:
test:
template.init:
[echo] Enter project org.apache.ace.resourceprocessor.useradmin
init:
dependencies:
compile:
test:
template.init:
[echo] Enter project org.apache.ace.configurator
init:
dependencies:
compile:
test:
template.init:
[echo] Enter project org.apache.ace.authentication.itest
init:
dependencies:
compile:
test:
[bndtest] Testing <https://builds.apache.org/job/ACE-trunk/ws/org.apache.ace.authentication.itest/bnd.bnd>
[bndtest] 2014-03-06 08:58:44.561:INFO:oejs.Server:jetty-7.x.y-SNAPSHOT
[bndtest] 2014-03-06 08:58:44.670:INFO:oejsh.ContextHandler:started o.e.j.s.ServletContextHandler{/,null}
[bndtest] 2014-03-06 08:58:44.717:INFO:oejs.AbstractConnector:Started SelectChannelConnector@0.0.0.0:8080
[bndtest] ____________________________
[bndtest] Welcome to Apache Felix Gogo
[bndtest]
[bndtest] Bundle Indexer | v2.2
[bndtest] (c) 2007 OSGi, All Rights Reserved
[bndtest] Got response code 401 for http://localhost:8080/obr/repository.xml
[bndtest] Got response code 401 for http://localhost:8080/obr/repository.xml
[bndtest] Bundle Indexer | v2.2
[bndtest] (c) 2007 OSGi, All Rights Reserved
[bndtest] Got response code 401 for http://localhost:8080/obr/repository.xml
[bndtest] Bundle Indexer | v2.2
[bndtest] (c) 2007 OSGi, All Rights Reserved
[bndtest] Got response code 401 for http://localhost:8080/obr/repository.xml
[bndtest] Bundle Indexer | v2.2
[bndtest] (c) 2007 OSGi, All Rights Reserved
[bndtest] Got response code 401 for http://localhost:8080/obr/repository.xml
[bndtest] Bundle Indexer | v2.2
[bndtest] (c) 2007 OSGi, All Rights Reserved
[bndtest] Got response code 404 for http://localhost:8080/auditlog
[bndtest] Got response code 401 for http://localhost:8080/auditlog
[bndtest] Got response code 401 for http://localhost:8080/auditlog
[bndtest] Tests run : 7
[bndtest] Passed : 6
[bndtest] Errors : 0
[bndtest] Failures : 1
[bndtest] 1 Error(s)
[bndtest] Tests failed
[bndtest] at aQute.bnd.ant.TestTask.executeProject(TestTask.java:78)
[bndtest] at aQute.bnd.ant.TestTask.execute(TestTask.java:49)
[bndtest] at org.apache.tools.ant.UnknownElement.execute(UnknownElement.java:291)
[bndtest] at sun.reflect.GeneratedMethodAccessor4.invoke(Unknown Source)
[bndtest] at sun.reflect.DelegatingMethodAccessorImpl.invoke(DelegatingMethodAccessorImpl.java:25)
[bndtest] at java.lang.reflect.Method.invoke(Method.java:597)
[bndtest] at org.apache.tools.ant.dispatch.DispatchUtils.execute(DispatchUtils.java:106)
[bndtest] at org.apache.tools.ant.Task.perform(Task.java:348)
[bndtest] at org.apache.tools.ant.Target.execute(Target.java:390)
[bndtest] at org.apache.tools.ant.Target.performTasks(Target.java:411)
[bndtest] at org.apache.tools.ant.Project.executeSortedTargets(Project.java:1399)
[bndtest] at org.apache.tools.ant.helper.SingleCheckExecutor.executeTargets(SingleCheckExecutor.java:38)
[bndtest] at org.apache.tools.ant.Project.executeTargets(Project.java:1251)
[bndtest] at org.apache.tools.ant.taskdefs.Ant.execute(Ant.java:442)
[bndtest] at org.apache.tools.ant.taskdefs.SubAnt.execute(SubAnt.java:302)
[bndtest] at org.apache.tools.ant.taskdefs.SubAnt.execute(SubAnt.java:221)
[bndtest] at org.apache.tools.ant.UnknownElement.execute(UnknownElement.java:291)
[bndtest] at sun.reflect.GeneratedMethodAccessor4.invoke(Unknown Source)
[bndtest] at sun.reflect.DelegatingMethodAccessorImpl.invoke(DelegatingMethodAccessorImpl.java:25)
[bndtest] at java.lang.reflect.Method.invoke(Method.java:597)
[bndtest] at org.apache.tools.ant.dispatch.DispatchUtils.execute(DispatchUtils.java:106)
[bndtest] at org.apache.tools.ant.Task.perform(Task.java:348)
[bndtest] at org.apache.tools.ant.Target.execute(Target.java:390)
[bndtest] at org.apache.tools.ant.Target.performTasks(Target.java:411)
[bndtest] at org.apache.tools.ant.Project.executeSortedTargets(Project.java:1399)
[bndtest] at org.apache.tools.ant.Project.executeTarget(Project.java:1368)
[bndtest] at org.apache.tools.ant.helper.DefaultExecutor.executeTargets(DefaultExecutor.java:41)
[bndtest] at org.apache.tools.ant.Project.executeTargets(Project.java:1251)
[bndtest] at org.apache.tools.ant.Main.runBuild(Main.java:809)
[bndtest] at org.apache.tools.ant.Main.startAnt(Main.java:217)
[bndtest] at org.apache.tools.ant.launch.Launcher.run(Launcher.java:280)
[bndtest] at org.apache.tools.ant.launch.Launcher.main(Launcher.java:109)
BUILD FAILED
<https://builds.apache.org/job/ACE-trunk/ws/cnf/build.xml>:55: The following error occurred while executing this line:
<https://builds.apache.org/job/ACE-trunk/ws/cnf/build-template.xml>:67: Tests failed
Total time: 9 minutes 22 seconds
Build step 'Invoke Ant' marked build as failure
Recording test results
TestNG Reports Processing: START
Looking for TestNG results report in workspace using pattern: **/testng/testng-results.xml
Saving reports...
Processing '/x1/jenkins/jenkins-home/jobs/ACE-trunk/builds/2014-03-06_08-48-38/testng/testng-results-1.xml'
Processing '/x1/jenkins/jenkins-home/jobs/ACE-trunk/builds/2014-03-06_08-48-38/testng/testng-results-10.xml'
Processing '/x1/jenkins/jenkins-home/jobs/ACE-trunk/builds/2014-03-06_08-48-38/testng/testng-results-11.xml'
Processing '/x1/jenkins/jenkins-home/jobs/ACE-trunk/builds/2014-03-06_08-48-38/testng/testng-results-12.xml'
Processing '/x1/jenkins/jenkins-home/jobs/ACE-trunk/builds/2014-03-06_08-48-38/testng/testng-results-13.xml'
Processing '/x1/jenkins/jenkins-home/jobs/ACE-trunk/builds/2014-03-06_08-48-38/testng/testng-results-14.xml'
Processing '/x1/jenkins/jenkins-home/jobs/ACE-trunk/builds/2014-03-06_08-48-38/testng/testng-results-15.xml'
Processing '/x1/jenkins/jenkins-home/jobs/ACE-trunk/builds/2014-03-06_08-48-38/testng/testng-results-16.xml'
Processing '/x1/jenkins/jenkins-home/jobs/ACE-trunk/builds/2014-03-06_08-48-38/testng/testng-results-17.xml'
Processing '/x1/jenkins/jenkins-home/jobs/ACE-trunk/builds/2014-03-06_08-48-38/testng/testng-results-18.xml'
Processing '/x1/jenkins/jenkins-home/jobs/ACE-trunk/builds/2014-03-06_08-48-38/testng/testng-results-19.xml'
Processing '/x1/jenkins/jenkins-home/jobs/ACE-trunk/builds/2014-03-06_08-48-38/testng/testng-results-2.xml'
Processing '/x1/jenkins/jenkins-home/jobs/ACE-trunk/builds/2014-03-06_08-48-38/testng/testng-results-3.xml'
Processing '/x1/jenkins/jenkins-home/jobs/ACE-trunk/builds/2014-03-06_08-48-38/testng/testng-results-4.xml'
Processing '/x1/jenkins/jenkins-home/jobs/ACE-trunk/builds/2014-03-06_08-48-38/testng/testng-results-5.xml'
Processing '/x1/jenkins/jenkins-home/jobs/ACE-trunk/builds/2014-03-06_08-48-38/testng/testng-results-6.xml'
Processing '/x1/jenkins/jenkins-home/jobs/ACE-trunk/builds/2014-03-06_08-48-38/testng/testng-results-7.xml'
Processing '/x1/jenkins/jenkins-home/jobs/ACE-trunk/builds/2014-03-06_08-48-38/testng/testng-results-8.xml'
Processing '/x1/jenkins/jenkins-home/jobs/ACE-trunk/builds/2014-03-06_08-48-38/testng/testng-results-9.xml'
Processing '/x1/jenkins/jenkins-home/jobs/ACE-trunk/builds/2014-03-06_08-48-38/testng/testng-results.xml'
TestNG Reports Processing: FINISH