You are viewing a plain text version of this content. The canonical link for it is here.
Posted to alerts@harmony.apache.org by Apache Hudson Server <hu...@hudson.apache.org> on 2010/10/29 13:15:12 UTC
Build failed in Hudson: Harmony-1.5-head-linux-x86_64 #999
See <https://hudson.apache.org/hudson/job/Harmony-1.5-head-linux-x86_64/999/changes>
Changes:
[chope] Add fix to allow overriding of the Timestamp class to create an immutable class, by removing a call to a public method in the Timestamp constructor. Regression testcase included.
------------------------------------------
[...truncated 2030 lines...]
[echo] Making "clean" in src/main/native/thrstub/unix
[exec] rm -f <https://hudson.apache.org/hudson/job/Harmony-1.5-head-linux-x86_64/ws/harmony/target/build/classlib/portlib/native/thrstub/hythread.o> <https://hudson.apache.org/hudson/job/Harmony-1.5-head-linux-x86_64/ws/harmony/target/hdk/lib/libhythr.so> <https://hudson.apache.org/hudson/job/Harmony-1.5-head-linux-x86_64/ws/harmony/target/build/classlib/portlib/native/thrstub/libhythr.exp> \
[exec] <https://hudson.apache.org/hudson/job/Harmony-1.5-head-linux-x86_64/ws/harmony/target/hdk/lib/libhythr.so.dbg>
[echo] Making "clean" in src/main/native/port/unix
[exec] rm -f <https://hudson.apache.org/hudson/job/Harmony-1.5-head-linux-x86_64/ws/harmony/target/build/classlib/portlib/native/port/port_copyright.o> <https://hudson.apache.org/hudson/job/Harmony-1.5-head-linux-x86_64/ws/harmony/target/build/classlib/portlib/native/port/hyerror.o> <https://hudson.apache.org/hudson/job/Harmony-1.5-head-linux-x86_64/ws/harmony/target/build/classlib/portlib/native/port/hyerrorhelpers.o> <https://hudson.apache.org/hudson/job/Harmony-1.5-head-linux-x86_64/ws/harmony/target/build/classlib/portlib/native/port/hyexit.o> <https://hudson.apache.org/hudson/job/Harmony-1.5-head-linux-x86_64/ws/harmony/target/build/classlib/portlib/native/port/hyfile.o> <https://hudson.apache.org/hudson/job/Harmony-1.5-head-linux-x86_64/ws/harmony/target/build/classlib/portlib/native/port/hyfiletext.o> <https://hudson.apache.org/hudson/job/Harmony-1.5-head-linux-x86_64/ws/harmony/target/build/classlib/portlib/native/port/hygp.o> <https://hudson.apache.org/hudson/job/Harmony-1.5-head-linux-x86_64/ws/harmony/target/build/classlib/portlib/native/port/hymem.o> <https://hudson.apache.org/hudson/job/Harmony-1.5-head-linux-x86_64/ws/harmony/target/build/classlib/portlib/native/port//hymmap.o> <https://hudson.apache.org/hudson/job/Harmony-1.5-head-linux-x86_64/ws/harmony/target/build/classlib/portlib/native/port/hynls.o> <https://hudson.apache.org/hudson/job/Harmony-1.5-head-linux-x86_64/ws/harmony/target/build/classlib/portlib/native/port/hynlshelpers.o> <https://hudson.apache.org/hudson/job/Harmony-1.5-head-linux-x86_64/ws/harmony/target/build/classlib/portlib/native/port/hyosdump.o> <https://hudson.apache.org/hudson/job/Harmony-1.5-head-linux-x86_64/ws/harmony/target/build/classlib/portlib/native/port/hyport.o> <https://hudson.apache.org/hudson/job/Harmony-1.5-head-linux-x86_64/ws/harmony/target/build/classlib/portlib/native/port/hyportcontrol.o> <https://hudson.apache.org/hudson/job/Harmony-1.5-head-linux-x86_64/ws/harmony/target/build/classlib/portlib/native/port/hyportptb.o> <https://hudson.apache.org/hudson/job/Harmony-1.5-head-linux-x86_64/ws/harmony/target/build/classlib/portlib/native/port/hysharedhelper.o> <https://hudson.apache.org/hudson/job/Harmony-1.5-head-linux-x86_64/ws/harmony/target/build/classlib/portlib/native/port/hysl.o> <https://hudson.apache.org/hudson/job/Harmony-1.5-head-linux-x86_64/ws/harmony/target/build/classlib/portlib/native/port/hysock.o> <https://hudson.apache.org/hudson/job/Harmony-1.5-head-linux-x86_64/ws/harmony/target/build/classlib/portlib/native/port/hystr.o> <https://hudson.apache.org/hudson/job/Harmony-1.5-head-linux-x86_64/ws/harmony/target/build/classlib/portlib/native/port/hystrftime.o> <https://hudson.apache.org/hudson/job/Harmony-1.5-head-linux-x86_64/ws/harmony/target/build/classlib/portlib/native/port/hystsl.o> <https://hudson.apache.org/hudson/job/Harmony-1.5-head-linux-x86_64/ws/harmony/target/build/classlib/portlib/native/port/hysysinfo.o> <https://hudson.apache.org/hudson/job/Harmony-1.5-head-linux-x86_64/ws/harmony/target/build/classlib/portlib/native/port/hytime.o> <https://hudson.apache.org/hudson/job/Harmony-1.5-head-linux-x86_64/ws/harmony/target/build/classlib/portlib/native/port/hytlshelpers.o> <https://hudson.apache.org/hudson/job/Harmony-1.5-head-linux-x86_64/ws/harmony/target/build/classlib/portlib/native/port/hytty.o> <https://hudson.apache.org/hudson/job/Harmony-1.5-head-linux-x86_64/ws/harmony/target/build/classlib/portlib/native/port/hycpu.o> <https://hudson.apache.org/hudson/job/Harmony-1.5-head-linux-x86_64/ws/harmony/target/build/classlib/portlib/native/port/hyipcmutex.o> <https://hudson.apache.org/hudson/job/Harmony-1.5-head-linux-x86_64/ws/harmony/target/build/classlib/portlib/native/port/hyshmem.o> <https://hudson.apache.org/hudson/job/Harmony-1.5-head-linux-x86_64/ws/harmony/target/build/classlib/portlib/native/port/hyshsem.o> <https://hudson.apache.org/hudson/job/Harmony-1.5-head-linux-x86_64/ws/harmony/target/build/classlib/portlib/native/port/hyvmem.o> <https://hudson.apache.org/hudson/job/Harmony-1.5-head-linux-x86_64/ws/harmony/target/hdk/jdk/jre/bin/libhyprt.so> <https://hudson.apache.org/hudson/job/Harmony-1.5-head-linux-x86_64/ws/harmony/target/build/classlib/portlib/native/port/libhyprt.exp> \
[exec] <https://hudson.apache.org/hudson/job/Harmony-1.5-head-linux-x86_64/ws/harmony/target/hdk/jdk/lib/libhyprt.so.dbg>
[echo] Making "clean" in src/main/native/common/unix
[exec] rm -f <https://hudson.apache.org/hudson/job/Harmony-1.5-head-linux-x86_64/ws/harmony/target/build/classlib/portlib/native/common/libglob.o> <https://hudson.apache.org/hudson/job/Harmony-1.5-head-linux-x86_64/ws/harmony/target/build/classlib/portlib/native/common/iohelp.o> <https://hudson.apache.org/hudson/job/Harmony-1.5-head-linux-x86_64/ws/harmony/target/build/classlib/portlib/native/common/exceptions.o> <https://hudson.apache.org/hudson/job/Harmony-1.5-head-linux-x86_64/ws/harmony/target/build/classlib/portlib/native/common/strhelp.o> <https://hudson.apache.org/hudson/job/Harmony-1.5-head-linux-x86_64/ws/harmony/target/build/classlib/portlib/native/common/utf8encode.o> <https://hudson.apache.org/hudson/job/Harmony-1.5-head-linux-x86_64/ws/harmony/target/build/classlib/portlib/native/common/utf8decode.o> <https://hudson.apache.org/hudson/job/Harmony-1.5-head-linux-x86_64/ws/harmony/target/hdk/lib/libhycommon.a> <https://hudson.apache.org/hudson/job/Harmony-1.5-head-linux-x86_64/ws/harmony/target/build/classlib/portlib/native/common/.exp> \
[exec] <https://hudson.apache.org/hudson/job/Harmony-1.5-head-linux-x86_64/ws/harmony/target/hdk/jdk/lib/.dbg>
[echo] Making "clean" in src/main/native/pool/unix
[exec] rm -f <https://hudson.apache.org/hudson/job/Harmony-1.5-head-linux-x86_64/ws/harmony/target/build/classlib/portlib/native/pool/pool.o> <https://hudson.apache.org/hudson/job/Harmony-1.5-head-linux-x86_64/ws/harmony/target/build/classlib/portlib/native/pool/pool_cap.o> <https://hudson.apache.org/hudson/job/Harmony-1.5-head-linux-x86_64/ws/harmony/target/hdk/lib/libhypool.a> <https://hudson.apache.org/hudson/job/Harmony-1.5-head-linux-x86_64/ws/harmony/target/build/classlib/portlib/native/pool/.exp> \
[exec] <https://hudson.apache.org/hudson/job/Harmony-1.5-head-linux-x86_64/ws/harmony/target/hdk/jdk/lib/.dbg>
-clean-test:
[echo] Making "clean" in src/test/native/init/unix
[exec] rm -f ../shared/init.o ../init .exp \
[exec] <https://hudson.apache.org/hudson/job/Harmony-1.5-head-linux-x86_64/ws/harmony/target/hdk/jdk/lib/.dbg>
[echo] Making "clean" in src/test/native/hycpu/unix
[exec] rm -f ../shared/hycpu.o ../../hycunit/hycunit.o ../hycpu .exp \
[exec] ../TEST-*.xml <https://hudson.apache.org/hudson/job/Harmony-1.5-head-linux-x86_64/ws/harmony/target/hdk/jdk/lib/.dbg>
[echo] Making "clean" in src/test/native/hyerror/unix
[exec] rm -f ../shared/hyerror.o ../../hycunit/hycunit.o ../hyerror .exp \
[exec] ../TEST-*.xml <https://hudson.apache.org/hudson/job/Harmony-1.5-head-linux-x86_64/ws/harmony/target/hdk/jdk/lib/.dbg>
[echo] Making "clean" in src/test/native/hyfile/unix
[exec] rm -f ../shared/hyfile.o ../../hycunit/hycunit.o ../hyfile .exp \
[exec] ../TEST-*.xml <https://hudson.apache.org/hudson/job/Harmony-1.5-head-linux-x86_64/ws/harmony/target/hdk/jdk/lib/.dbg>
[echo] Making "clean" in src/test/native/hyfiletext/unix
[exec] rm -f ../shared/hyfiletext.o ../../hycunit/hycunit.o ../hyfiletext .exp \
[exec] ../TEST-*.xml <https://hudson.apache.org/hudson/job/Harmony-1.5-head-linux-x86_64/ws/harmony/target/hdk/jdk/lib/.dbg>
[echo] Making "clean" in src/test/native/hygp/unix
[exec] rm -f ../shared/hygp.o ../../hycunit/hycunit.o ../hygp .exp \
[exec] ../TEST-*.xml <https://hudson.apache.org/hudson/job/Harmony-1.5-head-linux-x86_64/ws/harmony/target/hdk/jdk/lib/.dbg>
[echo] Making "clean" in src/test/native/hymem/unix
[exec] rm -f ../shared/hymem.o ../../hycunit/hycunit.o ../hymem .exp \
[exec] ../TEST-*.xml <https://hudson.apache.org/hudson/job/Harmony-1.5-head-linux-x86_64/ws/harmony/target/hdk/jdk/lib/.dbg>
[echo] Making "clean" in src/test/native/hynls/unix
[exec] rm -f ../shared/hynls.o ../../hycunit/hycunit.o ../hynls .exp \
[exec] ../TEST-*.xml <https://hudson.apache.org/hudson/job/Harmony-1.5-head-linux-x86_64/ws/harmony/target/hdk/jdk/lib/.dbg>
[echo] Making "clean" in src/test/native/hyport/unix
[exec] rm -f ../shared/hyport.o ../../hycunit/hycunit.o ../hyport .exp \
[exec] ../TEST-*.xml <https://hudson.apache.org/hudson/job/Harmony-1.5-head-linux-x86_64/ws/harmony/target/hdk/jdk/lib/.dbg>
[echo] Making "clean" in src/test/native/hystr/unix
[exec] rm -f ../shared/hystr.o ../../hycunit/hycunit.o ../hystr .exp \
[exec] ../TEST-*.xml <https://hudson.apache.org/hudson/job/Harmony-1.5-head-linux-x86_64/ws/harmony/target/hdk/jdk/lib/.dbg>
[echo] Making "clean" in src/test/native/hytime/unix
[exec] rm -f ../shared/hytime.o ../../hycunit/hycunit.o ../hytime .exp \
[exec] ../TEST-*.xml <https://hudson.apache.org/hudson/job/Harmony-1.5-head-linux-x86_64/ws/harmony/target/hdk/jdk/lib/.dbg>
[echo] Making "clean" in src/test/native/hysysinfo/unix
[exec] rm -f ../shared/hysysinfo.o ../../hycunit/hycunit.o ../hysysinfo .exp \
[exec] ../TEST-*.xml <https://hudson.apache.org/hudson/job/Harmony-1.5-head-linux-x86_64/ws/harmony/target/hdk/jdk/lib/.dbg>
[echo] Making "clean" in src/test/native/hyipcmutex/unix
[exec] rm -f ../shared/hyipcmutex.o ../../hycunit/hycunit.o ../hyipcmutex .exp \
[exec] ../TEST-*.xml <https://hudson.apache.org/hudson/job/Harmony-1.5-head-linux-x86_64/ws/harmony/target/hdk/jdk/lib/.dbg>
[echo] Making "clean" in src/test/native/hymmap/unix
[exec] rm -f ../shared/hymmap.o ../../hycunit/hycunit.o ../hymmap .exp \
[exec] ../TEST-*.xml <https://hudson.apache.org/hudson/job/Harmony-1.5-head-linux-x86_64/ws/harmony/target/hdk/jdk/lib/.dbg>
clean:
-class-patternset:
-clean-java:
[delete] Deleting: <https://hudson.apache.org/hudson/job/Harmony-1.5-head-linux-x86_64/ws/harmony/target/hdk/build/ant/patternsets/prefs.txt>
-clean-native:
-clean-test:
clean:
-class-patternset:
-clean-java:
[delete] Deleting: <https://hudson.apache.org/hudson/job/Harmony-1.5-head-linux-x86_64/ws/harmony/target/hdk/build/ant/patternsets/print.txt>
-clean-native:
-clean-test:
clean:
-class-patternset:
-clean-java:
[delete] Deleting: <https://hudson.apache.org/hudson/job/Harmony-1.5-head-linux-x86_64/ws/harmony/target/hdk/build/ant/patternsets/regex.txt>
-clean-test:
clean:
-class-patternset:
-clean-java:
[delete] Deleting: <https://hudson.apache.org/hudson/job/Harmony-1.5-head-linux-x86_64/ws/harmony/target/hdk/build/ant/patternsets/rmi.txt>
-clean-test:
clean:
-class-patternset:
-clean-java:
[delete] Deleting: <https://hudson.apache.org/hudson/job/Harmony-1.5-head-linux-x86_64/ws/harmony/target/hdk/build/ant/patternsets/security-kernel.txt>
clean:
-class-patternset:
-clean-java:
[delete] Deleting: <https://hudson.apache.org/hudson/job/Harmony-1.5-head-linux-x86_64/ws/harmony/target/hdk/build/ant/patternsets/security.txt>
-clean-native:
[echo] Making "clean" in src/main/native/security/unix
[exec] rm -f <https://hudson.apache.org/hudson/job/Harmony-1.5-head-linux-x86_64/ws/harmony/target/build/classlib/security/native/security/security_copyright.o> <https://hudson.apache.org/hudson/job/Harmony-1.5-head-linux-x86_64/ws/harmony/target/build/classlib/security/native/security/getUnixSystemRandom.o> <https://hudson.apache.org/hudson/job/Harmony-1.5-head-linux-x86_64/ws/harmony/target/hdk/jdk/jre/bin/libhysecurity.so> <https://hudson.apache.org/hudson/job/Harmony-1.5-head-linux-x86_64/ws/harmony/target/build/classlib/security/native/security/libhysecurity.exp> \
[exec] <https://hudson.apache.org/hudson/job/Harmony-1.5-head-linux-x86_64/ws/harmony/target/hdk/jdk/lib/libhysecurity.so.dbg>
-clean-test:
clean:
-class-patternset:
-clean-java:
[delete] Deleting: <https://hudson.apache.org/hudson/job/Harmony-1.5-head-linux-x86_64/ws/harmony/target/hdk/build/ant/patternsets/sound.txt>
-clean-test:
clean:
-class-patternset:
-clean-java:
[delete] Deleting: <https://hudson.apache.org/hudson/job/Harmony-1.5-head-linux-x86_64/ws/harmony/target/hdk/build/ant/patternsets/sql.txt>
-clean-test:
clean:
-class-patternset:
-clean-java:
[delete] Deleting: <https://hudson.apache.org/hudson/job/Harmony-1.5-head-linux-x86_64/ws/harmony/target/hdk/build/ant/patternsets/suncompat.txt>
-clean-test:
clean:
-class-patternset:
-clean-java:
[delete] Deleting: <https://hudson.apache.org/hudson/job/Harmony-1.5-head-linux-x86_64/ws/harmony/target/hdk/build/ant/patternsets/swing.txt>
-clean-test:
clean:
-class-patternset:
-clean-java:
[delete] Deleting: <https://hudson.apache.org/hudson/job/Harmony-1.5-head-linux-x86_64/ws/harmony/target/hdk/build/ant/patternsets/text.txt>
-clean-test:
clean:
-class-patternset:
-clean-java:
[delete] Deleting: <https://hudson.apache.org/hudson/job/Harmony-1.5-head-linux-x86_64/ws/harmony/target/hdk/build/ant/patternsets/x-net.txt>
-clean-test:
clean:
-clean-java:
clean:
-clean-java-catch-all-test:
-clean-java-catch-all:
-clean-java-layout:
-clean-check:
-clean-native:
-clean-test:
clean:
clean-vm:
[copy] Copying 20 files to <https://hudson.apache.org/hudson/job/Harmony-1.5-head-linux-x86_64/ws/harmony/target/hdk/build/make>
clean:
clean-tests:
clean:
-init-hdk:
[mkdir] Created dir: <https://hudson.apache.org/hudson/job/Harmony-1.5-head-linux-x86_64/ws/harmony/target/hdk/build/ant>
[copy] Copying 4 files to <https://hudson.apache.org/hudson/job/Harmony-1.5-head-linux-x86_64/ws/harmony/target/hdk/build/ant>
[copy] Copying 1 file to <https://hudson.apache.org/hudson/job/Harmony-1.5-head-linux-x86_64/ws/harmony/target/hdk/build/ant>
[mkdir] Created dir: <https://hudson.apache.org/hudson/job/Harmony-1.5-head-linux-x86_64/ws/harmony/target/hdk/build/make>
[copy] Copying 20 files to <https://hudson.apache.org/hudson/job/Harmony-1.5-head-linux-x86_64/ws/harmony/target/hdk/build/make>
-init-hdk:
[copy] Copying 4 files to <https://hudson.apache.org/hudson/job/Harmony-1.5-head-linux-x86_64/ws/harmony/target/hdk/jdk/include>
auto-fetch-depends-classlib:
-build-classlib:
[copy] Copying 20 files to <https://hudson.apache.org/hudson/job/Harmony-1.5-head-linux-x86_64/ws/harmony/target/hdk/build/make>
Trying to override old definition of task chksum
-init-hdk:
[copy] Copying 20 files to <https://hudson.apache.org/hudson/job/Harmony-1.5-head-linux-x86_64/ws/harmony/target/hdk/build/make>
-check-depends:
-check:
[echo] Checking for <https://hudson.apache.org/hudson/job/Harmony-1.5-head-linux-x86_64/ws/harmony/target/depends/jars/junit_4.6/junit-4.6.jar>
BUILD FAILED
<https://hudson.apache.org/hudson/job/Harmony-1.5-head-linux-x86_64/ws/harmony/build.xml>:480: The following error occurred while executing this line:
<https://hudson.apache.org/hudson/job/Harmony-1.5-head-linux-x86_64/ws/harmony/classlib/build.xml>:567: The following error occurred while executing this line:
<https://hudson.apache.org/hudson/job/Harmony-1.5-head-linux-x86_64/ws/harmony/classlib/make/depends.xml>:35: The following error occurred while executing this line:
<https://hudson.apache.org/hudson/job/Harmony-1.5-head-linux-x86_64/ws/harmony/target/hdk/build/ant/depends.xml>:109: ...
Missing dependency. The file from:
http://mirrors.ibiblio.org/pub/mirrors/maven2/junit/junit/4.6/junit-4.6.jar
should be downloaded (extracted) to:
<https://hudson.apache.org/hudson/job/Harmony-1.5-head-linux-x86_64/ws/harmony/target/depends/jars/junit_4.6/junit-4.6.jar>
Run "ant fetch-depends" to automatically fetch dependencies.
Note: Some of Harmony's dependencies are licensed under terms other
than the Apache License v2.
Total time: 2 minutes 56 seconds
[FINDBUGS] Skipping publisher since build result is FAILURE
Recording fingerprints
Archiving artifacts
Recording test results
Failed to send e-mail to hindessm because no e-mail address is known, and no default e-mail domain is configured
Hudson build is back to normal : Harmony-1.5-head-linux-x86_64
#1005
Posted by Apache Hudson Server <hu...@hudson.apache.org>.
See <https://hudson.apache.org/hudson/job/Harmony-1.5-head-linux-x86_64/1005/changes>
Build failed in Hudson: Harmony-1.5-head-linux-x86_64 #1004
Posted by Apache Hudson Server <hu...@hudson.apache.org>.
See <https://hudson.apache.org/hudson/job/Harmony-1.5-head-linux-x86_64/1004/changes>
Changes:
[hindessm] Fix setup target to leave dependencies.
------------------------------------------
[...truncated 6112 lines...]
[tar] Entry: harmony-5.0-hdk-1029132/build/test/security/resources/serialization/org/apache/harmony/security/tests/java/security/serialization/GuardedObjectTest.golden.2.ser longer than 100 characters.
[tar] Entry: harmony-5.0-hdk-1029132/build/test/security/resources/serialization/org/apache/harmony/security/tests/java/security/serialization/InvalidAlgorithmParameterExceptionTest.golden.0.ser longer than 100 characters.
[tar] Entry: harmony-5.0-hdk-1029132/build/test/security/resources/serialization/org/apache/harmony/security/tests/java/security/serialization/InvalidAlgorithmParameterExceptionTest.golden.1.ser longer than 100 characters.
[tar] Entry: harmony-5.0-hdk-1029132/build/test/security/resources/serialization/org/apache/harmony/security/tests/java/security/serialization/InvalidAlgorithmParameterExceptionTest.golden.2.ser longer than 100 characters.
[tar] Entry: harmony-5.0-hdk-1029132/build/test/security/resources/serialization/org/apache/harmony/security/tests/java/security/serialization/InvalidAlgorithmParameterExceptionTest.golden.3.ser longer than 100 characters.
[tar] Entry: harmony-5.0-hdk-1029132/build/test/security/resources/serialization/org/apache/harmony/security/tests/java/security/serialization/InvalidAlgorithmParameterExceptionTest.golden.4.ser longer than 100 characters.
[tar] Entry: harmony-5.0-hdk-1029132/build/test/security/resources/serialization/org/apache/harmony/security/tests/java/security/serialization/InvalidAlgorithmParameterExceptionTest.golden.5.ser longer than 100 characters.
[tar] Entry: harmony-5.0-hdk-1029132/build/test/security/resources/serialization/org/apache/harmony/security/tests/java/security/serialization/InvalidKeyExceptionTest.golden.0.ser longer than 100 characters.
[tar] Entry: harmony-5.0-hdk-1029132/build/test/security/resources/serialization/org/apache/harmony/security/tests/java/security/serialization/InvalidKeyExceptionTest.golden.1.ser longer than 100 characters.
[tar] Entry: harmony-5.0-hdk-1029132/build/test/security/resources/serialization/org/apache/harmony/security/tests/java/security/serialization/InvalidKeyExceptionTest.golden.2.ser longer than 100 characters.
[tar] Entry: harmony-5.0-hdk-1029132/build/test/security/resources/serialization/org/apache/harmony/security/tests/java/security/serialization/InvalidKeyExceptionTest.golden.3.ser longer than 100 characters.
[tar] Entry: harmony-5.0-hdk-1029132/build/test/security/resources/serialization/org/apache/harmony/security/tests/java/security/serialization/InvalidKeyExceptionTest.golden.4.ser longer than 100 characters.
[tar] Entry: harmony-5.0-hdk-1029132/build/test/security/resources/serialization/org/apache/harmony/security/tests/java/security/serialization/InvalidKeyExceptionTest.golden.5.ser longer than 100 characters.
[tar] Entry: harmony-5.0-hdk-1029132/build/test/security/resources/serialization/org/apache/harmony/security/tests/java/security/serialization/InvalidParameterExceptionTest.golden.0.ser longer than 100 characters.
[tar] Entry: harmony-5.0-hdk-1029132/build/test/security/resources/serialization/org/apache/harmony/security/tests/java/security/serialization/InvalidParameterExceptionTest.golden.1.ser longer than 100 characters.
[tar] Entry: harmony-5.0-hdk-1029132/build/test/security/resources/serialization/org/apache/harmony/security/tests/java/security/serialization/InvalidParameterExceptionTest.golden.2.ser longer than 100 characters.
[tar] Entry: harmony-5.0-hdk-1029132/build/test/security/resources/serialization/org/apache/harmony/security/tests/java/security/serialization/KeyExceptionTest.golden.0.ser longer than 100 characters.
[tar] Entry: harmony-5.0-hdk-1029132/build/test/security/resources/serialization/org/apache/harmony/security/tests/java/security/serialization/KeyExceptionTest.golden.1.ser longer than 100 characters.
[tar] Entry: harmony-5.0-hdk-1029132/build/test/security/resources/serialization/org/apache/harmony/security/tests/java/security/serialization/KeyExceptionTest.golden.2.ser longer than 100 characters.
[tar] Entry: harmony-5.0-hdk-1029132/build/test/security/resources/serialization/org/apache/harmony/security/tests/java/security/serialization/KeyExceptionTest.golden.3.ser longer than 100 characters.
[tar] Entry: harmony-5.0-hdk-1029132/build/test/security/resources/serialization/org/apache/harmony/security/tests/java/security/serialization/KeyExceptionTest.golden.4.ser longer than 100 characters.
[tar] Entry: harmony-5.0-hdk-1029132/build/test/security/resources/serialization/org/apache/harmony/security/tests/java/security/serialization/KeyExceptionTest.golden.5.ser longer than 100 characters.
[tar] Entry: harmony-5.0-hdk-1029132/build/test/security/resources/serialization/org/apache/harmony/security/tests/java/security/serialization/KeyManagementExceptionTest.golden.0.ser longer than 100 characters.
[tar] Entry: harmony-5.0-hdk-1029132/build/test/security/resources/serialization/org/apache/harmony/security/tests/java/security/serialization/KeyManagementExceptionTest.golden.1.ser longer than 100 characters.
[tar] Entry: harmony-5.0-hdk-1029132/build/test/security/resources/serialization/org/apache/harmony/security/tests/java/security/serialization/KeyManagementExceptionTest.golden.2.ser longer than 100 characters.
[tar] Entry: harmony-5.0-hdk-1029132/build/test/security/resources/serialization/org/apache/harmony/security/tests/java/security/serialization/KeyManagementExceptionTest.golden.3.ser longer than 100 characters.
[tar] Entry: harmony-5.0-hdk-1029132/build/test/security/resources/serialization/org/apache/harmony/security/tests/java/security/serialization/KeyManagementExceptionTest.golden.4.ser longer than 100 characters.
[tar] Entry: harmony-5.0-hdk-1029132/build/test/security/resources/serialization/org/apache/harmony/security/tests/java/security/serialization/KeyManagementExceptionTest.golden.5.ser longer than 100 characters.
[tar] Entry: harmony-5.0-hdk-1029132/build/test/security/resources/serialization/org/apache/harmony/security/tests/java/security/serialization/KeyPairTest.golden.ser longer than 100 characters.
[tar] Entry: harmony-5.0-hdk-1029132/build/test/security/resources/serialization/org/apache/harmony/security/tests/java/security/serialization/KeyStoreExceptionTest.golden.0.ser longer than 100 characters.
[tar] Entry: harmony-5.0-hdk-1029132/build/test/security/resources/serialization/org/apache/harmony/security/tests/java/security/serialization/KeyStoreExceptionTest.golden.1.ser longer than 100 characters.
[tar] Entry: harmony-5.0-hdk-1029132/build/test/security/resources/serialization/org/apache/harmony/security/tests/java/security/serialization/KeyStoreExceptionTest.golden.2.ser longer than 100 characters.
[tar] Entry: harmony-5.0-hdk-1029132/build/test/security/resources/serialization/org/apache/harmony/security/tests/java/security/serialization/KeyStoreExceptionTest.golden.3.ser longer than 100 characters.
[tar] Entry: harmony-5.0-hdk-1029132/build/test/security/resources/serialization/org/apache/harmony/security/tests/java/security/serialization/KeyStoreExceptionTest.golden.4.ser longer than 100 characters.
[tar] Entry: harmony-5.0-hdk-1029132/build/test/security/resources/serialization/org/apache/harmony/security/tests/java/security/serialization/KeyStoreExceptionTest.golden.5.ser longer than 100 characters.
[tar] Entry: harmony-5.0-hdk-1029132/build/test/security/resources/serialization/org/apache/harmony/security/tests/java/security/serialization/NoSuchAlgorithmExceptionTest.golden.0.ser longer than 100 characters.
[tar] Entry: harmony-5.0-hdk-1029132/build/test/security/resources/serialization/org/apache/harmony/security/tests/java/security/serialization/NoSuchAlgorithmExceptionTest.golden.1.ser longer than 100 characters.
[tar] Entry: harmony-5.0-hdk-1029132/build/test/security/resources/serialization/org/apache/harmony/security/tests/java/security/serialization/NoSuchAlgorithmExceptionTest.golden.2.ser longer than 100 characters.
[tar] Entry: harmony-5.0-hdk-1029132/build/test/security/resources/serialization/org/apache/harmony/security/tests/java/security/serialization/NoSuchAlgorithmExceptionTest.golden.3.ser longer than 100 characters.
[tar] Entry: harmony-5.0-hdk-1029132/build/test/security/resources/serialization/org/apache/harmony/security/tests/java/security/serialization/NoSuchAlgorithmExceptionTest.golden.4.ser longer than 100 characters.
[tar] Entry: harmony-5.0-hdk-1029132/build/test/security/resources/serialization/org/apache/harmony/security/tests/java/security/serialization/NoSuchAlgorithmExceptionTest.golden.5.ser longer than 100 characters.
[tar] Entry: harmony-5.0-hdk-1029132/build/test/security/resources/serialization/org/apache/harmony/security/tests/java/security/serialization/NoSuchProviderExceptionTest.golden.0.ser longer than 100 characters.
[tar] Entry: harmony-5.0-hdk-1029132/build/test/security/resources/serialization/org/apache/harmony/security/tests/java/security/serialization/NoSuchProviderExceptionTest.golden.1.ser longer than 100 characters.
[tar] Entry: harmony-5.0-hdk-1029132/build/test/security/resources/serialization/org/apache/harmony/security/tests/java/security/serialization/NoSuchProviderExceptionTest.golden.2.ser longer than 100 characters.
[tar] Entry: harmony-5.0-hdk-1029132/build/test/security/resources/serialization/org/apache/harmony/security/tests/java/security/serialization/PermissionCollectionTest.golden.0.ser longer than 100 characters.
[tar] Entry: harmony-5.0-hdk-1029132/build/test/security/resources/serialization/org/apache/harmony/security/tests/java/security/serialization/PermissionCollectionTest.golden.1.ser longer than 100 characters.
[tar] Entry: harmony-5.0-hdk-1029132/build/test/security/resources/serialization/org/apache/harmony/security/tests/java/security/serialization/PermissionTest.golden.0.ser longer than 100 characters.
[tar] Entry: harmony-5.0-hdk-1029132/build/test/security/resources/serialization/org/apache/harmony/security/tests/java/security/serialization/PermissionTest.golden.1.ser longer than 100 characters.
[tar] Entry: harmony-5.0-hdk-1029132/build/test/security/resources/serialization/org/apache/harmony/security/tests/java/security/serialization/PermissionsTest.golden.0.ser longer than 100 characters.
[tar] Entry: harmony-5.0-hdk-1029132/build/test/security/resources/serialization/org/apache/harmony/security/tests/java/security/serialization/PermissionsTest.golden.1.ser longer than 100 characters.
[tar] Entry: harmony-5.0-hdk-1029132/build/test/security/resources/serialization/org/apache/harmony/security/tests/java/security/serialization/PrivilegedActionExceptionTest.golden.0.ser longer than 100 characters.
[tar] Entry: harmony-5.0-hdk-1029132/build/test/security/resources/serialization/org/apache/harmony/security/tests/java/security/serialization/PrivilegedActionExceptionTest.golden.1.ser longer than 100 characters.
[tar] Entry: harmony-5.0-hdk-1029132/build/test/security/resources/serialization/org/apache/harmony/security/tests/java/security/serialization/PrivilegedActionExceptionTest.golden.2.ser longer than 100 characters.
[tar] Entry: harmony-5.0-hdk-1029132/build/test/security/resources/serialization/org/apache/harmony/security/tests/java/security/serialization/ProviderExceptionTest.golden.0.ser longer than 100 characters.
[tar] Entry: harmony-5.0-hdk-1029132/build/test/security/resources/serialization/org/apache/harmony/security/tests/java/security/serialization/ProviderExceptionTest.golden.1.ser longer than 100 characters.
[tar] Entry: harmony-5.0-hdk-1029132/build/test/security/resources/serialization/org/apache/harmony/security/tests/java/security/serialization/ProviderExceptionTest.golden.2.ser longer than 100 characters.
[tar] Entry: harmony-5.0-hdk-1029132/build/test/security/resources/serialization/org/apache/harmony/security/tests/java/security/serialization/ProviderExceptionTest.golden.3.ser longer than 100 characters.
[tar] Entry: harmony-5.0-hdk-1029132/build/test/security/resources/serialization/org/apache/harmony/security/tests/java/security/serialization/ProviderExceptionTest.golden.4.ser longer than 100 characters.
[tar] Entry: harmony-5.0-hdk-1029132/build/test/security/resources/serialization/org/apache/harmony/security/tests/java/security/serialization/ProviderExceptionTest.golden.5.ser longer than 100 characters.
[tar] Entry: harmony-5.0-hdk-1029132/build/test/security/resources/serialization/org/apache/harmony/security/tests/java/security/serialization/SecurityPermissionTest.golden.0.ser longer than 100 characters.
[tar] Entry: harmony-5.0-hdk-1029132/build/test/security/resources/serialization/org/apache/harmony/security/tests/java/security/serialization/SecurityPermissionTest.golden.1.ser longer than 100 characters.
[tar] Entry: harmony-5.0-hdk-1029132/build/test/security/resources/serialization/org/apache/harmony/security/tests/java/security/serialization/SignatureExceptionTest.golden.0.ser longer than 100 characters.
[tar] Entry: harmony-5.0-hdk-1029132/build/test/security/resources/serialization/org/apache/harmony/security/tests/java/security/serialization/SignatureExceptionTest.golden.1.ser longer than 100 characters.
[tar] Entry: harmony-5.0-hdk-1029132/build/test/security/resources/serialization/org/apache/harmony/security/tests/java/security/serialization/SignatureExceptionTest.golden.2.ser longer than 100 characters.
[tar] Entry: harmony-5.0-hdk-1029132/build/test/security/resources/serialization/org/apache/harmony/security/tests/java/security/serialization/SignatureExceptionTest.golden.3.ser longer than 100 characters.
[tar] Entry: harmony-5.0-hdk-1029132/build/test/security/resources/serialization/org/apache/harmony/security/tests/java/security/serialization/SignatureExceptionTest.golden.4.ser longer than 100 characters.
[tar] Entry: harmony-5.0-hdk-1029132/build/test/security/resources/serialization/org/apache/harmony/security/tests/java/security/serialization/SignatureExceptionTest.golden.5.ser longer than 100 characters.
[tar] Entry: harmony-5.0-hdk-1029132/build/test/security/resources/serialization/org/apache/harmony/security/tests/java/security/serialization/SignedObjectTest.golden.0.ser longer than 100 characters.
[tar] Entry: harmony-5.0-hdk-1029132/build/test/security/resources/serialization/org/apache/harmony/security/tests/java/security/serialization/TimestampTest.golden.0.ser longer than 100 characters.
[tar] Entry: harmony-5.0-hdk-1029132/build/test/security/resources/serialization/org/apache/harmony/security/tests/java/security/serialization/UnrecoverableEntryExceptionTest.golden.0.ser longer than 100 characters.
[tar] Entry: harmony-5.0-hdk-1029132/build/test/security/resources/serialization/org/apache/harmony/security/tests/java/security/serialization/UnrecoverableEntryExceptionTest.golden.1.ser longer than 100 characters.
[tar] Entry: harmony-5.0-hdk-1029132/build/test/security/resources/serialization/org/apache/harmony/security/tests/java/security/serialization/UnrecoverableEntryExceptionTest.golden.2.ser longer than 100 characters.
[tar] Entry: harmony-5.0-hdk-1029132/build/test/security/resources/serialization/org/apache/harmony/security/tests/java/security/serialization/UnrecoverableKeyExceptionTest.golden.0.ser longer than 100 characters.
[tar] Entry: harmony-5.0-hdk-1029132/build/test/security/resources/serialization/org/apache/harmony/security/tests/java/security/serialization/UnrecoverableKeyExceptionTest.golden.1.ser longer than 100 characters.
[tar] Entry: harmony-5.0-hdk-1029132/build/test/security/resources/serialization/org/apache/harmony/security/tests/java/security/serialization/UnrecoverableKeyExceptionTest.golden.2.ser longer than 100 characters.
[tar] Entry: harmony-5.0-hdk-1029132/build/test/security/resources/serialization/org/apache/harmony/security/tests/java/security/serialization/UnresolvedPermissionCollectionTest.golden.0.ser longer than 100 characters.
[tar] Entry: harmony-5.0-hdk-1029132/build/test/security/resources/serialization/org/apache/harmony/security/tests/java/security/serialization/UnresolvedPermissionCollectionTest.golden.1.ser longer than 100 characters.
[tar] Entry: harmony-5.0-hdk-1029132/build/test/security/resources/serialization/org/apache/harmony/security/tests/java/security/serialization/UnresolvedPermissionCollectionTest.golden.2.ser longer than 100 characters.
[tar] Entry: harmony-5.0-hdk-1029132/build/test/security/resources/serialization/org/apache/harmony/security/tests/java/security/serialization/UnresolvedPermissionTest.golden.0.ser longer than 100 characters.
[tar] Entry: harmony-5.0-hdk-1029132/build/test/security/resources/serialization/org/apache/harmony/security/tests/java/security/serialization/UnresolvedPermissionTest.golden.1.ser longer than 100 characters.
[tar] Entry: harmony-5.0-hdk-1029132/build/test/security/resources/serialization/org/apache/harmony/security/tests/java/security/serialization/UnresolvedPermissionTest.golden.ser longer than 100 characters.
[tar] Entry: harmony-5.0-hdk-1029132/build/test/security/resources/serialization/org/apache/harmony/security/tests/java/security/spec/serialization/InvalidKeySpecExceptionTest.golden.0.ser longer than 100 characters.
[tar] Entry: harmony-5.0-hdk-1029132/build/test/security/resources/serialization/org/apache/harmony/security/tests/java/security/spec/serialization/InvalidKeySpecExceptionTest.golden.1.ser longer than 100 characters.
[tar] Entry: harmony-5.0-hdk-1029132/build/test/security/resources/serialization/org/apache/harmony/security/tests/java/security/spec/serialization/InvalidKeySpecExceptionTest.golden.2.ser longer than 100 characters.
[tar] Entry: harmony-5.0-hdk-1029132/build/test/security/resources/serialization/org/apache/harmony/security/tests/java/security/spec/serialization/InvalidKeySpecExceptionTest.golden.3.ser longer than 100 characters.
[tar] Entry: harmony-5.0-hdk-1029132/build/test/security/resources/serialization/org/apache/harmony/security/tests/java/security/spec/serialization/InvalidKeySpecExceptionTest.golden.4.ser longer than 100 characters.
[tar] Entry: harmony-5.0-hdk-1029132/build/test/security/resources/serialization/org/apache/harmony/security/tests/java/security/spec/serialization/InvalidKeySpecExceptionTest.golden.5.ser longer than 100 characters.
[tar] Entry: harmony-5.0-hdk-1029132/build/test/security/resources/serialization/org/apache/harmony/security/tests/java/security/spec/serialization/InvalidParameterSpecExceptionTest.golden.0.ser longer than 100 characters.
[tar] Entry: harmony-5.0-hdk-1029132/build/test/security/resources/serialization/org/apache/harmony/security/tests/java/security/spec/serialization/InvalidParameterSpecExceptionTest.golden.1.ser longer than 100 characters.
[tar] Entry: harmony-5.0-hdk-1029132/build/test/security/resources/serialization/org/apache/harmony/security/tests/java/security/spec/serialization/InvalidParameterSpecExceptionTest.golden.2.ser longer than 100 characters.
[tar] Entry: harmony-5.0-hdk-1029132/build/test/security/resources/serialization/org/apache/harmony/security/tests/javax/security/cert/serialization/CertificateEncodingExceptionTest.golden.0.ser longer than 100 characters.
[tar] Entry: harmony-5.0-hdk-1029132/build/test/security/resources/serialization/org/apache/harmony/security/tests/javax/security/cert/serialization/CertificateEncodingExceptionTest.golden.1.ser longer than 100 characters.
[tar] Entry: harmony-5.0-hdk-1029132/build/test/security/resources/serialization/org/apache/harmony/security/tests/javax/security/cert/serialization/CertificateEncodingExceptionTest.golden.2.ser longer than 100 characters.
[tar] Entry: harmony-5.0-hdk-1029132/build/test/security/resources/serialization/org/apache/harmony/security/tests/javax/security/cert/serialization/CertificateEncodingExceptionTest.golden.3.ser longer than 100 characters.
[tar] Entry: harmony-5.0-hdk-1029132/build/test/security/resources/serialization/org/apache/harmony/security/tests/javax/security/cert/serialization/CertificateExceptionTest.golden.0.ser longer than 100 characters.
[tar] Entry: harmony-5.0-hdk-1029132/build/test/security/resources/serialization/org/apache/harmony/security/tests/javax/security/cert/serialization/CertificateExceptionTest.golden.1.ser longer than 100 characters.
[tar] Entry: harmony-5.0-hdk-1029132/build/test/security/resources/serialization/org/apache/harmony/security/tests/javax/security/cert/serialization/CertificateExceptionTest.golden.2.ser longer than 100 characters.
[tar] Entry: harmony-5.0-hdk-1029132/build/test/security/resources/serialization/org/apache/harmony/security/tests/javax/security/cert/serialization/CertificateExceptionTest.golden.3.ser longer than 100 characters.
[tar] Entry: harmony-5.0-hdk-1029132/build/test/security/resources/serialization/org/apache/harmony/security/tests/javax/security/cert/serialization/CertificateExpiredExceptionTest.golden.0.ser longer than 100 characters.
[tar] Entry: harmony-5.0-hdk-1029132/build/test/security/resources/serialization/org/apache/harmony/security/tests/javax/security/cert/serialization/CertificateExpiredExceptionTest.golden.1.ser longer than 100 characters.
[tar] Entry: harmony-5.0-hdk-1029132/build/test/security/resources/serialization/org/apache/harmony/security/tests/javax/security/cert/serialization/CertificateExpiredExceptionTest.golden.2.ser longer than 100 characters.
[tar] Entry: harmony-5.0-hdk-1029132/build/test/security/resources/serialization/org/apache/harmony/security/tests/javax/security/cert/serialization/CertificateNotYetValidExceptionTest.golden.0.ser longer than 100 characters.
[tar] Entry: harmony-5.0-hdk-1029132/build/test/security/resources/serialization/org/apache/harmony/security/tests/javax/security/cert/serialization/CertificateNotYetValidExceptionTest.golden.1.ser longer than 100 characters.
[tar] Entry: harmony-5.0-hdk-1029132/build/test/security/resources/serialization/org/apache/harmony/security/tests/javax/security/cert/serialization/CertificateNotYetValidExceptionTest.golden.2.ser longer than 100 characters.
[tar] Entry: harmony-5.0-hdk-1029132/build/test/security/resources/serialization/org/apache/harmony/security/tests/javax/security/cert/serialization/CertificateParsingExceptionTest.golden.0.ser longer than 100 characters.
[tar] Entry: harmony-5.0-hdk-1029132/build/test/security/resources/serialization/org/apache/harmony/security/tests/javax/security/cert/serialization/CertificateParsingExceptionTest.golden.1.ser longer than 100 characters.
[tar] Entry: harmony-5.0-hdk-1029132/build/test/security/resources/serialization/org/apache/harmony/security/tests/javax/security/cert/serialization/CertificateParsingExceptionTest.golden.2.ser longer than 100 characters.
[tar] Entry: harmony-5.0-hdk-1029132/build/test/security/resources/serialization/org/apache/harmony/security/tests/javax/security/cert/serialization/CertificateParsingExceptionTest.golden.3.ser longer than 100 characters.
[tar] Entry: harmony-5.0-hdk-1029132/build/test/security/resources/serialization/org/apache/harmony/security/tests/provider/crypto/serialization/SHA1PRNG_SecureRandomTest.golden.0.ser longer than 100 characters.
[tar] Entry: harmony-5.0-hdk-1029132/build/test/security/resources/serialization/org/apache/harmony/security/tests/provider/crypto/serialization/SHA1PRNG_SecureRandomTest.golden.1.ser longer than 100 characters.
[tar] Entry: harmony-5.0-hdk-1029132/build/test/security/resources/serialization/org/apache/harmony/security/tests/provider/crypto/serialization/SHA1PRNG_SecureRandomTest.golden.2.ser longer than 100 characters.
[tar] Entry: harmony-5.0-hdk-1029132/build/test/security/resources/serialization/org/apache/harmony/security/tests/provider/crypto/serialization/SHA1PRNG_SecureRandomTest.golden.3.ser longer than 100 characters.
[tar] Entry: harmony-5.0-hdk-1029132/build/test/security/resources/serialization/org/apache/harmony/security/tests/provider/crypto/serialization/SHA1PRNG_SecureRandomTest.golden.4.ser longer than 100 characters.
[tar] Entry: harmony-5.0-hdk-1029132/build/test/sound/resources/org/apache/harmony/sound/tests/javax/sound/sampled/soundProvider.jar longer than 100 characters.
[tar] Entry: harmony-5.0-hdk-1029132/build/test/sql/resources/org/apache/harmony/sql/internal/rowset/XmlFile_InvalidHeader.xml longer than 100 characters.
[tar] Entry: harmony-5.0-hdk-1029132/build/test/sql/resources/org/apache/harmony/sql/internal/rowset/XmlReaderTest_HY.xml longer than 100 characters.
[tar] Entry: harmony-5.0-hdk-1029132/build/test/sql/resources/org/apache/harmony/sql/internal/rowset/XmlReaderTest_RI.xml longer than 100 characters.
[tar] Entry: harmony-5.0-hdk-1029132/build/test/sql/resources/serialization/org/apache/harmony/sql/tests/java/sql/BatchUpdateExceptionTest.golden.ser longer than 100 characters.
[tar] Entry: harmony-5.0-hdk-1029132/build/test/sql/resources/serialization/org/apache/harmony/sql/tests/java/sql/DataTruncationTest.golden.ser longer than 100 characters.
[tar] Entry: harmony-5.0-hdk-1029132/build/test/sql/resources/serialization/org/apache/harmony/sql/tests/java/sql/SQLExceptionTest.golden.ser longer than 100 characters.
[tar] Entry: harmony-5.0-hdk-1029132/build/test/sql/resources/serialization/org/apache/harmony/sql/tests/java/sql/SQLWarningTest.golden.ser longer than 100 characters.
[tar] Entry: harmony-5.0-hdk-1029132/build/test/sql/resources/serialization/org/apache/harmony/sql/tests/java/sql/TimestampTest.golden.ser longer than 100 characters.
[tar] Entry: harmony-5.0-hdk-1029132/build/test/sql/resources/serialization/org/apache/harmony/sql/tests/javax/sql/ConnectionEventTest.golden.ser longer than 100 characters.
[tar] Entry: harmony-5.0-hdk-1029132/build/test/sql/resources/serialization/org/apache/harmony/sql/tests/javax/sql/rowset/RowSetMetaDataImplTest.golden.ser longer than 100 characters.
[tar] Entry: harmony-5.0-hdk-1029132/build/test/sql/resources/serialization/org/apache/harmony/sql/tests/javax/sql/rowset/serial/SerialExceptionTest.golden.ser longer than 100 characters.
[tar] Entry: harmony-5.0-hdk-1029132/build/test/x-net/resources/serialization/org/apache/harmony/xnet/tests/javax/net/ssl/serialization/HandshakeCompletedEventTest.golden.0.ser longer than 100 characters.
[tar] Entry: harmony-5.0-hdk-1029132/build/test/x-net/resources/serialization/org/apache/harmony/xnet/tests/javax/net/ssl/serialization/SSLExceptionTest.golden.0.ser longer than 100 characters.
[tar] Entry: harmony-5.0-hdk-1029132/build/test/x-net/resources/serialization/org/apache/harmony/xnet/tests/javax/net/ssl/serialization/SSLExceptionTest.golden.1.ser longer than 100 characters.
[tar] Entry: harmony-5.0-hdk-1029132/build/test/x-net/resources/serialization/org/apache/harmony/xnet/tests/javax/net/ssl/serialization/SSLExceptionTest.golden.2.ser longer than 100 characters.
[tar] Entry: harmony-5.0-hdk-1029132/build/test/x-net/resources/serialization/org/apache/harmony/xnet/tests/javax/net/ssl/serialization/SSLExceptionTest.golden.3.ser longer than 100 characters.
[tar] Entry: harmony-5.0-hdk-1029132/build/test/x-net/resources/serialization/org/apache/harmony/xnet/tests/javax/net/ssl/serialization/SSLExceptionTest.golden.4.ser longer than 100 characters.
[tar] Entry: harmony-5.0-hdk-1029132/build/test/x-net/resources/serialization/org/apache/harmony/xnet/tests/javax/net/ssl/serialization/SSLHandshakeExceptionTest.golden.0.ser longer than 100 characters.
[tar] Entry: harmony-5.0-hdk-1029132/build/test/x-net/resources/serialization/org/apache/harmony/xnet/tests/javax/net/ssl/serialization/SSLHandshakeExceptionTest.golden.1.ser longer than 100 characters.
[tar] Entry: harmony-5.0-hdk-1029132/build/test/x-net/resources/serialization/org/apache/harmony/xnet/tests/javax/net/ssl/serialization/SSLHandshakeExceptionTest.golden.2.ser longer than 100 characters.
[tar] Entry: harmony-5.0-hdk-1029132/build/test/x-net/resources/serialization/org/apache/harmony/xnet/tests/javax/net/ssl/serialization/SSLKeyExceptionTest.golden.0.ser longer than 100 characters.
[tar] Entry: harmony-5.0-hdk-1029132/build/test/x-net/resources/serialization/org/apache/harmony/xnet/tests/javax/net/ssl/serialization/SSLKeyExceptionTest.golden.1.ser longer than 100 characters.
[tar] Entry: harmony-5.0-hdk-1029132/build/test/x-net/resources/serialization/org/apache/harmony/xnet/tests/javax/net/ssl/serialization/SSLKeyExceptionTest.golden.2.ser longer than 100 characters.
[tar] Entry: harmony-5.0-hdk-1029132/build/test/x-net/resources/serialization/org/apache/harmony/xnet/tests/javax/net/ssl/serialization/SSLPeerUnverifiedExceptionTest.golden.0.ser longer than 100 characters.
[tar] Entry: harmony-5.0-hdk-1029132/build/test/x-net/resources/serialization/org/apache/harmony/xnet/tests/javax/net/ssl/serialization/SSLPeerUnverifiedExceptionTest.golden.1.ser longer than 100 characters.
[tar] Entry: harmony-5.0-hdk-1029132/build/test/x-net/resources/serialization/org/apache/harmony/xnet/tests/javax/net/ssl/serialization/SSLPeerUnverifiedExceptionTest.golden.2.ser longer than 100 characters.
[tar] Entry: harmony-5.0-hdk-1029132/build/test/x-net/resources/serialization/org/apache/harmony/xnet/tests/javax/net/ssl/serialization/SSLProtocolExceptionTest.golden.0.ser longer than 100 characters.
[tar] Entry: harmony-5.0-hdk-1029132/build/test/x-net/resources/serialization/org/apache/harmony/xnet/tests/javax/net/ssl/serialization/SSLProtocolExceptionTest.golden.1.ser longer than 100 characters.
[tar] Entry: harmony-5.0-hdk-1029132/build/test/x-net/resources/serialization/org/apache/harmony/xnet/tests/javax/net/ssl/serialization/SSLProtocolExceptionTest.golden.2.ser longer than 100 characters.
[tar] Entry: harmony-5.0-hdk-1029132/build/test/x-net/resources/serialization/org/apache/harmony/xnet/tests/javax/net/ssl/serialization/SSLSessionBindingEventTest.golden.0.ser longer than 100 characters.
bundle-hdk-zip:
bundle-hdk:
assemble-jdk-doc:
[copy] Copying 2 files to <https://hudson.apache.org/hudson/job/Harmony-1.5-head-linux-x86_64/ws/harmony/target/hdk/jdk>
bundle-jdk-tgz:
[tar] Building tar: <https://hudson.apache.org/hudson/job/Harmony-1.5-head-linux-x86_64/1004/artifact/harmony/target/apache-harmony-5.0-jdk-r1029132-linux-x86_64-snapshot.tar.gz>
bundle-jdk-zip:
bundle-jdk:
assemble-jre-doc:
[copy] Copying 2 files to <https://hudson.apache.org/hudson/job/Harmony-1.5-head-linux-x86_64/ws/harmony/target/hdk/jdk/jre>
bundle-jre-tgz:
[tar] Building tar: <https://hudson.apache.org/hudson/job/Harmony-1.5-head-linux-x86_64/1004/artifact/harmony/target/apache-harmony-5.0-jre-r1029132-linux-x86_64-snapshot.tar.gz>
bundle-jre-zip:
bundle-jre:
snapshot:
BUILD SUCCESSFUL
Total time: 10 minutes 46 seconds
[harmony] $ ant -Dbuild.module=pack200 test
Unable to locate tools.jar. Expected to find it in /usr/lib/jvm/java-6-openjdk/lib/tools.jar
Buildfile: build.xml
[copy] Copying 20 files to <https://hudson.apache.org/hudson/job/Harmony-1.5-head-linux-x86_64/ws/harmony/target/hdk/build/make>
clean-tests:
test:
-get-test-vm-output:
test-jre-vm-info:
[echo] hy.test.vm.name = drl
-test:
[echo] Test Work Dir: ${test.root}
[echo] Test Target Dir: <https://hudson.apache.org/hudson/job/Harmony-1.5-head-linux-x86_64/ws/harmony/target>
[mkdir] Created dir: <https://hudson.apache.org/hudson/job/Harmony-1.5-head-linux-x86_64/ws/harmony/target/hdk/build/test/${test.root}>
[echo] polling pack200/*.xml
-get-test-vm-output:
test-jre-vm-info:
[echo] hy.test.vm.name = drl
test-module:
[echo] Running pack200 Unit Test from pack200_tests.jar
[echo] Tested jre: <https://hudson.apache.org/hudson/job/Harmony-1.5-head-linux-x86_64/ws/harmony/target/hdk/jdk/jre/bin/java>
[mkdir] Created dir: <https://hudson.apache.org/hudson/job/Harmony-1.5-head-linux-x86_64/ws/harmony/target/test_report>
[mkdir] Created dir: <https://hudson.apache.org/hudson/job/Harmony-1.5-head-linux-x86_64/ws/harmony/target/hdk/build/test/pack200/temp/ant>
[mkdir] Created dir: <https://hudson.apache.org/hudson/job/Harmony-1.5-head-linux-x86_64/ws/harmony/target/hdk/build/test/pack200/temp/tmpdir>
[mkdir] Created dir: <https://hudson.apache.org/hudson/job/Harmony-1.5-head-linux-x86_64/ws/harmony/target/hdk/build/test/pack200/temp/user>
[junit] Running org.apache.harmony.pack200.tests.ArchiveTest
[delete] Deleting directory <https://hudson.apache.org/hudson/job/Harmony-1.5-head-linux-x86_64/ws/harmony/target/hdk/build/test/pack200/temp>
touch-failures-file:
touch-errors-file:
-check-for-empty:
-process-empty:
-check-crashed:
-short-report:
-full-report:
[mkdir] Created dir: <https://hudson.apache.org/hudson/job/Harmony-1.5-head-linux-x86_64/ws/harmony/target/test_report/html>
[junitreport] Processing <https://hudson.apache.org/hudson/job/Harmony-1.5-head-linux-x86_64/ws/harmony/target/test_report/html/TESTS-TestSuites.xml> to /tmp/null1470305371
[junitreport] Loading stylesheet jar:file:/usr/share/ant/lib/ant-junit.jar!/org/apache/tools/ant/taskdefs/optional/junit/xsl/junit-frames.xsl
[junitreport] Transform time: 3364ms
[junitreport] Deleting: /tmp/null1470305371
gen-report:
[echo] The test report is in <https://hudson.apache.org/hudson/job/Harmony-1.5-head-linux-x86_64/ws/harmony/target/test_report/html/index.html>
check-test-result:
test:
BUILD SUCCESSFUL
Total time: 16 seconds
[classlib] $ ant -file build.xml -DfindBugs.report=$WORKSPACE/harmony/target/findbugs_report -Dhy.hdk=$WORKSPACE/harmony/target/hdk findbugs
Unable to locate tools.jar. Expected to find it in /usr/lib/jvm/java-6-openjdk/lib/tools.jar
Buildfile: build.xml
BUILD FAILED
<https://hudson.apache.org/hudson/job/Harmony-1.5-head-linux-x86_64/ws/harmony/classlib/build.xml>:79: Property 'common.resources' is not defined
Total time: 0 seconds
[FINDBUGS] Skipping publisher since build result is FAILURE
Recording fingerprints
Archiving artifacts
Recording test results
Failed to send e-mail to hindessm because no e-mail address is known, and no default e-mail domain is configured
Build failed in Hudson: Harmony-1.5-head-linux-x86_64 #1003
Posted by Apache Hudson Server <hu...@hudson.apache.org>.
See <https://hudson.apache.org/hudson/job/Harmony-1.5-head-linux-x86_64/1003/changes>
Changes:
[hindessm] Another attempt to fix the depends download problem.
------------------------------------------
[...truncated 2008 lines...]
[echo] Making "clean" in src/main/native/thrstub/unix
[exec] rm -f <https://hudson.apache.org/hudson/job/Harmony-1.5-head-linux-x86_64/ws/harmony/target/build/classlib/portlib/native/thrstub/hythread.o> <https://hudson.apache.org/hudson/job/Harmony-1.5-head-linux-x86_64/ws/harmony/target/hdk/lib/libhythr.so> <https://hudson.apache.org/hudson/job/Harmony-1.5-head-linux-x86_64/ws/harmony/target/build/classlib/portlib/native/thrstub/libhythr.exp> \
[exec] <https://hudson.apache.org/hudson/job/Harmony-1.5-head-linux-x86_64/ws/harmony/target/hdk/lib/libhythr.so.dbg>
[echo] Making "clean" in src/main/native/port/unix
[exec] rm -f <https://hudson.apache.org/hudson/job/Harmony-1.5-head-linux-x86_64/ws/harmony/target/build/classlib/portlib/native/port/port_copyright.o> <https://hudson.apache.org/hudson/job/Harmony-1.5-head-linux-x86_64/ws/harmony/target/build/classlib/portlib/native/port/hyerror.o> <https://hudson.apache.org/hudson/job/Harmony-1.5-head-linux-x86_64/ws/harmony/target/build/classlib/portlib/native/port/hyerrorhelpers.o> <https://hudson.apache.org/hudson/job/Harmony-1.5-head-linux-x86_64/ws/harmony/target/build/classlib/portlib/native/port/hyexit.o> <https://hudson.apache.org/hudson/job/Harmony-1.5-head-linux-x86_64/ws/harmony/target/build/classlib/portlib/native/port/hyfile.o> <https://hudson.apache.org/hudson/job/Harmony-1.5-head-linux-x86_64/ws/harmony/target/build/classlib/portlib/native/port/hyfiletext.o> <https://hudson.apache.org/hudson/job/Harmony-1.5-head-linux-x86_64/ws/harmony/target/build/classlib/portlib/native/port/hygp.o> <https://hudson.apache.org/hudson/job/Harmony-1.5-head-linux-x86_64/ws/harmony/target/build/classlib/portlib/native/port/hymem.o> <https://hudson.apache.org/hudson/job/Harmony-1.5-head-linux-x86_64/ws/harmony/target/build/classlib/portlib/native/port//hymmap.o> <https://hudson.apache.org/hudson/job/Harmony-1.5-head-linux-x86_64/ws/harmony/target/build/classlib/portlib/native/port/hynls.o> <https://hudson.apache.org/hudson/job/Harmony-1.5-head-linux-x86_64/ws/harmony/target/build/classlib/portlib/native/port/hynlshelpers.o> <https://hudson.apache.org/hudson/job/Harmony-1.5-head-linux-x86_64/ws/harmony/target/build/classlib/portlib/native/port/hyosdump.o> <https://hudson.apache.org/hudson/job/Harmony-1.5-head-linux-x86_64/ws/harmony/target/build/classlib/portlib/native/port/hyport.o> <https://hudson.apache.org/hudson/job/Harmony-1.5-head-linux-x86_64/ws/harmony/target/build/classlib/portlib/native/port/hyportcontrol.o> <https://hudson.apache.org/hudson/job/Harmony-1.5-head-linux-x86_64/ws/harmony/target/build/classlib/portlib/native/port/hyportptb.o> <https://hudson.apache.org/hudson/job/Harmony-1.5-head-linux-x86_64/ws/harmony/target/build/classlib/portlib/native/port/hysharedhelper.o> <https://hudson.apache.org/hudson/job/Harmony-1.5-head-linux-x86_64/ws/harmony/target/build/classlib/portlib/native/port/hysl.o> <https://hudson.apache.org/hudson/job/Harmony-1.5-head-linux-x86_64/ws/harmony/target/build/classlib/portlib/native/port/hysock.o> <https://hudson.apache.org/hudson/job/Harmony-1.5-head-linux-x86_64/ws/harmony/target/build/classlib/portlib/native/port/hystr.o> <https://hudson.apache.org/hudson/job/Harmony-1.5-head-linux-x86_64/ws/harmony/target/build/classlib/portlib/native/port/hystrftime.o> <https://hudson.apache.org/hudson/job/Harmony-1.5-head-linux-x86_64/ws/harmony/target/build/classlib/portlib/native/port/hystsl.o> <https://hudson.apache.org/hudson/job/Harmony-1.5-head-linux-x86_64/ws/harmony/target/build/classlib/portlib/native/port/hysysinfo.o> <https://hudson.apache.org/hudson/job/Harmony-1.5-head-linux-x86_64/ws/harmony/target/build/classlib/portlib/native/port/hytime.o> <https://hudson.apache.org/hudson/job/Harmony-1.5-head-linux-x86_64/ws/harmony/target/build/classlib/portlib/native/port/hytlshelpers.o> <https://hudson.apache.org/hudson/job/Harmony-1.5-head-linux-x86_64/ws/harmony/target/build/classlib/portlib/native/port/hytty.o> <https://hudson.apache.org/hudson/job/Harmony-1.5-head-linux-x86_64/ws/harmony/target/build/classlib/portlib/native/port/hycpu.o> <https://hudson.apache.org/hudson/job/Harmony-1.5-head-linux-x86_64/ws/harmony/target/build/classlib/portlib/native/port/hyipcmutex.o> <https://hudson.apache.org/hudson/job/Harmony-1.5-head-linux-x86_64/ws/harmony/target/build/classlib/portlib/native/port/hyshmem.o> <https://hudson.apache.org/hudson/job/Harmony-1.5-head-linux-x86_64/ws/harmony/target/build/classlib/portlib/native/port/hyshsem.o> <https://hudson.apache.org/hudson/job/Harmony-1.5-head-linux-x86_64/ws/harmony/target/build/classlib/portlib/native/port/hyvmem.o> <https://hudson.apache.org/hudson/job/Harmony-1.5-head-linux-x86_64/ws/harmony/target/hdk/jdk/jre/bin/libhyprt.so> <https://hudson.apache.org/hudson/job/Harmony-1.5-head-linux-x86_64/ws/harmony/target/build/classlib/portlib/native/port/libhyprt.exp> \
[exec] <https://hudson.apache.org/hudson/job/Harmony-1.5-head-linux-x86_64/ws/harmony/target/hdk/jdk/lib/libhyprt.so.dbg>
[echo] Making "clean" in src/main/native/common/unix
[exec] rm -f <https://hudson.apache.org/hudson/job/Harmony-1.5-head-linux-x86_64/ws/harmony/target/build/classlib/portlib/native/common/libglob.o> <https://hudson.apache.org/hudson/job/Harmony-1.5-head-linux-x86_64/ws/harmony/target/build/classlib/portlib/native/common/iohelp.o> <https://hudson.apache.org/hudson/job/Harmony-1.5-head-linux-x86_64/ws/harmony/target/build/classlib/portlib/native/common/exceptions.o> <https://hudson.apache.org/hudson/job/Harmony-1.5-head-linux-x86_64/ws/harmony/target/build/classlib/portlib/native/common/strhelp.o> <https://hudson.apache.org/hudson/job/Harmony-1.5-head-linux-x86_64/ws/harmony/target/build/classlib/portlib/native/common/utf8encode.o> <https://hudson.apache.org/hudson/job/Harmony-1.5-head-linux-x86_64/ws/harmony/target/build/classlib/portlib/native/common/utf8decode.o> <https://hudson.apache.org/hudson/job/Harmony-1.5-head-linux-x86_64/ws/harmony/target/hdk/lib/libhycommon.a> <https://hudson.apache.org/hudson/job/Harmony-1.5-head-linux-x86_64/ws/harmony/target/build/classlib/portlib/native/common/.exp> \
[exec] <https://hudson.apache.org/hudson/job/Harmony-1.5-head-linux-x86_64/ws/harmony/target/hdk/jdk/lib/.dbg>
[echo] Making "clean" in src/main/native/pool/unix
[exec] rm -f <https://hudson.apache.org/hudson/job/Harmony-1.5-head-linux-x86_64/ws/harmony/target/build/classlib/portlib/native/pool/pool.o> <https://hudson.apache.org/hudson/job/Harmony-1.5-head-linux-x86_64/ws/harmony/target/build/classlib/portlib/native/pool/pool_cap.o> <https://hudson.apache.org/hudson/job/Harmony-1.5-head-linux-x86_64/ws/harmony/target/hdk/lib/libhypool.a> <https://hudson.apache.org/hudson/job/Harmony-1.5-head-linux-x86_64/ws/harmony/target/build/classlib/portlib/native/pool/.exp> \
[exec] <https://hudson.apache.org/hudson/job/Harmony-1.5-head-linux-x86_64/ws/harmony/target/hdk/jdk/lib/.dbg>
-clean-test:
[echo] Making "clean" in src/test/native/init/unix
[exec] rm -f ../shared/init.o ../init .exp \
[exec] <https://hudson.apache.org/hudson/job/Harmony-1.5-head-linux-x86_64/ws/harmony/target/hdk/jdk/lib/.dbg>
[echo] Making "clean" in src/test/native/hycpu/unix
[exec] rm -f ../shared/hycpu.o ../../hycunit/hycunit.o ../hycpu .exp \
[exec] ../TEST-*.xml <https://hudson.apache.org/hudson/job/Harmony-1.5-head-linux-x86_64/ws/harmony/target/hdk/jdk/lib/.dbg>
[echo] Making "clean" in src/test/native/hyerror/unix
[exec] rm -f ../shared/hyerror.o ../../hycunit/hycunit.o ../hyerror .exp \
[exec] ../TEST-*.xml <https://hudson.apache.org/hudson/job/Harmony-1.5-head-linux-x86_64/ws/harmony/target/hdk/jdk/lib/.dbg>
[echo] Making "clean" in src/test/native/hyfile/unix
[exec] rm -f ../shared/hyfile.o ../../hycunit/hycunit.o ../hyfile .exp \
[exec] ../TEST-*.xml <https://hudson.apache.org/hudson/job/Harmony-1.5-head-linux-x86_64/ws/harmony/target/hdk/jdk/lib/.dbg>
[echo] Making "clean" in src/test/native/hyfiletext/unix
[exec] rm -f ../shared/hyfiletext.o ../../hycunit/hycunit.o ../hyfiletext .exp \
[exec] ../TEST-*.xml <https://hudson.apache.org/hudson/job/Harmony-1.5-head-linux-x86_64/ws/harmony/target/hdk/jdk/lib/.dbg>
[echo] Making "clean" in src/test/native/hygp/unix
[exec] rm -f ../shared/hygp.o ../../hycunit/hycunit.o ../hygp .exp \
[exec] ../TEST-*.xml <https://hudson.apache.org/hudson/job/Harmony-1.5-head-linux-x86_64/ws/harmony/target/hdk/jdk/lib/.dbg>
[echo] Making "clean" in src/test/native/hymem/unix
[exec] rm -f ../shared/hymem.o ../../hycunit/hycunit.o ../hymem .exp \
[exec] ../TEST-*.xml <https://hudson.apache.org/hudson/job/Harmony-1.5-head-linux-x86_64/ws/harmony/target/hdk/jdk/lib/.dbg>
[echo] Making "clean" in src/test/native/hynls/unix
[exec] rm -f ../shared/hynls.o ../../hycunit/hycunit.o ../hynls .exp \
[exec] ../TEST-*.xml <https://hudson.apache.org/hudson/job/Harmony-1.5-head-linux-x86_64/ws/harmony/target/hdk/jdk/lib/.dbg>
[echo] Making "clean" in src/test/native/hyport/unix
[exec] rm -f ../shared/hyport.o ../../hycunit/hycunit.o ../hyport .exp \
[exec] ../TEST-*.xml <https://hudson.apache.org/hudson/job/Harmony-1.5-head-linux-x86_64/ws/harmony/target/hdk/jdk/lib/.dbg>
[echo] Making "clean" in src/test/native/hystr/unix
[exec] rm -f ../shared/hystr.o ../../hycunit/hycunit.o ../hystr .exp \
[exec] ../TEST-*.xml <https://hudson.apache.org/hudson/job/Harmony-1.5-head-linux-x86_64/ws/harmony/target/hdk/jdk/lib/.dbg>
[echo] Making "clean" in src/test/native/hytime/unix
[exec] rm -f ../shared/hytime.o ../../hycunit/hycunit.o ../hytime .exp \
[exec] ../TEST-*.xml <https://hudson.apache.org/hudson/job/Harmony-1.5-head-linux-x86_64/ws/harmony/target/hdk/jdk/lib/.dbg>
[echo] Making "clean" in src/test/native/hysysinfo/unix
[exec] rm -f ../shared/hysysinfo.o ../../hycunit/hycunit.o ../hysysinfo .exp \
[exec] ../TEST-*.xml <https://hudson.apache.org/hudson/job/Harmony-1.5-head-linux-x86_64/ws/harmony/target/hdk/jdk/lib/.dbg>
[echo] Making "clean" in src/test/native/hyipcmutex/unix
[exec] rm -f ../shared/hyipcmutex.o ../../hycunit/hycunit.o ../hyipcmutex .exp \
[exec] ../TEST-*.xml <https://hudson.apache.org/hudson/job/Harmony-1.5-head-linux-x86_64/ws/harmony/target/hdk/jdk/lib/.dbg>
[echo] Making "clean" in src/test/native/hymmap/unix
[exec] rm -f ../shared/hymmap.o ../../hycunit/hycunit.o ../hymmap .exp \
[exec] ../TEST-*.xml <https://hudson.apache.org/hudson/job/Harmony-1.5-head-linux-x86_64/ws/harmony/target/hdk/jdk/lib/.dbg>
clean:
-class-patternset:
-clean-java:
[delete] Deleting: <https://hudson.apache.org/hudson/job/Harmony-1.5-head-linux-x86_64/ws/harmony/target/hdk/build/ant/patternsets/prefs.txt>
-clean-native:
-clean-test:
clean:
-class-patternset:
-clean-java:
[delete] Deleting: <https://hudson.apache.org/hudson/job/Harmony-1.5-head-linux-x86_64/ws/harmony/target/hdk/build/ant/patternsets/print.txt>
-clean-native:
-clean-test:
clean:
-class-patternset:
-clean-java:
[delete] Deleting: <https://hudson.apache.org/hudson/job/Harmony-1.5-head-linux-x86_64/ws/harmony/target/hdk/build/ant/patternsets/regex.txt>
-clean-test:
clean:
-class-patternset:
-clean-java:
[delete] Deleting: <https://hudson.apache.org/hudson/job/Harmony-1.5-head-linux-x86_64/ws/harmony/target/hdk/build/ant/patternsets/rmi.txt>
-clean-test:
clean:
-class-patternset:
-clean-java:
[delete] Deleting: <https://hudson.apache.org/hudson/job/Harmony-1.5-head-linux-x86_64/ws/harmony/target/hdk/build/ant/patternsets/security-kernel.txt>
clean:
-class-patternset:
-clean-java:
[delete] Deleting: <https://hudson.apache.org/hudson/job/Harmony-1.5-head-linux-x86_64/ws/harmony/target/hdk/build/ant/patternsets/security.txt>
-clean-native:
[echo] Making "clean" in src/main/native/security/unix
[exec] rm -f <https://hudson.apache.org/hudson/job/Harmony-1.5-head-linux-x86_64/ws/harmony/target/build/classlib/security/native/security/security_copyright.o> <https://hudson.apache.org/hudson/job/Harmony-1.5-head-linux-x86_64/ws/harmony/target/build/classlib/security/native/security/getUnixSystemRandom.o> <https://hudson.apache.org/hudson/job/Harmony-1.5-head-linux-x86_64/ws/harmony/target/hdk/jdk/jre/bin/libhysecurity.so> <https://hudson.apache.org/hudson/job/Harmony-1.5-head-linux-x86_64/ws/harmony/target/build/classlib/security/native/security/libhysecurity.exp> \
[exec] <https://hudson.apache.org/hudson/job/Harmony-1.5-head-linux-x86_64/ws/harmony/target/hdk/jdk/lib/libhysecurity.so.dbg>
-clean-test:
clean:
-class-patternset:
-clean-java:
[delete] Deleting: <https://hudson.apache.org/hudson/job/Harmony-1.5-head-linux-x86_64/ws/harmony/target/hdk/build/ant/patternsets/sound.txt>
-clean-test:
clean:
-class-patternset:
-clean-java:
[delete] Deleting: <https://hudson.apache.org/hudson/job/Harmony-1.5-head-linux-x86_64/ws/harmony/target/hdk/build/ant/patternsets/sql.txt>
-clean-test:
clean:
-class-patternset:
-clean-java:
[delete] Deleting: <https://hudson.apache.org/hudson/job/Harmony-1.5-head-linux-x86_64/ws/harmony/target/hdk/build/ant/patternsets/suncompat.txt>
-clean-test:
clean:
-class-patternset:
-clean-java:
[delete] Deleting: <https://hudson.apache.org/hudson/job/Harmony-1.5-head-linux-x86_64/ws/harmony/target/hdk/build/ant/patternsets/swing.txt>
-clean-test:
clean:
-class-patternset:
-clean-java:
[delete] Deleting: <https://hudson.apache.org/hudson/job/Harmony-1.5-head-linux-x86_64/ws/harmony/target/hdk/build/ant/patternsets/text.txt>
-clean-test:
clean:
-class-patternset:
-clean-java:
[delete] Deleting: <https://hudson.apache.org/hudson/job/Harmony-1.5-head-linux-x86_64/ws/harmony/target/hdk/build/ant/patternsets/x-net.txt>
-clean-test:
clean:
-clean-java:
clean:
-clean-java-catch-all-test:
-clean-java-catch-all:
-clean-java-layout:
-clean-check:
-clean-native:
-clean-test:
clean:
clean-vm:
[copy] Copying 20 files to <https://hudson.apache.org/hudson/job/Harmony-1.5-head-linux-x86_64/ws/harmony/target/hdk/build/make>
clean:
clean-tests:
clean:
-init-hdk:
[mkdir] Created dir: <https://hudson.apache.org/hudson/job/Harmony-1.5-head-linux-x86_64/ws/harmony/target/hdk/build/ant>
[copy] Copying 4 files to <https://hudson.apache.org/hudson/job/Harmony-1.5-head-linux-x86_64/ws/harmony/target/hdk/build/ant>
[copy] Copying 1 file to <https://hudson.apache.org/hudson/job/Harmony-1.5-head-linux-x86_64/ws/harmony/target/hdk/build/ant>
[mkdir] Created dir: <https://hudson.apache.org/hudson/job/Harmony-1.5-head-linux-x86_64/ws/harmony/target/hdk/build/make>
[copy] Copying 20 files to <https://hudson.apache.org/hudson/job/Harmony-1.5-head-linux-x86_64/ws/harmony/target/hdk/build/make>
-init-hdk:
[copy] Copying 4 files to <https://hudson.apache.org/hudson/job/Harmony-1.5-head-linux-x86_64/ws/harmony/target/hdk/jdk/include>
auto-fetch-depends-classlib:
-build-classlib:
[copy] Copying 20 files to <https://hudson.apache.org/hudson/job/Harmony-1.5-head-linux-x86_64/ws/harmony/target/hdk/build/make>
Trying to override old definition of task chksum
-init-hdk:
[copy] Copying 20 files to <https://hudson.apache.org/hudson/job/Harmony-1.5-head-linux-x86_64/ws/harmony/target/hdk/build/make>
-check-depends:
-check:
[echo] Checking for <https://hudson.apache.org/hudson/job/Harmony-1.5-head-linux-x86_64/ws/harmony/target/depends/jars/junit_4.6/junit-4.6.jar>
BUILD FAILED
<https://hudson.apache.org/hudson/job/Harmony-1.5-head-linux-x86_64/ws/harmony/build.xml>:480: The following error occurred while executing this line:
<https://hudson.apache.org/hudson/job/Harmony-1.5-head-linux-x86_64/ws/harmony/classlib/build.xml>:567: The following error occurred while executing this line:
<https://hudson.apache.org/hudson/job/Harmony-1.5-head-linux-x86_64/ws/harmony/classlib/make/depends.xml>:35: The following error occurred while executing this line:
<https://hudson.apache.org/hudson/job/Harmony-1.5-head-linux-x86_64/ws/harmony/target/hdk/build/ant/depends.xml>:111: ...
Missing dependency. The file from:
http://downloads.sourceforge.net/sourceforge/junit/junit-4.6.jar?use_mirror=autoselect
should be downloaded (extracted) to:
<https://hudson.apache.org/hudson/job/Harmony-1.5-head-linux-x86_64/ws/harmony/target/depends/jars/junit_4.6/junit-4.6.jar>
Run "ant fetch-depends" to automatically fetch dependencies.
Note: Some of Harmony's dependencies are licensed under terms other
than the Apache License v2.
Total time: 1 minute 39 seconds
[FINDBUGS] Skipping publisher since build result is FAILURE
Recording fingerprints
Archiving artifacts
Recording test results
Failed to send e-mail to hindessm because no e-mail address is known, and no default e-mail domain is configured
Build failed in Hudson: Harmony-1.5-head-linux-x86_64 #1002
Posted by Apache Hudson Server <hu...@hudson.apache.org>.
See <https://hudson.apache.org/hudson/job/Harmony-1.5-head-linux-x86_64/1002/>
------------------------------------------
[...truncated 16825 lines...]
[echo] Making "clean" in src/main/native/thrstub/unix
[exec] rm -f <https://hudson.apache.org/hudson/job/Harmony-1.5-head-linux-x86_64/ws/harmony/target/build/classlib/portlib/native/thrstub/hythread.o> <https://hudson.apache.org/hudson/job/Harmony-1.5-head-linux-x86_64/ws/harmony/target/hdk/lib/libhythr.so> <https://hudson.apache.org/hudson/job/Harmony-1.5-head-linux-x86_64/ws/harmony/target/build/classlib/portlib/native/thrstub/libhythr.exp> \
[exec] <https://hudson.apache.org/hudson/job/Harmony-1.5-head-linux-x86_64/ws/harmony/target/hdk/lib/libhythr.so.dbg>
[echo] Making "clean" in src/main/native/port/unix
[exec] rm -f <https://hudson.apache.org/hudson/job/Harmony-1.5-head-linux-x86_64/ws/harmony/target/build/classlib/portlib/native/port/port_copyright.o> <https://hudson.apache.org/hudson/job/Harmony-1.5-head-linux-x86_64/ws/harmony/target/build/classlib/portlib/native/port/hyerror.o> <https://hudson.apache.org/hudson/job/Harmony-1.5-head-linux-x86_64/ws/harmony/target/build/classlib/portlib/native/port/hyerrorhelpers.o> <https://hudson.apache.org/hudson/job/Harmony-1.5-head-linux-x86_64/ws/harmony/target/build/classlib/portlib/native/port/hyexit.o> <https://hudson.apache.org/hudson/job/Harmony-1.5-head-linux-x86_64/ws/harmony/target/build/classlib/portlib/native/port/hyfile.o> <https://hudson.apache.org/hudson/job/Harmony-1.5-head-linux-x86_64/ws/harmony/target/build/classlib/portlib/native/port/hyfiletext.o> <https://hudson.apache.org/hudson/job/Harmony-1.5-head-linux-x86_64/ws/harmony/target/build/classlib/portlib/native/port/hygp.o> <https://hudson.apache.org/hudson/job/Harmony-1.5-head-linux-x86_64/ws/harmony/target/build/classlib/portlib/native/port/hymem.o> <https://hudson.apache.org/hudson/job/Harmony-1.5-head-linux-x86_64/ws/harmony/target/build/classlib/portlib/native/port//hymmap.o> <https://hudson.apache.org/hudson/job/Harmony-1.5-head-linux-x86_64/ws/harmony/target/build/classlib/portlib/native/port/hynls.o> <https://hudson.apache.org/hudson/job/Harmony-1.5-head-linux-x86_64/ws/harmony/target/build/classlib/portlib/native/port/hynlshelpers.o> <https://hudson.apache.org/hudson/job/Harmony-1.5-head-linux-x86_64/ws/harmony/target/build/classlib/portlib/native/port/hyosdump.o> <https://hudson.apache.org/hudson/job/Harmony-1.5-head-linux-x86_64/ws/harmony/target/build/classlib/portlib/native/port/hyport.o> <https://hudson.apache.org/hudson/job/Harmony-1.5-head-linux-x86_64/ws/harmony/target/build/classlib/portlib/native/port/hyportcontrol.o> <https://hudson.apache.org/hudson/job/Harmony-1.5-head-linux-x86_64/ws/harmony/target/build/classlib/portlib/native/port/hyportptb.o> <https://hudson.apache.org/hudson/job/Harmony-1.5-head-linux-x86_64/ws/harmony/target/build/classlib/portlib/native/port/hysharedhelper.o> <https://hudson.apache.org/hudson/job/Harmony-1.5-head-linux-x86_64/ws/harmony/target/build/classlib/portlib/native/port/hysl.o> <https://hudson.apache.org/hudson/job/Harmony-1.5-head-linux-x86_64/ws/harmony/target/build/classlib/portlib/native/port/hysock.o> <https://hudson.apache.org/hudson/job/Harmony-1.5-head-linux-x86_64/ws/harmony/target/build/classlib/portlib/native/port/hystr.o> <https://hudson.apache.org/hudson/job/Harmony-1.5-head-linux-x86_64/ws/harmony/target/build/classlib/portlib/native/port/hystrftime.o> <https://hudson.apache.org/hudson/job/Harmony-1.5-head-linux-x86_64/ws/harmony/target/build/classlib/portlib/native/port/hystsl.o> <https://hudson.apache.org/hudson/job/Harmony-1.5-head-linux-x86_64/ws/harmony/target/build/classlib/portlib/native/port/hysysinfo.o> <https://hudson.apache.org/hudson/job/Harmony-1.5-head-linux-x86_64/ws/harmony/target/build/classlib/portlib/native/port/hytime.o> <https://hudson.apache.org/hudson/job/Harmony-1.5-head-linux-x86_64/ws/harmony/target/build/classlib/portlib/native/port/hytlshelpers.o> <https://hudson.apache.org/hudson/job/Harmony-1.5-head-linux-x86_64/ws/harmony/target/build/classlib/portlib/native/port/hytty.o> <https://hudson.apache.org/hudson/job/Harmony-1.5-head-linux-x86_64/ws/harmony/target/build/classlib/portlib/native/port/hycpu.o> <https://hudson.apache.org/hudson/job/Harmony-1.5-head-linux-x86_64/ws/harmony/target/build/classlib/portlib/native/port/hyipcmutex.o> <https://hudson.apache.org/hudson/job/Harmony-1.5-head-linux-x86_64/ws/harmony/target/build/classlib/portlib/native/port/hyshmem.o> <https://hudson.apache.org/hudson/job/Harmony-1.5-head-linux-x86_64/ws/harmony/target/build/classlib/portlib/native/port/hyshsem.o> <https://hudson.apache.org/hudson/job/Harmony-1.5-head-linux-x86_64/ws/harmony/target/build/classlib/portlib/native/port/hyvmem.o> <https://hudson.apache.org/hudson/job/Harmony-1.5-head-linux-x86_64/ws/harmony/target/hdk/jdk/jre/bin/libhyprt.so> <https://hudson.apache.org/hudson/job/Harmony-1.5-head-linux-x86_64/ws/harmony/target/build/classlib/portlib/native/port/libhyprt.exp> \
[exec] <https://hudson.apache.org/hudson/job/Harmony-1.5-head-linux-x86_64/ws/harmony/target/hdk/jdk/lib/libhyprt.so.dbg>
[echo] Making "clean" in src/main/native/common/unix
[exec] rm -f <https://hudson.apache.org/hudson/job/Harmony-1.5-head-linux-x86_64/ws/harmony/target/build/classlib/portlib/native/common/libglob.o> <https://hudson.apache.org/hudson/job/Harmony-1.5-head-linux-x86_64/ws/harmony/target/build/classlib/portlib/native/common/iohelp.o> <https://hudson.apache.org/hudson/job/Harmony-1.5-head-linux-x86_64/ws/harmony/target/build/classlib/portlib/native/common/exceptions.o> <https://hudson.apache.org/hudson/job/Harmony-1.5-head-linux-x86_64/ws/harmony/target/build/classlib/portlib/native/common/strhelp.o> <https://hudson.apache.org/hudson/job/Harmony-1.5-head-linux-x86_64/ws/harmony/target/build/classlib/portlib/native/common/utf8encode.o> <https://hudson.apache.org/hudson/job/Harmony-1.5-head-linux-x86_64/ws/harmony/target/build/classlib/portlib/native/common/utf8decode.o> <https://hudson.apache.org/hudson/job/Harmony-1.5-head-linux-x86_64/ws/harmony/target/hdk/lib/libhycommon.a> <https://hudson.apache.org/hudson/job/Harmony-1.5-head-linux-x86_64/ws/harmony/target/build/classlib/portlib/native/common/.exp> \
[exec] <https://hudson.apache.org/hudson/job/Harmony-1.5-head-linux-x86_64/ws/harmony/target/hdk/jdk/lib/.dbg>
[echo] Making "clean" in src/main/native/pool/unix
[exec] rm -f <https://hudson.apache.org/hudson/job/Harmony-1.5-head-linux-x86_64/ws/harmony/target/build/classlib/portlib/native/pool/pool.o> <https://hudson.apache.org/hudson/job/Harmony-1.5-head-linux-x86_64/ws/harmony/target/build/classlib/portlib/native/pool/pool_cap.o> <https://hudson.apache.org/hudson/job/Harmony-1.5-head-linux-x86_64/ws/harmony/target/hdk/lib/libhypool.a> <https://hudson.apache.org/hudson/job/Harmony-1.5-head-linux-x86_64/ws/harmony/target/build/classlib/portlib/native/pool/.exp> \
[exec] <https://hudson.apache.org/hudson/job/Harmony-1.5-head-linux-x86_64/ws/harmony/target/hdk/jdk/lib/.dbg>
-clean-test:
[echo] Making "clean" in src/test/native/init/unix
[exec] rm -f ../shared/init.o ../init .exp \
[exec] <https://hudson.apache.org/hudson/job/Harmony-1.5-head-linux-x86_64/ws/harmony/target/hdk/jdk/lib/.dbg>
[echo] Making "clean" in src/test/native/hycpu/unix
[exec] rm -f ../shared/hycpu.o ../../hycunit/hycunit.o ../hycpu .exp \
[exec] ../TEST-*.xml <https://hudson.apache.org/hudson/job/Harmony-1.5-head-linux-x86_64/ws/harmony/target/hdk/jdk/lib/.dbg>
[echo] Making "clean" in src/test/native/hyerror/unix
[exec] rm -f ../shared/hyerror.o ../../hycunit/hycunit.o ../hyerror .exp \
[exec] ../TEST-*.xml <https://hudson.apache.org/hudson/job/Harmony-1.5-head-linux-x86_64/ws/harmony/target/hdk/jdk/lib/.dbg>
[echo] Making "clean" in src/test/native/hyfile/unix
[exec] rm -f ../shared/hyfile.o ../../hycunit/hycunit.o ../hyfile .exp \
[exec] ../TEST-*.xml <https://hudson.apache.org/hudson/job/Harmony-1.5-head-linux-x86_64/ws/harmony/target/hdk/jdk/lib/.dbg>
[echo] Making "clean" in src/test/native/hyfiletext/unix
[exec] rm -f ../shared/hyfiletext.o ../../hycunit/hycunit.o ../hyfiletext .exp \
[exec] ../TEST-*.xml <https://hudson.apache.org/hudson/job/Harmony-1.5-head-linux-x86_64/ws/harmony/target/hdk/jdk/lib/.dbg>
[echo] Making "clean" in src/test/native/hygp/unix
[exec] rm -f ../shared/hygp.o ../../hycunit/hycunit.o ../hygp .exp \
[exec] ../TEST-*.xml <https://hudson.apache.org/hudson/job/Harmony-1.5-head-linux-x86_64/ws/harmony/target/hdk/jdk/lib/.dbg>
[echo] Making "clean" in src/test/native/hymem/unix
[exec] rm -f ../shared/hymem.o ../../hycunit/hycunit.o ../hymem .exp \
[exec] ../TEST-*.xml <https://hudson.apache.org/hudson/job/Harmony-1.5-head-linux-x86_64/ws/harmony/target/hdk/jdk/lib/.dbg>
[echo] Making "clean" in src/test/native/hynls/unix
[exec] rm -f ../shared/hynls.o ../../hycunit/hycunit.o ../hynls .exp \
[exec] ../TEST-*.xml <https://hudson.apache.org/hudson/job/Harmony-1.5-head-linux-x86_64/ws/harmony/target/hdk/jdk/lib/.dbg>
[echo] Making "clean" in src/test/native/hyport/unix
[exec] rm -f ../shared/hyport.o ../../hycunit/hycunit.o ../hyport .exp \
[exec] ../TEST-*.xml <https://hudson.apache.org/hudson/job/Harmony-1.5-head-linux-x86_64/ws/harmony/target/hdk/jdk/lib/.dbg>
[echo] Making "clean" in src/test/native/hystr/unix
[exec] rm -f ../shared/hystr.o ../../hycunit/hycunit.o ../hystr .exp \
[exec] ../TEST-*.xml <https://hudson.apache.org/hudson/job/Harmony-1.5-head-linux-x86_64/ws/harmony/target/hdk/jdk/lib/.dbg>
[echo] Making "clean" in src/test/native/hytime/unix
[exec] rm -f ../shared/hytime.o ../../hycunit/hycunit.o ../hytime .exp \
[exec] ../TEST-*.xml <https://hudson.apache.org/hudson/job/Harmony-1.5-head-linux-x86_64/ws/harmony/target/hdk/jdk/lib/.dbg>
[echo] Making "clean" in src/test/native/hysysinfo/unix
[exec] rm -f ../shared/hysysinfo.o ../../hycunit/hycunit.o ../hysysinfo .exp \
[exec] ../TEST-*.xml <https://hudson.apache.org/hudson/job/Harmony-1.5-head-linux-x86_64/ws/harmony/target/hdk/jdk/lib/.dbg>
[echo] Making "clean" in src/test/native/hyipcmutex/unix
[exec] rm -f ../shared/hyipcmutex.o ../../hycunit/hycunit.o ../hyipcmutex .exp \
[exec] ../TEST-*.xml <https://hudson.apache.org/hudson/job/Harmony-1.5-head-linux-x86_64/ws/harmony/target/hdk/jdk/lib/.dbg>
[echo] Making "clean" in src/test/native/hymmap/unix
[exec] rm -f ../shared/hymmap.o ../../hycunit/hycunit.o ../hymmap .exp \
[exec] ../TEST-*.xml <https://hudson.apache.org/hudson/job/Harmony-1.5-head-linux-x86_64/ws/harmony/target/hdk/jdk/lib/.dbg>
clean:
-class-patternset:
-clean-java:
[delete] Deleting: <https://hudson.apache.org/hudson/job/Harmony-1.5-head-linux-x86_64/ws/harmony/target/hdk/build/ant/patternsets/prefs.txt>
-clean-native:
-clean-test:
clean:
-class-patternset:
-clean-java:
[delete] Deleting: <https://hudson.apache.org/hudson/job/Harmony-1.5-head-linux-x86_64/ws/harmony/target/hdk/build/ant/patternsets/print.txt>
-clean-native:
-clean-test:
clean:
-class-patternset:
-clean-java:
[delete] Deleting: <https://hudson.apache.org/hudson/job/Harmony-1.5-head-linux-x86_64/ws/harmony/target/hdk/build/ant/patternsets/regex.txt>
-clean-test:
clean:
-class-patternset:
-clean-java:
[delete] Deleting: <https://hudson.apache.org/hudson/job/Harmony-1.5-head-linux-x86_64/ws/harmony/target/hdk/build/ant/patternsets/rmi.txt>
-clean-test:
clean:
-class-patternset:
-clean-java:
[delete] Deleting: <https://hudson.apache.org/hudson/job/Harmony-1.5-head-linux-x86_64/ws/harmony/target/hdk/build/ant/patternsets/security-kernel.txt>
clean:
-class-patternset:
-clean-java:
[delete] Deleting: <https://hudson.apache.org/hudson/job/Harmony-1.5-head-linux-x86_64/ws/harmony/target/hdk/build/ant/patternsets/security.txt>
-clean-native:
[echo] Making "clean" in src/main/native/security/unix
[exec] rm -f <https://hudson.apache.org/hudson/job/Harmony-1.5-head-linux-x86_64/ws/harmony/target/build/classlib/security/native/security/security_copyright.o> <https://hudson.apache.org/hudson/job/Harmony-1.5-head-linux-x86_64/ws/harmony/target/build/classlib/security/native/security/getUnixSystemRandom.o> <https://hudson.apache.org/hudson/job/Harmony-1.5-head-linux-x86_64/ws/harmony/target/hdk/jdk/jre/bin/libhysecurity.so> <https://hudson.apache.org/hudson/job/Harmony-1.5-head-linux-x86_64/ws/harmony/target/build/classlib/security/native/security/libhysecurity.exp> \
[exec] <https://hudson.apache.org/hudson/job/Harmony-1.5-head-linux-x86_64/ws/harmony/target/hdk/jdk/lib/libhysecurity.so.dbg>
-clean-test:
clean:
-class-patternset:
-clean-java:
[delete] Deleting: <https://hudson.apache.org/hudson/job/Harmony-1.5-head-linux-x86_64/ws/harmony/target/hdk/build/ant/patternsets/sound.txt>
-clean-test:
clean:
-class-patternset:
-clean-java:
[delete] Deleting: <https://hudson.apache.org/hudson/job/Harmony-1.5-head-linux-x86_64/ws/harmony/target/hdk/build/ant/patternsets/sql.txt>
-clean-test:
clean:
-class-patternset:
-clean-java:
[delete] Deleting: <https://hudson.apache.org/hudson/job/Harmony-1.5-head-linux-x86_64/ws/harmony/target/hdk/build/ant/patternsets/suncompat.txt>
-clean-test:
clean:
-class-patternset:
-clean-java:
[delete] Deleting: <https://hudson.apache.org/hudson/job/Harmony-1.5-head-linux-x86_64/ws/harmony/target/hdk/build/ant/patternsets/swing.txt>
-clean-test:
clean:
-class-patternset:
-clean-java:
[delete] Deleting: <https://hudson.apache.org/hudson/job/Harmony-1.5-head-linux-x86_64/ws/harmony/target/hdk/build/ant/patternsets/text.txt>
-clean-test:
clean:
-class-patternset:
-clean-java:
[delete] Deleting: <https://hudson.apache.org/hudson/job/Harmony-1.5-head-linux-x86_64/ws/harmony/target/hdk/build/ant/patternsets/x-net.txt>
-clean-test:
clean:
-clean-java:
clean:
-clean-java-catch-all-test:
-clean-java-catch-all:
-clean-java-layout:
-clean-check:
-clean-native:
-clean-test:
clean:
clean-vm:
[copy] Copying 20 files to <https://hudson.apache.org/hudson/job/Harmony-1.5-head-linux-x86_64/ws/harmony/target/hdk/build/make>
clean:
clean-tests:
clean:
-init-hdk:
[mkdir] Created dir: <https://hudson.apache.org/hudson/job/Harmony-1.5-head-linux-x86_64/ws/harmony/target/hdk/build/ant>
[copy] Copying 4 files to <https://hudson.apache.org/hudson/job/Harmony-1.5-head-linux-x86_64/ws/harmony/target/hdk/build/ant>
[copy] Copying 1 file to <https://hudson.apache.org/hudson/job/Harmony-1.5-head-linux-x86_64/ws/harmony/target/hdk/build/ant>
[mkdir] Created dir: <https://hudson.apache.org/hudson/job/Harmony-1.5-head-linux-x86_64/ws/harmony/target/hdk/build/make>
[copy] Copying 20 files to <https://hudson.apache.org/hudson/job/Harmony-1.5-head-linux-x86_64/ws/harmony/target/hdk/build/make>
-init-hdk:
[copy] Copying 4 files to <https://hudson.apache.org/hudson/job/Harmony-1.5-head-linux-x86_64/ws/harmony/target/hdk/jdk/include>
auto-fetch-depends-classlib:
-build-classlib:
[copy] Copying 20 files to <https://hudson.apache.org/hudson/job/Harmony-1.5-head-linux-x86_64/ws/harmony/target/hdk/build/make>
Trying to override old definition of task chksum
-init-hdk:
[copy] Copying 20 files to <https://hudson.apache.org/hudson/job/Harmony-1.5-head-linux-x86_64/ws/harmony/target/hdk/build/make>
-check-depends:
-check:
[echo] Checking for <https://hudson.apache.org/hudson/job/Harmony-1.5-head-linux-x86_64/ws/harmony/target/depends/jars/junit_4.6/junit-4.6.jar>
BUILD FAILED
<https://hudson.apache.org/hudson/job/Harmony-1.5-head-linux-x86_64/ws/harmony/build.xml>:480: The following error occurred while executing this line:
<https://hudson.apache.org/hudson/job/Harmony-1.5-head-linux-x86_64/ws/harmony/classlib/build.xml>:567: The following error occurred while executing this line:
<https://hudson.apache.org/hudson/job/Harmony-1.5-head-linux-x86_64/ws/harmony/classlib/make/depends.xml>:35: The following error occurred while executing this line:
<https://hudson.apache.org/hudson/job/Harmony-1.5-head-linux-x86_64/ws/harmony/target/hdk/build/ant/depends.xml>:109: ...
Missing dependency. The file from:
http://downloads.sourceforge.net/sourceforge/junit/junit-4.6.jar?use_mirror=autoselect
should be downloaded (extracted) to:
<https://hudson.apache.org/hudson/job/Harmony-1.5-head-linux-x86_64/ws/harmony/target/depends/jars/junit_4.6/junit-4.6.jar>
Run "ant fetch-depends" to automatically fetch dependencies.
Note: Some of Harmony's dependencies are licensed under terms other
than the Apache License v2.
Total time: 1 minute 27 seconds
[FINDBUGS] Skipping publisher since build result is FAILURE
Recording fingerprints
Archiving artifacts
Recording test results
Failed to send e-mail to hindessm because no e-mail address is known, and no default e-mail domain is configured
Build failed in Hudson: Harmony-1.5-head-linux-x86_64 #1001
Posted by Apache Hudson Server <hu...@hudson.apache.org>.
See <https://hudson.apache.org/hudson/job/Harmony-1.5-head-linux-x86_64/1001/>
------------------------------------------
[...truncated 2006 lines...]
[echo] Making "clean" in src/main/native/thrstub/unix
[exec] rm -f <https://hudson.apache.org/hudson/job/Harmony-1.5-head-linux-x86_64/ws/harmony/target/build/classlib/portlib/native/thrstub/hythread.o> <https://hudson.apache.org/hudson/job/Harmony-1.5-head-linux-x86_64/ws/harmony/target/hdk/lib/libhythr.so> <https://hudson.apache.org/hudson/job/Harmony-1.5-head-linux-x86_64/ws/harmony/target/build/classlib/portlib/native/thrstub/libhythr.exp> \
[exec] <https://hudson.apache.org/hudson/job/Harmony-1.5-head-linux-x86_64/ws/harmony/target/hdk/lib/libhythr.so.dbg>
[echo] Making "clean" in src/main/native/port/unix
[exec] rm -f <https://hudson.apache.org/hudson/job/Harmony-1.5-head-linux-x86_64/ws/harmony/target/build/classlib/portlib/native/port/port_copyright.o> <https://hudson.apache.org/hudson/job/Harmony-1.5-head-linux-x86_64/ws/harmony/target/build/classlib/portlib/native/port/hyerror.o> <https://hudson.apache.org/hudson/job/Harmony-1.5-head-linux-x86_64/ws/harmony/target/build/classlib/portlib/native/port/hyerrorhelpers.o> <https://hudson.apache.org/hudson/job/Harmony-1.5-head-linux-x86_64/ws/harmony/target/build/classlib/portlib/native/port/hyexit.o> <https://hudson.apache.org/hudson/job/Harmony-1.5-head-linux-x86_64/ws/harmony/target/build/classlib/portlib/native/port/hyfile.o> <https://hudson.apache.org/hudson/job/Harmony-1.5-head-linux-x86_64/ws/harmony/target/build/classlib/portlib/native/port/hyfiletext.o> <https://hudson.apache.org/hudson/job/Harmony-1.5-head-linux-x86_64/ws/harmony/target/build/classlib/portlib/native/port/hygp.o> <https://hudson.apache.org/hudson/job/Harmony-1.5-head-linux-x86_64/ws/harmony/target/build/classlib/portlib/native/port/hymem.o> <https://hudson.apache.org/hudson/job/Harmony-1.5-head-linux-x86_64/ws/harmony/target/build/classlib/portlib/native/port//hymmap.o> <https://hudson.apache.org/hudson/job/Harmony-1.5-head-linux-x86_64/ws/harmony/target/build/classlib/portlib/native/port/hynls.o> <https://hudson.apache.org/hudson/job/Harmony-1.5-head-linux-x86_64/ws/harmony/target/build/classlib/portlib/native/port/hynlshelpers.o> <https://hudson.apache.org/hudson/job/Harmony-1.5-head-linux-x86_64/ws/harmony/target/build/classlib/portlib/native/port/hyosdump.o> <https://hudson.apache.org/hudson/job/Harmony-1.5-head-linux-x86_64/ws/harmony/target/build/classlib/portlib/native/port/hyport.o> <https://hudson.apache.org/hudson/job/Harmony-1.5-head-linux-x86_64/ws/harmony/target/build/classlib/portlib/native/port/hyportcontrol.o> <https://hudson.apache.org/hudson/job/Harmony-1.5-head-linux-x86_64/ws/harmony/target/build/classlib/portlib/native/port/hyportptb.o> <https://hudson.apache.org/hudson/job/Harmony-1.5-head-linux-x86_64/ws/harmony/target/build/classlib/portlib/native/port/hysharedhelper.o> <https://hudson.apache.org/hudson/job/Harmony-1.5-head-linux-x86_64/ws/harmony/target/build/classlib/portlib/native/port/hysl.o> <https://hudson.apache.org/hudson/job/Harmony-1.5-head-linux-x86_64/ws/harmony/target/build/classlib/portlib/native/port/hysock.o> <https://hudson.apache.org/hudson/job/Harmony-1.5-head-linux-x86_64/ws/harmony/target/build/classlib/portlib/native/port/hystr.o> <https://hudson.apache.org/hudson/job/Harmony-1.5-head-linux-x86_64/ws/harmony/target/build/classlib/portlib/native/port/hystrftime.o> <https://hudson.apache.org/hudson/job/Harmony-1.5-head-linux-x86_64/ws/harmony/target/build/classlib/portlib/native/port/hystsl.o> <https://hudson.apache.org/hudson/job/Harmony-1.5-head-linux-x86_64/ws/harmony/target/build/classlib/portlib/native/port/hysysinfo.o> <https://hudson.apache.org/hudson/job/Harmony-1.5-head-linux-x86_64/ws/harmony/target/build/classlib/portlib/native/port/hytime.o> <https://hudson.apache.org/hudson/job/Harmony-1.5-head-linux-x86_64/ws/harmony/target/build/classlib/portlib/native/port/hytlshelpers.o> <https://hudson.apache.org/hudson/job/Harmony-1.5-head-linux-x86_64/ws/harmony/target/build/classlib/portlib/native/port/hytty.o> <https://hudson.apache.org/hudson/job/Harmony-1.5-head-linux-x86_64/ws/harmony/target/build/classlib/portlib/native/port/hycpu.o> <https://hudson.apache.org/hudson/job/Harmony-1.5-head-linux-x86_64/ws/harmony/target/build/classlib/portlib/native/port/hyipcmutex.o> <https://hudson.apache.org/hudson/job/Harmony-1.5-head-linux-x86_64/ws/harmony/target/build/classlib/portlib/native/port/hyshmem.o> <https://hudson.apache.org/hudson/job/Harmony-1.5-head-linux-x86_64/ws/harmony/target/build/classlib/portlib/native/port/hyshsem.o> <https://hudson.apache.org/hudson/job/Harmony-1.5-head-linux-x86_64/ws/harmony/target/build/classlib/portlib/native/port/hyvmem.o> <https://hudson.apache.org/hudson/job/Harmony-1.5-head-linux-x86_64/ws/harmony/target/hdk/jdk/jre/bin/libhyprt.so> <https://hudson.apache.org/hudson/job/Harmony-1.5-head-linux-x86_64/ws/harmony/target/build/classlib/portlib/native/port/libhyprt.exp> \
[exec] <https://hudson.apache.org/hudson/job/Harmony-1.5-head-linux-x86_64/ws/harmony/target/hdk/jdk/lib/libhyprt.so.dbg>
[echo] Making "clean" in src/main/native/common/unix
[exec] rm -f <https://hudson.apache.org/hudson/job/Harmony-1.5-head-linux-x86_64/ws/harmony/target/build/classlib/portlib/native/common/libglob.o> <https://hudson.apache.org/hudson/job/Harmony-1.5-head-linux-x86_64/ws/harmony/target/build/classlib/portlib/native/common/iohelp.o> <https://hudson.apache.org/hudson/job/Harmony-1.5-head-linux-x86_64/ws/harmony/target/build/classlib/portlib/native/common/exceptions.o> <https://hudson.apache.org/hudson/job/Harmony-1.5-head-linux-x86_64/ws/harmony/target/build/classlib/portlib/native/common/strhelp.o> <https://hudson.apache.org/hudson/job/Harmony-1.5-head-linux-x86_64/ws/harmony/target/build/classlib/portlib/native/common/utf8encode.o> <https://hudson.apache.org/hudson/job/Harmony-1.5-head-linux-x86_64/ws/harmony/target/build/classlib/portlib/native/common/utf8decode.o> <https://hudson.apache.org/hudson/job/Harmony-1.5-head-linux-x86_64/ws/harmony/target/hdk/lib/libhycommon.a> <https://hudson.apache.org/hudson/job/Harmony-1.5-head-linux-x86_64/ws/harmony/target/build/classlib/portlib/native/common/.exp> \
[exec] <https://hudson.apache.org/hudson/job/Harmony-1.5-head-linux-x86_64/ws/harmony/target/hdk/jdk/lib/.dbg>
[echo] Making "clean" in src/main/native/pool/unix
[exec] rm -f <https://hudson.apache.org/hudson/job/Harmony-1.5-head-linux-x86_64/ws/harmony/target/build/classlib/portlib/native/pool/pool.o> <https://hudson.apache.org/hudson/job/Harmony-1.5-head-linux-x86_64/ws/harmony/target/build/classlib/portlib/native/pool/pool_cap.o> <https://hudson.apache.org/hudson/job/Harmony-1.5-head-linux-x86_64/ws/harmony/target/hdk/lib/libhypool.a> <https://hudson.apache.org/hudson/job/Harmony-1.5-head-linux-x86_64/ws/harmony/target/build/classlib/portlib/native/pool/.exp> \
[exec] <https://hudson.apache.org/hudson/job/Harmony-1.5-head-linux-x86_64/ws/harmony/target/hdk/jdk/lib/.dbg>
-clean-test:
[echo] Making "clean" in src/test/native/init/unix
[exec] rm -f ../shared/init.o ../init .exp \
[exec] <https://hudson.apache.org/hudson/job/Harmony-1.5-head-linux-x86_64/ws/harmony/target/hdk/jdk/lib/.dbg>
[echo] Making "clean" in src/test/native/hycpu/unix
[exec] rm -f ../shared/hycpu.o ../../hycunit/hycunit.o ../hycpu .exp \
[exec] ../TEST-*.xml <https://hudson.apache.org/hudson/job/Harmony-1.5-head-linux-x86_64/ws/harmony/target/hdk/jdk/lib/.dbg>
[echo] Making "clean" in src/test/native/hyerror/unix
[exec] rm -f ../shared/hyerror.o ../../hycunit/hycunit.o ../hyerror .exp \
[exec] ../TEST-*.xml <https://hudson.apache.org/hudson/job/Harmony-1.5-head-linux-x86_64/ws/harmony/target/hdk/jdk/lib/.dbg>
[echo] Making "clean" in src/test/native/hyfile/unix
[exec] rm -f ../shared/hyfile.o ../../hycunit/hycunit.o ../hyfile .exp \
[exec] ../TEST-*.xml <https://hudson.apache.org/hudson/job/Harmony-1.5-head-linux-x86_64/ws/harmony/target/hdk/jdk/lib/.dbg>
[echo] Making "clean" in src/test/native/hyfiletext/unix
[exec] rm -f ../shared/hyfiletext.o ../../hycunit/hycunit.o ../hyfiletext .exp \
[exec] ../TEST-*.xml <https://hudson.apache.org/hudson/job/Harmony-1.5-head-linux-x86_64/ws/harmony/target/hdk/jdk/lib/.dbg>
[echo] Making "clean" in src/test/native/hygp/unix
[exec] rm -f ../shared/hygp.o ../../hycunit/hycunit.o ../hygp .exp \
[exec] ../TEST-*.xml <https://hudson.apache.org/hudson/job/Harmony-1.5-head-linux-x86_64/ws/harmony/target/hdk/jdk/lib/.dbg>
[echo] Making "clean" in src/test/native/hymem/unix
[exec] rm -f ../shared/hymem.o ../../hycunit/hycunit.o ../hymem .exp \
[exec] ../TEST-*.xml <https://hudson.apache.org/hudson/job/Harmony-1.5-head-linux-x86_64/ws/harmony/target/hdk/jdk/lib/.dbg>
[echo] Making "clean" in src/test/native/hynls/unix
[exec] rm -f ../shared/hynls.o ../../hycunit/hycunit.o ../hynls .exp \
[exec] ../TEST-*.xml <https://hudson.apache.org/hudson/job/Harmony-1.5-head-linux-x86_64/ws/harmony/target/hdk/jdk/lib/.dbg>
[echo] Making "clean" in src/test/native/hyport/unix
[exec] rm -f ../shared/hyport.o ../../hycunit/hycunit.o ../hyport .exp \
[exec] ../TEST-*.xml <https://hudson.apache.org/hudson/job/Harmony-1.5-head-linux-x86_64/ws/harmony/target/hdk/jdk/lib/.dbg>
[echo] Making "clean" in src/test/native/hystr/unix
[exec] rm -f ../shared/hystr.o ../../hycunit/hycunit.o ../hystr .exp \
[exec] ../TEST-*.xml <https://hudson.apache.org/hudson/job/Harmony-1.5-head-linux-x86_64/ws/harmony/target/hdk/jdk/lib/.dbg>
[echo] Making "clean" in src/test/native/hytime/unix
[exec] rm -f ../shared/hytime.o ../../hycunit/hycunit.o ../hytime .exp \
[exec] ../TEST-*.xml <https://hudson.apache.org/hudson/job/Harmony-1.5-head-linux-x86_64/ws/harmony/target/hdk/jdk/lib/.dbg>
[echo] Making "clean" in src/test/native/hysysinfo/unix
[exec] rm -f ../shared/hysysinfo.o ../../hycunit/hycunit.o ../hysysinfo .exp \
[exec] ../TEST-*.xml <https://hudson.apache.org/hudson/job/Harmony-1.5-head-linux-x86_64/ws/harmony/target/hdk/jdk/lib/.dbg>
[echo] Making "clean" in src/test/native/hyipcmutex/unix
[exec] rm -f ../shared/hyipcmutex.o ../../hycunit/hycunit.o ../hyipcmutex .exp \
[exec] ../TEST-*.xml <https://hudson.apache.org/hudson/job/Harmony-1.5-head-linux-x86_64/ws/harmony/target/hdk/jdk/lib/.dbg>
[echo] Making "clean" in src/test/native/hymmap/unix
[exec] rm -f ../shared/hymmap.o ../../hycunit/hycunit.o ../hymmap .exp \
[exec] ../TEST-*.xml <https://hudson.apache.org/hudson/job/Harmony-1.5-head-linux-x86_64/ws/harmony/target/hdk/jdk/lib/.dbg>
clean:
-class-patternset:
-clean-java:
[delete] Deleting: <https://hudson.apache.org/hudson/job/Harmony-1.5-head-linux-x86_64/ws/harmony/target/hdk/build/ant/patternsets/prefs.txt>
-clean-native:
-clean-test:
clean:
-class-patternset:
-clean-java:
[delete] Deleting: <https://hudson.apache.org/hudson/job/Harmony-1.5-head-linux-x86_64/ws/harmony/target/hdk/build/ant/patternsets/print.txt>
-clean-native:
-clean-test:
clean:
-class-patternset:
-clean-java:
[delete] Deleting: <https://hudson.apache.org/hudson/job/Harmony-1.5-head-linux-x86_64/ws/harmony/target/hdk/build/ant/patternsets/regex.txt>
-clean-test:
clean:
-class-patternset:
-clean-java:
[delete] Deleting: <https://hudson.apache.org/hudson/job/Harmony-1.5-head-linux-x86_64/ws/harmony/target/hdk/build/ant/patternsets/rmi.txt>
-clean-test:
clean:
-class-patternset:
-clean-java:
[delete] Deleting: <https://hudson.apache.org/hudson/job/Harmony-1.5-head-linux-x86_64/ws/harmony/target/hdk/build/ant/patternsets/security-kernel.txt>
clean:
-class-patternset:
-clean-java:
[delete] Deleting: <https://hudson.apache.org/hudson/job/Harmony-1.5-head-linux-x86_64/ws/harmony/target/hdk/build/ant/patternsets/security.txt>
-clean-native:
[echo] Making "clean" in src/main/native/security/unix
[exec] rm -f <https://hudson.apache.org/hudson/job/Harmony-1.5-head-linux-x86_64/ws/harmony/target/build/classlib/security/native/security/security_copyright.o> <https://hudson.apache.org/hudson/job/Harmony-1.5-head-linux-x86_64/ws/harmony/target/build/classlib/security/native/security/getUnixSystemRandom.o> <https://hudson.apache.org/hudson/job/Harmony-1.5-head-linux-x86_64/ws/harmony/target/hdk/jdk/jre/bin/libhysecurity.so> <https://hudson.apache.org/hudson/job/Harmony-1.5-head-linux-x86_64/ws/harmony/target/build/classlib/security/native/security/libhysecurity.exp> \
[exec] <https://hudson.apache.org/hudson/job/Harmony-1.5-head-linux-x86_64/ws/harmony/target/hdk/jdk/lib/libhysecurity.so.dbg>
-clean-test:
clean:
-class-patternset:
-clean-java:
[delete] Deleting: <https://hudson.apache.org/hudson/job/Harmony-1.5-head-linux-x86_64/ws/harmony/target/hdk/build/ant/patternsets/sound.txt>
-clean-test:
clean:
-class-patternset:
-clean-java:
[delete] Deleting: <https://hudson.apache.org/hudson/job/Harmony-1.5-head-linux-x86_64/ws/harmony/target/hdk/build/ant/patternsets/sql.txt>
-clean-test:
clean:
-class-patternset:
-clean-java:
[delete] Deleting: <https://hudson.apache.org/hudson/job/Harmony-1.5-head-linux-x86_64/ws/harmony/target/hdk/build/ant/patternsets/suncompat.txt>
-clean-test:
clean:
-class-patternset:
-clean-java:
[delete] Deleting: <https://hudson.apache.org/hudson/job/Harmony-1.5-head-linux-x86_64/ws/harmony/target/hdk/build/ant/patternsets/swing.txt>
-clean-test:
clean:
-class-patternset:
-clean-java:
[delete] Deleting: <https://hudson.apache.org/hudson/job/Harmony-1.5-head-linux-x86_64/ws/harmony/target/hdk/build/ant/patternsets/text.txt>
-clean-test:
clean:
-class-patternset:
-clean-java:
[delete] Deleting: <https://hudson.apache.org/hudson/job/Harmony-1.5-head-linux-x86_64/ws/harmony/target/hdk/build/ant/patternsets/x-net.txt>
-clean-test:
clean:
-clean-java:
clean:
-clean-java-catch-all-test:
-clean-java-catch-all:
-clean-java-layout:
-clean-check:
-clean-native:
-clean-test:
clean:
clean-vm:
[copy] Copying 20 files to <https://hudson.apache.org/hudson/job/Harmony-1.5-head-linux-x86_64/ws/harmony/target/hdk/build/make>
clean:
clean-tests:
clean:
-init-hdk:
[mkdir] Created dir: <https://hudson.apache.org/hudson/job/Harmony-1.5-head-linux-x86_64/ws/harmony/target/hdk/build/ant>
[copy] Copying 4 files to <https://hudson.apache.org/hudson/job/Harmony-1.5-head-linux-x86_64/ws/harmony/target/hdk/build/ant>
[copy] Copying 1 file to <https://hudson.apache.org/hudson/job/Harmony-1.5-head-linux-x86_64/ws/harmony/target/hdk/build/ant>
[mkdir] Created dir: <https://hudson.apache.org/hudson/job/Harmony-1.5-head-linux-x86_64/ws/harmony/target/hdk/build/make>
[copy] Copying 20 files to <https://hudson.apache.org/hudson/job/Harmony-1.5-head-linux-x86_64/ws/harmony/target/hdk/build/make>
-init-hdk:
[copy] Copying 4 files to <https://hudson.apache.org/hudson/job/Harmony-1.5-head-linux-x86_64/ws/harmony/target/hdk/jdk/include>
auto-fetch-depends-classlib:
-build-classlib:
[copy] Copying 20 files to <https://hudson.apache.org/hudson/job/Harmony-1.5-head-linux-x86_64/ws/harmony/target/hdk/build/make>
Trying to override old definition of task chksum
-init-hdk:
[copy] Copying 20 files to <https://hudson.apache.org/hudson/job/Harmony-1.5-head-linux-x86_64/ws/harmony/target/hdk/build/make>
-check-depends:
-check:
[echo] Checking for <https://hudson.apache.org/hudson/job/Harmony-1.5-head-linux-x86_64/ws/harmony/target/depends/jars/junit_4.6/junit-4.6.jar>
BUILD FAILED
<https://hudson.apache.org/hudson/job/Harmony-1.5-head-linux-x86_64/ws/harmony/build.xml>:480: The following error occurred while executing this line:
<https://hudson.apache.org/hudson/job/Harmony-1.5-head-linux-x86_64/ws/harmony/classlib/build.xml>:567: The following error occurred while executing this line:
<https://hudson.apache.org/hudson/job/Harmony-1.5-head-linux-x86_64/ws/harmony/classlib/make/depends.xml>:35: The following error occurred while executing this line:
<https://hudson.apache.org/hudson/job/Harmony-1.5-head-linux-x86_64/ws/harmony/target/hdk/build/ant/depends.xml>:109: ...
Missing dependency. The file from:
http://downloads.sourceforge.net/sourceforge/junit/junit-4.6.jar?use_mirror=autoselect
should be downloaded (extracted) to:
<https://hudson.apache.org/hudson/job/Harmony-1.5-head-linux-x86_64/ws/harmony/target/depends/jars/junit_4.6/junit-4.6.jar>
Run "ant fetch-depends" to automatically fetch dependencies.
Note: Some of Harmony's dependencies are licensed under terms other
than the Apache License v2.
Total time: 1 minute 28 seconds
[FINDBUGS] Skipping publisher since build result is FAILURE
Recording fingerprints
Archiving artifacts
Recording test results
Failed to send e-mail to hindessm because no e-mail address is known, and no default e-mail domain is configured
Build failed in Hudson: Harmony-1.5-head-linux-x86_64 #1000
Posted by Apache Hudson Server <hu...@hudson.apache.org>.
See <https://hudson.apache.org/hudson/job/Harmony-1.5-head-linux-x86_64/1000/changes>
Changes:
[hindessm] junit.jar download works for me (and others I've spoken to) but I'd like
to fix the hudson build problem so let's see if downloading from the
upstream download site helps.
------------------------------------------
[...truncated 2012 lines...]
[echo] Making "clean" in src/main/native/thrstub/unix
[exec] rm -f <https://hudson.apache.org/hudson/job/Harmony-1.5-head-linux-x86_64/ws/harmony/target/build/classlib/portlib/native/thrstub/hythread.o> <https://hudson.apache.org/hudson/job/Harmony-1.5-head-linux-x86_64/ws/harmony/target/hdk/lib/libhythr.so> <https://hudson.apache.org/hudson/job/Harmony-1.5-head-linux-x86_64/ws/harmony/target/build/classlib/portlib/native/thrstub/libhythr.exp> \
[exec] <https://hudson.apache.org/hudson/job/Harmony-1.5-head-linux-x86_64/ws/harmony/target/hdk/lib/libhythr.so.dbg>
[echo] Making "clean" in src/main/native/port/unix
[exec] rm -f <https://hudson.apache.org/hudson/job/Harmony-1.5-head-linux-x86_64/ws/harmony/target/build/classlib/portlib/native/port/port_copyright.o> <https://hudson.apache.org/hudson/job/Harmony-1.5-head-linux-x86_64/ws/harmony/target/build/classlib/portlib/native/port/hyerror.o> <https://hudson.apache.org/hudson/job/Harmony-1.5-head-linux-x86_64/ws/harmony/target/build/classlib/portlib/native/port/hyerrorhelpers.o> <https://hudson.apache.org/hudson/job/Harmony-1.5-head-linux-x86_64/ws/harmony/target/build/classlib/portlib/native/port/hyexit.o> <https://hudson.apache.org/hudson/job/Harmony-1.5-head-linux-x86_64/ws/harmony/target/build/classlib/portlib/native/port/hyfile.o> <https://hudson.apache.org/hudson/job/Harmony-1.5-head-linux-x86_64/ws/harmony/target/build/classlib/portlib/native/port/hyfiletext.o> <https://hudson.apache.org/hudson/job/Harmony-1.5-head-linux-x86_64/ws/harmony/target/build/classlib/portlib/native/port/hygp.o> <https://hudson.apache.org/hudson/job/Harmony-1.5-head-linux-x86_64/ws/harmony/target/build/classlib/portlib/native/port/hymem.o> <https://hudson.apache.org/hudson/job/Harmony-1.5-head-linux-x86_64/ws/harmony/target/build/classlib/portlib/native/port//hymmap.o> <https://hudson.apache.org/hudson/job/Harmony-1.5-head-linux-x86_64/ws/harmony/target/build/classlib/portlib/native/port/hynls.o> <https://hudson.apache.org/hudson/job/Harmony-1.5-head-linux-x86_64/ws/harmony/target/build/classlib/portlib/native/port/hynlshelpers.o> <https://hudson.apache.org/hudson/job/Harmony-1.5-head-linux-x86_64/ws/harmony/target/build/classlib/portlib/native/port/hyosdump.o> <https://hudson.apache.org/hudson/job/Harmony-1.5-head-linux-x86_64/ws/harmony/target/build/classlib/portlib/native/port/hyport.o> <https://hudson.apache.org/hudson/job/Harmony-1.5-head-linux-x86_64/ws/harmony/target/build/classlib/portlib/native/port/hyportcontrol.o> <https://hudson.apache.org/hudson/job/Harmony-1.5-head-linux-x86_64/ws/harmony/target/build/classlib/portlib/native/port/hyportptb.o> <https://hudson.apache.org/hudson/job/Harmony-1.5-head-linux-x86_64/ws/harmony/target/build/classlib/portlib/native/port/hysharedhelper.o> <https://hudson.apache.org/hudson/job/Harmony-1.5-head-linux-x86_64/ws/harmony/target/build/classlib/portlib/native/port/hysl.o> <https://hudson.apache.org/hudson/job/Harmony-1.5-head-linux-x86_64/ws/harmony/target/build/classlib/portlib/native/port/hysock.o> <https://hudson.apache.org/hudson/job/Harmony-1.5-head-linux-x86_64/ws/harmony/target/build/classlib/portlib/native/port/hystr.o> <https://hudson.apache.org/hudson/job/Harmony-1.5-head-linux-x86_64/ws/harmony/target/build/classlib/portlib/native/port/hystrftime.o> <https://hudson.apache.org/hudson/job/Harmony-1.5-head-linux-x86_64/ws/harmony/target/build/classlib/portlib/native/port/hystsl.o> <https://hudson.apache.org/hudson/job/Harmony-1.5-head-linux-x86_64/ws/harmony/target/build/classlib/portlib/native/port/hysysinfo.o> <https://hudson.apache.org/hudson/job/Harmony-1.5-head-linux-x86_64/ws/harmony/target/build/classlib/portlib/native/port/hytime.o> <https://hudson.apache.org/hudson/job/Harmony-1.5-head-linux-x86_64/ws/harmony/target/build/classlib/portlib/native/port/hytlshelpers.o> <https://hudson.apache.org/hudson/job/Harmony-1.5-head-linux-x86_64/ws/harmony/target/build/classlib/portlib/native/port/hytty.o> <https://hudson.apache.org/hudson/job/Harmony-1.5-head-linux-x86_64/ws/harmony/target/build/classlib/portlib/native/port/hycpu.o> <https://hudson.apache.org/hudson/job/Harmony-1.5-head-linux-x86_64/ws/harmony/target/build/classlib/portlib/native/port/hyipcmutex.o> <https://hudson.apache.org/hudson/job/Harmony-1.5-head-linux-x86_64/ws/harmony/target/build/classlib/portlib/native/port/hyshmem.o> <https://hudson.apache.org/hudson/job/Harmony-1.5-head-linux-x86_64/ws/harmony/target/build/classlib/portlib/native/port/hyshsem.o> <https://hudson.apache.org/hudson/job/Harmony-1.5-head-linux-x86_64/ws/harmony/target/build/classlib/portlib/native/port/hyvmem.o> <https://hudson.apache.org/hudson/job/Harmony-1.5-head-linux-x86_64/ws/harmony/target/hdk/jdk/jre/bin/libhyprt.so> <https://hudson.apache.org/hudson/job/Harmony-1.5-head-linux-x86_64/ws/harmony/target/build/classlib/portlib/native/port/libhyprt.exp> \
[exec] <https://hudson.apache.org/hudson/job/Harmony-1.5-head-linux-x86_64/ws/harmony/target/hdk/jdk/lib/libhyprt.so.dbg>
[echo] Making "clean" in src/main/native/common/unix
[exec] rm -f <https://hudson.apache.org/hudson/job/Harmony-1.5-head-linux-x86_64/ws/harmony/target/build/classlib/portlib/native/common/libglob.o> <https://hudson.apache.org/hudson/job/Harmony-1.5-head-linux-x86_64/ws/harmony/target/build/classlib/portlib/native/common/iohelp.o> <https://hudson.apache.org/hudson/job/Harmony-1.5-head-linux-x86_64/ws/harmony/target/build/classlib/portlib/native/common/exceptions.o> <https://hudson.apache.org/hudson/job/Harmony-1.5-head-linux-x86_64/ws/harmony/target/build/classlib/portlib/native/common/strhelp.o> <https://hudson.apache.org/hudson/job/Harmony-1.5-head-linux-x86_64/ws/harmony/target/build/classlib/portlib/native/common/utf8encode.o> <https://hudson.apache.org/hudson/job/Harmony-1.5-head-linux-x86_64/ws/harmony/target/build/classlib/portlib/native/common/utf8decode.o> <https://hudson.apache.org/hudson/job/Harmony-1.5-head-linux-x86_64/ws/harmony/target/hdk/lib/libhycommon.a> <https://hudson.apache.org/hudson/job/Harmony-1.5-head-linux-x86_64/ws/harmony/target/build/classlib/portlib/native/common/.exp> \
[exec] <https://hudson.apache.org/hudson/job/Harmony-1.5-head-linux-x86_64/ws/harmony/target/hdk/jdk/lib/.dbg>
[echo] Making "clean" in src/main/native/pool/unix
[exec] rm -f <https://hudson.apache.org/hudson/job/Harmony-1.5-head-linux-x86_64/ws/harmony/target/build/classlib/portlib/native/pool/pool.o> <https://hudson.apache.org/hudson/job/Harmony-1.5-head-linux-x86_64/ws/harmony/target/build/classlib/portlib/native/pool/pool_cap.o> <https://hudson.apache.org/hudson/job/Harmony-1.5-head-linux-x86_64/ws/harmony/target/hdk/lib/libhypool.a> <https://hudson.apache.org/hudson/job/Harmony-1.5-head-linux-x86_64/ws/harmony/target/build/classlib/portlib/native/pool/.exp> \
[exec] <https://hudson.apache.org/hudson/job/Harmony-1.5-head-linux-x86_64/ws/harmony/target/hdk/jdk/lib/.dbg>
-clean-test:
[echo] Making "clean" in src/test/native/init/unix
[exec] rm -f ../shared/init.o ../init .exp \
[exec] <https://hudson.apache.org/hudson/job/Harmony-1.5-head-linux-x86_64/ws/harmony/target/hdk/jdk/lib/.dbg>
[echo] Making "clean" in src/test/native/hycpu/unix
[exec] rm -f ../shared/hycpu.o ../../hycunit/hycunit.o ../hycpu .exp \
[exec] ../TEST-*.xml <https://hudson.apache.org/hudson/job/Harmony-1.5-head-linux-x86_64/ws/harmony/target/hdk/jdk/lib/.dbg>
[echo] Making "clean" in src/test/native/hyerror/unix
[exec] rm -f ../shared/hyerror.o ../../hycunit/hycunit.o ../hyerror .exp \
[exec] ../TEST-*.xml <https://hudson.apache.org/hudson/job/Harmony-1.5-head-linux-x86_64/ws/harmony/target/hdk/jdk/lib/.dbg>
[echo] Making "clean" in src/test/native/hyfile/unix
[exec] rm -f ../shared/hyfile.o ../../hycunit/hycunit.o ../hyfile .exp \
[exec] ../TEST-*.xml <https://hudson.apache.org/hudson/job/Harmony-1.5-head-linux-x86_64/ws/harmony/target/hdk/jdk/lib/.dbg>
[echo] Making "clean" in src/test/native/hyfiletext/unix
[exec] rm -f ../shared/hyfiletext.o ../../hycunit/hycunit.o ../hyfiletext .exp \
[exec] ../TEST-*.xml <https://hudson.apache.org/hudson/job/Harmony-1.5-head-linux-x86_64/ws/harmony/target/hdk/jdk/lib/.dbg>
[echo] Making "clean" in src/test/native/hygp/unix
[exec] rm -f ../shared/hygp.o ../../hycunit/hycunit.o ../hygp .exp \
[exec] ../TEST-*.xml <https://hudson.apache.org/hudson/job/Harmony-1.5-head-linux-x86_64/ws/harmony/target/hdk/jdk/lib/.dbg>
[echo] Making "clean" in src/test/native/hymem/unix
[exec] rm -f ../shared/hymem.o ../../hycunit/hycunit.o ../hymem .exp \
[exec] ../TEST-*.xml <https://hudson.apache.org/hudson/job/Harmony-1.5-head-linux-x86_64/ws/harmony/target/hdk/jdk/lib/.dbg>
[echo] Making "clean" in src/test/native/hynls/unix
[exec] rm -f ../shared/hynls.o ../../hycunit/hycunit.o ../hynls .exp \
[exec] ../TEST-*.xml <https://hudson.apache.org/hudson/job/Harmony-1.5-head-linux-x86_64/ws/harmony/target/hdk/jdk/lib/.dbg>
[echo] Making "clean" in src/test/native/hyport/unix
[exec] rm -f ../shared/hyport.o ../../hycunit/hycunit.o ../hyport .exp \
[exec] ../TEST-*.xml <https://hudson.apache.org/hudson/job/Harmony-1.5-head-linux-x86_64/ws/harmony/target/hdk/jdk/lib/.dbg>
[echo] Making "clean" in src/test/native/hystr/unix
[exec] rm -f ../shared/hystr.o ../../hycunit/hycunit.o ../hystr .exp \
[exec] ../TEST-*.xml <https://hudson.apache.org/hudson/job/Harmony-1.5-head-linux-x86_64/ws/harmony/target/hdk/jdk/lib/.dbg>
[echo] Making "clean" in src/test/native/hytime/unix
[exec] rm -f ../shared/hytime.o ../../hycunit/hycunit.o ../hytime .exp \
[exec] ../TEST-*.xml <https://hudson.apache.org/hudson/job/Harmony-1.5-head-linux-x86_64/ws/harmony/target/hdk/jdk/lib/.dbg>
[echo] Making "clean" in src/test/native/hysysinfo/unix
[exec] rm -f ../shared/hysysinfo.o ../../hycunit/hycunit.o ../hysysinfo .exp \
[exec] ../TEST-*.xml <https://hudson.apache.org/hudson/job/Harmony-1.5-head-linux-x86_64/ws/harmony/target/hdk/jdk/lib/.dbg>
[echo] Making "clean" in src/test/native/hyipcmutex/unix
[exec] rm -f ../shared/hyipcmutex.o ../../hycunit/hycunit.o ../hyipcmutex .exp \
[exec] ../TEST-*.xml <https://hudson.apache.org/hudson/job/Harmony-1.5-head-linux-x86_64/ws/harmony/target/hdk/jdk/lib/.dbg>
[echo] Making "clean" in src/test/native/hymmap/unix
[exec] rm -f ../shared/hymmap.o ../../hycunit/hycunit.o ../hymmap .exp \
[exec] ../TEST-*.xml <https://hudson.apache.org/hudson/job/Harmony-1.5-head-linux-x86_64/ws/harmony/target/hdk/jdk/lib/.dbg>
clean:
-class-patternset:
-clean-java:
[delete] Deleting: <https://hudson.apache.org/hudson/job/Harmony-1.5-head-linux-x86_64/ws/harmony/target/hdk/build/ant/patternsets/prefs.txt>
-clean-native:
-clean-test:
clean:
-class-patternset:
-clean-java:
[delete] Deleting: <https://hudson.apache.org/hudson/job/Harmony-1.5-head-linux-x86_64/ws/harmony/target/hdk/build/ant/patternsets/print.txt>
-clean-native:
-clean-test:
clean:
-class-patternset:
-clean-java:
[delete] Deleting: <https://hudson.apache.org/hudson/job/Harmony-1.5-head-linux-x86_64/ws/harmony/target/hdk/build/ant/patternsets/regex.txt>
-clean-test:
clean:
-class-patternset:
-clean-java:
[delete] Deleting: <https://hudson.apache.org/hudson/job/Harmony-1.5-head-linux-x86_64/ws/harmony/target/hdk/build/ant/patternsets/rmi.txt>
-clean-test:
clean:
-class-patternset:
-clean-java:
[delete] Deleting: <https://hudson.apache.org/hudson/job/Harmony-1.5-head-linux-x86_64/ws/harmony/target/hdk/build/ant/patternsets/security-kernel.txt>
clean:
-class-patternset:
-clean-java:
[delete] Deleting: <https://hudson.apache.org/hudson/job/Harmony-1.5-head-linux-x86_64/ws/harmony/target/hdk/build/ant/patternsets/security.txt>
-clean-native:
[echo] Making "clean" in src/main/native/security/unix
[exec] rm -f <https://hudson.apache.org/hudson/job/Harmony-1.5-head-linux-x86_64/ws/harmony/target/build/classlib/security/native/security/security_copyright.o> <https://hudson.apache.org/hudson/job/Harmony-1.5-head-linux-x86_64/ws/harmony/target/build/classlib/security/native/security/getUnixSystemRandom.o> <https://hudson.apache.org/hudson/job/Harmony-1.5-head-linux-x86_64/ws/harmony/target/hdk/jdk/jre/bin/libhysecurity.so> <https://hudson.apache.org/hudson/job/Harmony-1.5-head-linux-x86_64/ws/harmony/target/build/classlib/security/native/security/libhysecurity.exp> \
[exec] <https://hudson.apache.org/hudson/job/Harmony-1.5-head-linux-x86_64/ws/harmony/target/hdk/jdk/lib/libhysecurity.so.dbg>
-clean-test:
clean:
-class-patternset:
-clean-java:
[delete] Deleting: <https://hudson.apache.org/hudson/job/Harmony-1.5-head-linux-x86_64/ws/harmony/target/hdk/build/ant/patternsets/sound.txt>
-clean-test:
clean:
-class-patternset:
-clean-java:
[delete] Deleting: <https://hudson.apache.org/hudson/job/Harmony-1.5-head-linux-x86_64/ws/harmony/target/hdk/build/ant/patternsets/sql.txt>
-clean-test:
clean:
-class-patternset:
-clean-java:
[delete] Deleting: <https://hudson.apache.org/hudson/job/Harmony-1.5-head-linux-x86_64/ws/harmony/target/hdk/build/ant/patternsets/suncompat.txt>
-clean-test:
clean:
-class-patternset:
-clean-java:
[delete] Deleting: <https://hudson.apache.org/hudson/job/Harmony-1.5-head-linux-x86_64/ws/harmony/target/hdk/build/ant/patternsets/swing.txt>
-clean-test:
clean:
-class-patternset:
-clean-java:
[delete] Deleting: <https://hudson.apache.org/hudson/job/Harmony-1.5-head-linux-x86_64/ws/harmony/target/hdk/build/ant/patternsets/text.txt>
-clean-test:
clean:
-class-patternset:
-clean-java:
[delete] Deleting: <https://hudson.apache.org/hudson/job/Harmony-1.5-head-linux-x86_64/ws/harmony/target/hdk/build/ant/patternsets/x-net.txt>
-clean-test:
clean:
-clean-java:
clean:
-clean-java-catch-all-test:
-clean-java-catch-all:
-clean-java-layout:
-clean-check:
-clean-native:
-clean-test:
clean:
clean-vm:
[copy] Copying 20 files to <https://hudson.apache.org/hudson/job/Harmony-1.5-head-linux-x86_64/ws/harmony/target/hdk/build/make>
clean:
clean-tests:
clean:
-init-hdk:
[mkdir] Created dir: <https://hudson.apache.org/hudson/job/Harmony-1.5-head-linux-x86_64/ws/harmony/target/hdk/build/ant>
[copy] Copying 4 files to <https://hudson.apache.org/hudson/job/Harmony-1.5-head-linux-x86_64/ws/harmony/target/hdk/build/ant>
[copy] Copying 1 file to <https://hudson.apache.org/hudson/job/Harmony-1.5-head-linux-x86_64/ws/harmony/target/hdk/build/ant>
[mkdir] Created dir: <https://hudson.apache.org/hudson/job/Harmony-1.5-head-linux-x86_64/ws/harmony/target/hdk/build/make>
[copy] Copying 20 files to <https://hudson.apache.org/hudson/job/Harmony-1.5-head-linux-x86_64/ws/harmony/target/hdk/build/make>
-init-hdk:
[copy] Copying 4 files to <https://hudson.apache.org/hudson/job/Harmony-1.5-head-linux-x86_64/ws/harmony/target/hdk/jdk/include>
auto-fetch-depends-classlib:
-build-classlib:
[copy] Copying 20 files to <https://hudson.apache.org/hudson/job/Harmony-1.5-head-linux-x86_64/ws/harmony/target/hdk/build/make>
Trying to override old definition of task chksum
-init-hdk:
[copy] Copying 20 files to <https://hudson.apache.org/hudson/job/Harmony-1.5-head-linux-x86_64/ws/harmony/target/hdk/build/make>
-check-depends:
-check:
[echo] Checking for <https://hudson.apache.org/hudson/job/Harmony-1.5-head-linux-x86_64/ws/harmony/target/depends/jars/junit_4.6/junit-4.6.jar>
BUILD FAILED
<https://hudson.apache.org/hudson/job/Harmony-1.5-head-linux-x86_64/ws/harmony/build.xml>:480: The following error occurred while executing this line:
<https://hudson.apache.org/hudson/job/Harmony-1.5-head-linux-x86_64/ws/harmony/classlib/build.xml>:567: The following error occurred while executing this line:
<https://hudson.apache.org/hudson/job/Harmony-1.5-head-linux-x86_64/ws/harmony/classlib/make/depends.xml>:35: The following error occurred while executing this line:
<https://hudson.apache.org/hudson/job/Harmony-1.5-head-linux-x86_64/ws/harmony/target/hdk/build/ant/depends.xml>:109: ...
Missing dependency. The file from:
http://downloads.sourceforge.net/sourceforge/junit/junit-4.6.jar?use_mirror=autoselect
should be downloaded (extracted) to:
<https://hudson.apache.org/hudson/job/Harmony-1.5-head-linux-x86_64/ws/harmony/target/depends/jars/junit_4.6/junit-4.6.jar>
Run "ant fetch-depends" to automatically fetch dependencies.
Note: Some of Harmony's dependencies are licensed under terms other
than the Apache License v2.
Total time: 2 minutes 16 seconds
[FINDBUGS] Skipping publisher since build result is FAILURE
Recording fingerprints
Archiving artifacts
Recording test results
Failed to send e-mail to hindessm because no e-mail address is known, and no default e-mail domain is configured