You are viewing a plain text version of this content. The canonical link for it is here.
Posted to dev@lucene.apache.org by Apache Jenkins Server <je...@builds.apache.org> on 2012/01/13 23:13:15 UTC

[JENKINS] Lucene-Solr-tests-only-trunk - Build # 12124 - Still Failing

Build: https://builds.apache.org/job/Lucene-Solr-tests-only-trunk/12124/

1 tests failed.
FAILED:  org.apache.lucene.analysis.charfilter.HTMLStripCharFilterTest.testRandom

Error Message:
endOffset must be <= finalOffset

Stack Trace:
junit.framework.AssertionFailedError: endOffset must be <= finalOffset
	at org.apache.lucene.util.LuceneTestCaseRunner.runChild(LuceneTestCaseRunner.java:165)
	at org.apache.lucene.util.LuceneTestCaseRunner.runChild(LuceneTestCaseRunner.java:57)
	at org.apache.lucene.analysis.BaseTokenStreamTestCase.assertTokenStreamContents(BaseTokenStreamTestCase.java:140)
	at org.apache.lucene.analysis.BaseTokenStreamTestCase.assertAnalyzesToReuse(BaseTokenStreamTestCase.java:215)
	at org.apache.lucene.analysis.BaseTokenStreamTestCase.assertAnalyzesToReuse(BaseTokenStreamTestCase.java:231)
	at org.apache.lucene.analysis.BaseTokenStreamTestCase.checkRandomData(BaseTokenStreamTestCase.java:359)
	at org.apache.lucene.analysis.BaseTokenStreamTestCase.checkRandomData(BaseTokenStreamTestCase.java:251)
	at org.apache.lucene.analysis.charfilter.HTMLStripCharFilterTest.testRandom(HTMLStripCharFilterTest.java:274)
	at org.apache.lucene.util.LuceneTestCase$3$1.evaluate(LuceneTestCase.java:528)




Build Log (for compile errors):
[...truncated 3489 lines...]



---------------------------------------------------------------------
To unsubscribe, e-mail: dev-unsubscribe@lucene.apache.org
For additional commands, e-mail: dev-help@lucene.apache.org


[JENKINS] Lucene-Solr-tests-only-trunk - Build # 12135 - Still Failing

Posted by Apache Jenkins Server <je...@builds.apache.org>.
Build: https://builds.apache.org/job/Lucene-Solr-tests-only-trunk/12135/

1 tests failed.
FAILED:  org.apache.lucene.analysis.charfilter.HTMLStripCharFilterTest.testRandom

Error Message:
endOffset must be <= finalOffset

Stack Trace:
junit.framework.AssertionFailedError: endOffset must be <= finalOffset
	at org.apache.lucene.util.LuceneTestCaseRunner.runChild(LuceneTestCaseRunner.java:165)
	at org.apache.lucene.util.LuceneTestCaseRunner.runChild(LuceneTestCaseRunner.java:57)
	at org.apache.lucene.analysis.BaseTokenStreamTestCase.assertTokenStreamContents(BaseTokenStreamTestCase.java:140)
	at org.apache.lucene.analysis.BaseTokenStreamTestCase.assertAnalyzesToReuse(BaseTokenStreamTestCase.java:215)
	at org.apache.lucene.analysis.BaseTokenStreamTestCase.assertAnalyzesToReuse(BaseTokenStreamTestCase.java:231)
	at org.apache.lucene.analysis.BaseTokenStreamTestCase.checkRandomData(BaseTokenStreamTestCase.java:359)
	at org.apache.lucene.analysis.BaseTokenStreamTestCase.checkRandomData(BaseTokenStreamTestCase.java:251)
	at org.apache.lucene.analysis.charfilter.HTMLStripCharFilterTest.testRandom(HTMLStripCharFilterTest.java:274)
	at org.apache.lucene.util.LuceneTestCase$3$1.evaluate(LuceneTestCase.java:528)




Build Log (for compile errors):
[...truncated 3502 lines...]



---------------------------------------------------------------------
To unsubscribe, e-mail: dev-unsubscribe@lucene.apache.org
For additional commands, e-mail: dev-help@lucene.apache.org


[JENKINS] Lucene-Solr-tests-only-trunk - Build # 12134 - Still Failing

Posted by Apache Jenkins Server <je...@builds.apache.org>.
Build: https://builds.apache.org/job/Lucene-Solr-tests-only-trunk/12134/

1 tests failed.
FAILED:  org.apache.lucene.analysis.charfilter.HTMLStripCharFilterTest.testRandom

Error Message:
endOffset must be <= finalOffset

Stack Trace:
junit.framework.AssertionFailedError: endOffset must be <= finalOffset
	at org.apache.lucene.util.LuceneTestCaseRunner.runChild(LuceneTestCaseRunner.java:165)
	at org.apache.lucene.util.LuceneTestCaseRunner.runChild(LuceneTestCaseRunner.java:57)
	at org.apache.lucene.analysis.BaseTokenStreamTestCase.assertTokenStreamContents(BaseTokenStreamTestCase.java:140)
	at org.apache.lucene.analysis.BaseTokenStreamTestCase.assertAnalyzesToReuse(BaseTokenStreamTestCase.java:215)
	at org.apache.lucene.analysis.BaseTokenStreamTestCase.assertAnalyzesToReuse(BaseTokenStreamTestCase.java:231)
	at org.apache.lucene.analysis.BaseTokenStreamTestCase.checkRandomData(BaseTokenStreamTestCase.java:359)
	at org.apache.lucene.analysis.BaseTokenStreamTestCase.checkRandomData(BaseTokenStreamTestCase.java:251)
	at org.apache.lucene.analysis.charfilter.HTMLStripCharFilterTest.testRandom(HTMLStripCharFilterTest.java:274)
	at org.apache.lucene.util.LuceneTestCase$3$1.evaluate(LuceneTestCase.java:528)




Build Log (for compile errors):
[...truncated 3492 lines...]



---------------------------------------------------------------------
To unsubscribe, e-mail: dev-unsubscribe@lucene.apache.org
For additional commands, e-mail: dev-help@lucene.apache.org


[JENKINS] Lucene-Solr-tests-only-trunk - Build # 12133 - Still Failing

Posted by Apache Jenkins Server <je...@builds.apache.org>.
Build: https://builds.apache.org/job/Lucene-Solr-tests-only-trunk/12133/

1 tests failed.
FAILED:  org.apache.lucene.analysis.charfilter.HTMLStripCharFilterTest.testRandom

Error Message:
endOffset must be <= finalOffset

Stack Trace:
junit.framework.AssertionFailedError: endOffset must be <= finalOffset
	at org.apache.lucene.util.LuceneTestCaseRunner.runChild(LuceneTestCaseRunner.java:165)
	at org.apache.lucene.util.LuceneTestCaseRunner.runChild(LuceneTestCaseRunner.java:57)
	at org.apache.lucene.analysis.BaseTokenStreamTestCase.assertTokenStreamContents(BaseTokenStreamTestCase.java:140)
	at org.apache.lucene.analysis.BaseTokenStreamTestCase.assertAnalyzesToReuse(BaseTokenStreamTestCase.java:215)
	at org.apache.lucene.analysis.BaseTokenStreamTestCase.assertAnalyzesToReuse(BaseTokenStreamTestCase.java:231)
	at org.apache.lucene.analysis.BaseTokenStreamTestCase.checkRandomData(BaseTokenStreamTestCase.java:359)
	at org.apache.lucene.analysis.BaseTokenStreamTestCase.checkRandomData(BaseTokenStreamTestCase.java:251)
	at org.apache.lucene.analysis.charfilter.HTMLStripCharFilterTest.testRandom(HTMLStripCharFilterTest.java:274)
	at org.apache.lucene.util.LuceneTestCase$3$1.evaluate(LuceneTestCase.java:528)




Build Log (for compile errors):
[...truncated 3502 lines...]



---------------------------------------------------------------------
To unsubscribe, e-mail: dev-unsubscribe@lucene.apache.org
For additional commands, e-mail: dev-help@lucene.apache.org


[JENKINS] Lucene-Solr-tests-only-trunk - Build # 12132 - Still Failing

Posted by Apache Jenkins Server <je...@builds.apache.org>.
Build: https://builds.apache.org/job/Lucene-Solr-tests-only-trunk/12132/

1 tests failed.
FAILED:  org.apache.lucene.analysis.charfilter.HTMLStripCharFilterTest.testRandom

Error Message:
finalOffset  expected:<39> but was:<42>

Stack Trace:
junit.framework.AssertionFailedError: finalOffset  expected:<39> but was:<42>
	at org.apache.lucene.util.LuceneTestCaseRunner.runChild(LuceneTestCaseRunner.java:165)
	at org.apache.lucene.util.LuceneTestCaseRunner.runChild(LuceneTestCaseRunner.java:57)
	at org.apache.lucene.analysis.BaseTokenStreamTestCase.assertTokenStreamContents(BaseTokenStreamTestCase.java:150)
	at org.apache.lucene.analysis.BaseTokenStreamTestCase.assertAnalyzesToReuse(BaseTokenStreamTestCase.java:215)
	at org.apache.lucene.analysis.BaseTokenStreamTestCase.assertAnalyzesToReuse(BaseTokenStreamTestCase.java:231)
	at org.apache.lucene.analysis.BaseTokenStreamTestCase.checkRandomData(BaseTokenStreamTestCase.java:359)
	at org.apache.lucene.analysis.BaseTokenStreamTestCase.checkRandomData(BaseTokenStreamTestCase.java:251)
	at org.apache.lucene.analysis.charfilter.HTMLStripCharFilterTest.testRandom(HTMLStripCharFilterTest.java:274)
	at org.apache.lucene.util.LuceneTestCase$3$1.evaluate(LuceneTestCase.java:528)




Build Log (for compile errors):
[...truncated 3494 lines...]



---------------------------------------------------------------------
To unsubscribe, e-mail: dev-unsubscribe@lucene.apache.org
For additional commands, e-mail: dev-help@lucene.apache.org


[JENKINS] Lucene-Solr-tests-only-trunk - Build # 12131 - Still Failing

Posted by Apache Jenkins Server <je...@builds.apache.org>.
Build: https://builds.apache.org/job/Lucene-Solr-tests-only-trunk/12131/

1 tests failed.
FAILED:  org.apache.lucene.analysis.charfilter.HTMLStripCharFilterTest.testRandom

Error Message:
endOffset must be <= finalOffset

Stack Trace:
junit.framework.AssertionFailedError: endOffset must be <= finalOffset
	at org.apache.lucene.util.LuceneTestCaseRunner.runChild(LuceneTestCaseRunner.java:165)
	at org.apache.lucene.util.LuceneTestCaseRunner.runChild(LuceneTestCaseRunner.java:57)
	at org.apache.lucene.analysis.BaseTokenStreamTestCase.assertTokenStreamContents(BaseTokenStreamTestCase.java:140)
	at org.apache.lucene.analysis.BaseTokenStreamTestCase.assertAnalyzesToReuse(BaseTokenStreamTestCase.java:215)
	at org.apache.lucene.analysis.BaseTokenStreamTestCase.assertAnalyzesToReuse(BaseTokenStreamTestCase.java:231)
	at org.apache.lucene.analysis.BaseTokenStreamTestCase.checkRandomData(BaseTokenStreamTestCase.java:359)
	at org.apache.lucene.analysis.BaseTokenStreamTestCase.checkRandomData(BaseTokenStreamTestCase.java:251)
	at org.apache.lucene.analysis.charfilter.HTMLStripCharFilterTest.testRandom(HTMLStripCharFilterTest.java:274)
	at org.apache.lucene.util.LuceneTestCase$3$1.evaluate(LuceneTestCase.java:528)




Build Log (for compile errors):
[...truncated 3496 lines...]



---------------------------------------------------------------------
To unsubscribe, e-mail: dev-unsubscribe@lucene.apache.org
For additional commands, e-mail: dev-help@lucene.apache.org


[JENKINS] Lucene-Solr-tests-only-trunk - Build # 12130 - Still Failing

Posted by Apache Jenkins Server <je...@builds.apache.org>.
Build: https://builds.apache.org/job/Lucene-Solr-tests-only-trunk/12130/

1 tests failed.
FAILED:  org.apache.lucene.analysis.charfilter.HTMLStripCharFilterTest.testRandom

Error Message:
endOffset must be <= finalOffset

Stack Trace:
junit.framework.AssertionFailedError: endOffset must be <= finalOffset
	at org.apache.lucene.util.LuceneTestCaseRunner.runChild(LuceneTestCaseRunner.java:165)
	at org.apache.lucene.util.LuceneTestCaseRunner.runChild(LuceneTestCaseRunner.java:57)
	at org.apache.lucene.analysis.BaseTokenStreamTestCase.assertTokenStreamContents(BaseTokenStreamTestCase.java:140)
	at org.apache.lucene.analysis.BaseTokenStreamTestCase.assertAnalyzesToReuse(BaseTokenStreamTestCase.java:215)
	at org.apache.lucene.analysis.BaseTokenStreamTestCase.assertAnalyzesToReuse(BaseTokenStreamTestCase.java:231)
	at org.apache.lucene.analysis.BaseTokenStreamTestCase.checkRandomData(BaseTokenStreamTestCase.java:359)
	at org.apache.lucene.analysis.BaseTokenStreamTestCase.checkRandomData(BaseTokenStreamTestCase.java:251)
	at org.apache.lucene.analysis.charfilter.HTMLStripCharFilterTest.testRandom(HTMLStripCharFilterTest.java:274)
	at org.apache.lucene.util.LuceneTestCase$3$1.evaluate(LuceneTestCase.java:528)




Build Log (for compile errors):
[...truncated 3501 lines...]



---------------------------------------------------------------------
To unsubscribe, e-mail: dev-unsubscribe@lucene.apache.org
For additional commands, e-mail: dev-help@lucene.apache.org


[JENKINS] Lucene-Solr-tests-only-trunk - Build # 12129 - Still Failing

Posted by Apache Jenkins Server <je...@builds.apache.org>.
Build: https://builds.apache.org/job/Lucene-Solr-tests-only-trunk/12129/

1 tests failed.
FAILED:  org.apache.lucene.analysis.charfilter.HTMLStripCharFilterTest.testRandom

Error Message:
endOffset must be <= finalOffset

Stack Trace:
junit.framework.AssertionFailedError: endOffset must be <= finalOffset
	at org.apache.lucene.util.LuceneTestCaseRunner.runChild(LuceneTestCaseRunner.java:165)
	at org.apache.lucene.util.LuceneTestCaseRunner.runChild(LuceneTestCaseRunner.java:57)
	at org.apache.lucene.analysis.BaseTokenStreamTestCase.assertTokenStreamContents(BaseTokenStreamTestCase.java:140)
	at org.apache.lucene.analysis.BaseTokenStreamTestCase.assertAnalyzesToReuse(BaseTokenStreamTestCase.java:215)
	at org.apache.lucene.analysis.BaseTokenStreamTestCase.assertAnalyzesToReuse(BaseTokenStreamTestCase.java:231)
	at org.apache.lucene.analysis.BaseTokenStreamTestCase.checkRandomData(BaseTokenStreamTestCase.java:359)
	at org.apache.lucene.analysis.BaseTokenStreamTestCase.checkRandomData(BaseTokenStreamTestCase.java:251)
	at org.apache.lucene.analysis.charfilter.HTMLStripCharFilterTest.testRandom(HTMLStripCharFilterTest.java:274)
	at org.apache.lucene.util.LuceneTestCase$3$1.evaluate(LuceneTestCase.java:528)




Build Log (for compile errors):
[...truncated 3491 lines...]



---------------------------------------------------------------------
To unsubscribe, e-mail: dev-unsubscribe@lucene.apache.org
For additional commands, e-mail: dev-help@lucene.apache.org


[JENKINS] Lucene-Solr-tests-only-trunk - Build # 12128 - Still Failing

Posted by Apache Jenkins Server <je...@builds.apache.org>.
Build: https://builds.apache.org/job/Lucene-Solr-tests-only-trunk/12128/

1 tests failed.
FAILED:  org.apache.lucene.analysis.charfilter.HTMLStripCharFilterTest.testRandom

Error Message:
endOffset must be <= finalOffset

Stack Trace:
junit.framework.AssertionFailedError: endOffset must be <= finalOffset
	at org.apache.lucene.util.LuceneTestCaseRunner.runChild(LuceneTestCaseRunner.java:165)
	at org.apache.lucene.util.LuceneTestCaseRunner.runChild(LuceneTestCaseRunner.java:57)
	at org.apache.lucene.analysis.BaseTokenStreamTestCase.assertTokenStreamContents(BaseTokenStreamTestCase.java:140)
	at org.apache.lucene.analysis.BaseTokenStreamTestCase.assertAnalyzesToReuse(BaseTokenStreamTestCase.java:215)
	at org.apache.lucene.analysis.BaseTokenStreamTestCase.assertAnalyzesToReuse(BaseTokenStreamTestCase.java:231)
	at org.apache.lucene.analysis.BaseTokenStreamTestCase.checkRandomData(BaseTokenStreamTestCase.java:359)
	at org.apache.lucene.analysis.BaseTokenStreamTestCase.checkRandomData(BaseTokenStreamTestCase.java:251)
	at org.apache.lucene.analysis.charfilter.HTMLStripCharFilterTest.testRandom(HTMLStripCharFilterTest.java:274)
	at org.apache.lucene.util.LuceneTestCase$3$1.evaluate(LuceneTestCase.java:528)




Build Log (for compile errors):
[...truncated 3498 lines...]



---------------------------------------------------------------------
To unsubscribe, e-mail: dev-unsubscribe@lucene.apache.org
For additional commands, e-mail: dev-help@lucene.apache.org


[JENKINS] Lucene-Solr-tests-only-trunk - Build # 12127 - Still Failing

Posted by Apache Jenkins Server <je...@builds.apache.org>.
Build: https://builds.apache.org/job/Lucene-Solr-tests-only-trunk/12127/

1 tests failed.
FAILED:  org.apache.lucene.analysis.charfilter.HTMLStripCharFilterTest.testRandom

Error Message:
endOffset must be <= finalOffset

Stack Trace:
junit.framework.AssertionFailedError: endOffset must be <= finalOffset
	at org.apache.lucene.util.LuceneTestCaseRunner.runChild(LuceneTestCaseRunner.java:165)
	at org.apache.lucene.util.LuceneTestCaseRunner.runChild(LuceneTestCaseRunner.java:57)
	at org.apache.lucene.analysis.BaseTokenStreamTestCase.assertTokenStreamContents(BaseTokenStreamTestCase.java:140)
	at org.apache.lucene.analysis.BaseTokenStreamTestCase.assertAnalyzesToReuse(BaseTokenStreamTestCase.java:215)
	at org.apache.lucene.analysis.BaseTokenStreamTestCase.assertAnalyzesToReuse(BaseTokenStreamTestCase.java:231)
	at org.apache.lucene.analysis.BaseTokenStreamTestCase.checkRandomData(BaseTokenStreamTestCase.java:359)
	at org.apache.lucene.analysis.BaseTokenStreamTestCase.checkRandomData(BaseTokenStreamTestCase.java:251)
	at org.apache.lucene.analysis.charfilter.HTMLStripCharFilterTest.testRandom(HTMLStripCharFilterTest.java:274)
	at org.apache.lucene.util.LuceneTestCase$3$1.evaluate(LuceneTestCase.java:528)




Build Log (for compile errors):
[...truncated 3502 lines...]



---------------------------------------------------------------------
To unsubscribe, e-mail: dev-unsubscribe@lucene.apache.org
For additional commands, e-mail: dev-help@lucene.apache.org


[JENKINS] Lucene-Solr-tests-only-trunk - Build # 12126 - Still Failing

Posted by Apache Jenkins Server <je...@builds.apache.org>.
Build: https://builds.apache.org/job/Lucene-Solr-tests-only-trunk/12126/

1 tests failed.
FAILED:  org.apache.lucene.analysis.charfilter.HTMLStripCharFilterTest.testRandom

Error Message:
endOffset must be <= finalOffset

Stack Trace:
junit.framework.AssertionFailedError: endOffset must be <= finalOffset
	at org.apache.lucene.util.LuceneTestCaseRunner.runChild(LuceneTestCaseRunner.java:165)
	at org.apache.lucene.util.LuceneTestCaseRunner.runChild(LuceneTestCaseRunner.java:57)
	at org.apache.lucene.analysis.BaseTokenStreamTestCase.assertTokenStreamContents(BaseTokenStreamTestCase.java:140)
	at org.apache.lucene.analysis.BaseTokenStreamTestCase.assertAnalyzesToReuse(BaseTokenStreamTestCase.java:215)
	at org.apache.lucene.analysis.BaseTokenStreamTestCase.assertAnalyzesToReuse(BaseTokenStreamTestCase.java:231)
	at org.apache.lucene.analysis.BaseTokenStreamTestCase.checkRandomData(BaseTokenStreamTestCase.java:359)
	at org.apache.lucene.analysis.BaseTokenStreamTestCase.checkRandomData(BaseTokenStreamTestCase.java:251)
	at org.apache.lucene.analysis.charfilter.HTMLStripCharFilterTest.testRandom(HTMLStripCharFilterTest.java:274)
	at org.apache.lucene.util.LuceneTestCase$3$1.evaluate(LuceneTestCase.java:528)




Build Log (for compile errors):
[...truncated 3488 lines...]



---------------------------------------------------------------------
To unsubscribe, e-mail: dev-unsubscribe@lucene.apache.org
For additional commands, e-mail: dev-help@lucene.apache.org


[JENKINS] Lucene-Solr-tests-only-trunk - Build # 12125 - Still Failing

Posted by Apache Jenkins Server <je...@builds.apache.org>.
Build: https://builds.apache.org/job/Lucene-Solr-tests-only-trunk/12125/

1 tests failed.
FAILED:  org.apache.lucene.analysis.charfilter.HTMLStripCharFilterTest.testRandom

Error Message:
endOffset must be <= finalOffset

Stack Trace:
junit.framework.AssertionFailedError: endOffset must be <= finalOffset
	at org.apache.lucene.util.LuceneTestCaseRunner.runChild(LuceneTestCaseRunner.java:165)
	at org.apache.lucene.util.LuceneTestCaseRunner.runChild(LuceneTestCaseRunner.java:57)
	at org.apache.lucene.analysis.BaseTokenStreamTestCase.assertTokenStreamContents(BaseTokenStreamTestCase.java:140)
	at org.apache.lucene.analysis.BaseTokenStreamTestCase.assertAnalyzesToReuse(BaseTokenStreamTestCase.java:215)
	at org.apache.lucene.analysis.BaseTokenStreamTestCase.assertAnalyzesToReuse(BaseTokenStreamTestCase.java:231)
	at org.apache.lucene.analysis.BaseTokenStreamTestCase.checkRandomData(BaseTokenStreamTestCase.java:359)
	at org.apache.lucene.analysis.BaseTokenStreamTestCase.checkRandomData(BaseTokenStreamTestCase.java:251)
	at org.apache.lucene.analysis.charfilter.HTMLStripCharFilterTest.testRandom(HTMLStripCharFilterTest.java:274)
	at org.apache.lucene.util.LuceneTestCase$3$1.evaluate(LuceneTestCase.java:528)




Build Log (for compile errors):
[...truncated 3492 lines...]



---------------------------------------------------------------------
To unsubscribe, e-mail: dev-unsubscribe@lucene.apache.org
For additional commands, e-mail: dev-help@lucene.apache.org