You are viewing a plain text version of this content. The canonical link for it is here.
Posted to builds@beam.apache.org by Apache Jenkins Server <je...@builds.apache.org> on 2023/11/13 03:36:37 UTC
Build failed in Jenkins: beam_PostCommit_Java_ValidatesRunner_Flink #12508
See <https://ci-beam.apache.org/job/beam_PostCommit_Java_ValidatesRunner_Flink/12508/display/redirect>
Changes:
------------------------------------------
Started by timer
Running as SYSTEM
[EnvInject] - Loading node environment variables.
Building remotely on apache-beam-jenkins-11 (beam) in workspace <https://ci-beam.apache.org/job/beam_PostCommit_Java_ValidatesRunner_Flink/ws/>
The recommended git tool is: NONE
No credentials specified
Wiping out workspace first.
Cloning the remote Git repository
Using shallow clone with depth 1
Avoid fetching tags
Cloning repository https://github.com/apache/beam.git
> git init <https://ci-beam.apache.org/job/beam_PostCommit_Java_ValidatesRunner_Flink/ws/src> # timeout=10
Fetching upstream changes from https://github.com/apache/beam.git
> git --version # timeout=10
> git --version # 'git version 2.25.1'
> git fetch --no-tags --force --progress --depth=1 -- https://github.com/apache/beam.git +refs/heads/*:refs/remotes/origin/* # timeout=10
> git config remote.origin.url https://github.com/apache/beam.git # timeout=10
> git config --add remote.origin.fetch +refs/heads/*:refs/remotes/origin/* # timeout=10
> git config remote.origin.url https://github.com/apache/beam.git # timeout=10
Using shallow fetch with depth 1
Fetching upstream changes from https://github.com/apache/beam.git
> git fetch --no-tags --force --progress --depth=1 -- https://github.com/apache/beam.git +refs/heads/*:refs/remotes/origin/* +refs/pull/${ghprbPullId}/*:refs/remotes/origin/pr/${ghprbPullId}/* # timeout=10
> git rev-parse origin/master^{commit} # timeout=10
Checking out Revision 2ad459113134dfffd3caeeb15e821bb644e08663 (origin/master)
> git config core.sparsecheckout # timeout=10
> git checkout -f 2ad459113134dfffd3caeeb15e821bb644e08663 # timeout=10
Commit message: "[YAML] - Kafka Read and Write proto (#29368)"
> git rev-list --no-walk 2ad459113134dfffd3caeeb15e821bb644e08663 # timeout=10
No emails were triggered.
[EnvInject] - Executing scripts and injecting environment variables after the SCM step.
[EnvInject] - Injecting as environment variables the properties content
SETUPTOOLS_USE_DISTUTILS=stdlib
SPARK_LOCAL_IP=127.0.0.1
[EnvInject] - Variables injected successfully.
[Gradle] - Launching build.
[src] $ <https://ci-beam.apache.org/job/beam_PostCommit_Java_ValidatesRunner_Flink/ws/src/gradlew> --continue --max-workers=8 -Dorg.gradle.jvmargs=-Xms2g -Dorg.gradle.jvmargs=-Xmx6g -Dorg.gradle.vfs.watch=false -Pdocker-pull-licenses :runners:flink:1.15:validatesRunner
To honour the JVM settings for this build a single-use Daemon process will be forked. For more on this, please refer to https://docs.gradle.org/8.4/userguide/gradle_daemon.html#sec:disabling_the_daemon in the Gradle documentation.
Daemon will be stopped at the end of the build
Configuration on demand is an incubating feature.
Gradle Enterprise plugins resolution: https://plugins.gradle.org/m2
Enforcing Gradle Enterprise: https://ge.apache.org, allowUntrustedServer: false
> Task :buildSrc:compileJava NO-SOURCE
> Task :buildSrc:compileGroovy FROM-CACHE
> Task :buildSrc:pluginDescriptors
> Task :buildSrc:processResources
> Task :buildSrc:classes
> Task :buildSrc:jar
> Task :sdks:java:fn-execution:createCheckerFrameworkManifest
> Task :runners:core-construction-java:createCheckerFrameworkManifest
> Task :sdks:java:transform-service:launcher:createCheckerFrameworkManifest
> Task :model:fn-execution:createCheckerFrameworkManifest
> Task :sdks:java:fn-execution:processResources NO-SOURCE
> Task :runners:core-construction-java:processResources NO-SOURCE
> Task :model:fn-execution:extractProto
> Task :model:job-management:createCheckerFrameworkManifest
> Task :model:pipeline:createCheckerFrameworkManifest
> Task :sdks:java:extensions:avro:createCheckerFrameworkManifest
> Task :runners:java-fn-execution:createCheckerFrameworkManifest
> Task :sdks:java:core:createCheckerFrameworkManifest
> Task :runners:core-java:createCheckerFrameworkManifest
> Task :sdks:java:extensions:avro:generateAvroProtocol NO-SOURCE
> Task :runners:core-java:processResources NO-SOURCE
> Task :sdks:java:extensions:avro:generateAvroJava NO-SOURCE
> Task :model:job-management:extractProto
> Task :sdks:java:harness:createCheckerFrameworkManifest
> Task :sdks:java:extensions:avro:processResources NO-SOURCE
> Task :sdks:java:harness:processResources NO-SOURCE
> Task :runners:java-fn-execution:processResources NO-SOURCE
> Task :sdks:java:core:generateGrammarSource FROM-CACHE
> Task :runners:java-job-service:createCheckerFrameworkManifest
> Task :runners:java-job-service:processResources NO-SOURCE
> Task :sdks:java:expansion-service:createCheckerFrameworkManifest
> Task :sdks:java:expansion-service:processResources NO-SOURCE
> Task :model:fn-execution:processResources
> Task :runners:core-java:processTestResources NO-SOURCE
> Task :model:job-management:processResources
> Task :runners:flink:1.15:copySourceOverrides
> Task :sdks:java:build-tools:createCheckerFrameworkManifest
> Task :sdks:java:extensions:google-cloud-platform-core:createCheckerFrameworkManifest
> Task :sdks:java:extensions:google-cloud-platform-core:processResources NO-SOURCE
> Task :runners:flink:1.15:createCheckerFrameworkManifest
> Task :runners:flink:1.15:copyResourcesOverrides NO-SOURCE
> Task :runners:flink:1.15:processResources
> Task :sdks:java:core:processResources
> Task :sdks:java:core:generateTestGrammarSource NO-SOURCE
> Task :sdks:java:build-tools:compileJava FROM-CACHE
> Task :sdks:java:transform-service:launcher:compileJava FROM-CACHE
> Task :sdks:java:transform-service:launcher:processResources
> Task :sdks:java:transform-service:launcher:classes
> Task :sdks:java:build-tools:processResources
> Task :sdks:java:build-tools:classes
> Task :sdks:java:core:processTestResources
> Task :sdks:java:transform-service:launcher:jar
> Task :sdks:java:build-tools:jar
> Task :sdks:java:transform-service:launcher:shadowJar FROM-CACHE
> Task :model:pipeline:extractIncludeProto
> Task :model:pipeline:extractProto
> Task :model:pipeline:generateProto FROM-CACHE
> Task :model:pipeline:compileJava FROM-CACHE
> Task :model:pipeline:processResources
> Task :model:pipeline:classes
> Task :model:pipeline:jar
> Task :model:pipeline:shadowJar FROM-CACHE
> Task :model:job-management:extractIncludeProto
> Task :model:fn-execution:extractIncludeProto
> Task :model:job-management:generateProto FROM-CACHE
> Task :model:fn-execution:generateProto FROM-CACHE
> Task :model:job-management:compileJava FROM-CACHE
> Task :model:job-management:classes
> Task :model:fn-execution:compileJava FROM-CACHE
> Task :model:fn-execution:classes
> Task :model:job-management:shadowJar FROM-CACHE
> Task :model:fn-execution:shadowJar FROM-CACHE
> Task :sdks:java:core:compileJava FROM-CACHE
> Task :sdks:java:core:classes
> Task :sdks:java:core:shadowJar FROM-CACHE
> Task :sdks:java:extensions:avro:compileJava FROM-CACHE
> Task :sdks:java:extensions:avro:classes UP-TO-DATE
> Task :sdks:java:extensions:avro:jar
> Task :sdks:java:fn-execution:compileJava FROM-CACHE
> Task :sdks:java:fn-execution:classes UP-TO-DATE
> Task :sdks:java:fn-execution:jar
> Task :runners:core-construction-java:compileJava FROM-CACHE
> Task :runners:core-construction-java:classes UP-TO-DATE
> Task :runners:core-construction-java:jar
> Task :runners:core-java:compileJava FROM-CACHE
> Task :runners:core-java:classes UP-TO-DATE
> Task :sdks:java:core:compileTestJava FROM-CACHE
> Task :sdks:java:core:testClasses
> Task :runners:core-java:jar
> Task :sdks:java:core:shadowTestJar FROM-CACHE
> Task :sdks:java:extensions:google-cloud-platform-core:compileJava FROM-CACHE
> Task :sdks:java:extensions:google-cloud-platform-core:classes UP-TO-DATE
> Task :sdks:java:extensions:google-cloud-platform-core:jar
> Task :sdks:java:harness:compileJava FROM-CACHE
> Task :sdks:java:harness:classes UP-TO-DATE
> Task :sdks:java:harness:jar
> Task :runners:core-java:compileTestJava FROM-CACHE
> Task :runners:core-java:testClasses UP-TO-DATE
> Task :runners:core-java:testJar
> Task :runners:java-fn-execution:compileJava FROM-CACHE
> Task :runners:java-fn-execution:classes UP-TO-DATE
> Task :runners:java-fn-execution:jar
> Task :sdks:java:expansion-service:compileJava FROM-CACHE
> Task :sdks:java:expansion-service:classes UP-TO-DATE
> Task :sdks:java:expansion-service:jar
> Task :runners:java-job-service:compileJava FROM-CACHE
> Task :runners:java-job-service:classes UP-TO-DATE
> Task :runners:java-job-service:jar
> Task :runners:flink:1.15:compileJava FROM-CACHE
> Task :runners:flink:1.15:classes
> Task :runners:flink:1.15:jar
> Task :runners:flink:1.15:validatesRunnerBatch
> Task :runners:flink:1.15:validatesRunnerBatchWithDataStream
org.apache.beam.sdk.transforms.ViewTest > testTriggeredLatestSingleton FAILED
org.apache.beam.sdk.Pipeline$PipelineExecutionException at ViewTest.java:330
Caused by: java.lang.IllegalArgumentException at PCollectionViews.java:412
294 tests completed, 1 failed, 1 skipped
> Task :runners:flink:1.15:validatesRunnerBatchWithDataStream FAILED
> Task :runners:flink:1.15:validatesRunnerStreaming
> Task :runners:flink:1.15:validatesRunnerStreamingCheckpointing
FAILURE: Build failed with an exception.
* What went wrong:
Execution failed for task ':runners:flink:1.15:validatesRunnerBatchWithDataStream'.
> There were failing tests. See the report at: file://<https://ci-beam.apache.org/job/beam_PostCommit_Java_ValidatesRunner_Flink/ws/src/runners/flink/1.15/build/reports/tests/validatesRunnerBatchWithDataStream/index.html>
Deprecated Gradle features were used in this build, making it incompatible with Gradle 9.0.
You can use '--warning-mode all' to show the individual deprecation warnings and determine if they come from your own scripts or plugins.
For more on this, please refer to https://docs.gradle.org/8.4/userguide/command_line_interface.html#sec:command_line_warnings in the Gradle documentation.
BUILD FAILED in 39m 9s
81 actionable tasks: 52 executed, 29 from cache
Publishing build scan...
https://ge.apache.org/s/aih3hrhisjfwo
Build step 'Invoke Gradle script' changed build result to FAILURE
Build step 'Invoke Gradle script' marked build as failure
---------------------------------------------------------------------
To unsubscribe, e-mail: builds-unsubscribe@beam.apache.org
For additional commands, e-mail: builds-help@beam.apache.org
Jenkins build is back to normal : beam_PostCommit_Java_ValidatesRunner_Flink #12510
Posted by Apache Jenkins Server <je...@builds.apache.org>.
See <https://ci-beam.apache.org/job/beam_PostCommit_Java_ValidatesRunner_Flink/12510/display/redirect>
---------------------------------------------------------------------
To unsubscribe, e-mail: builds-unsubscribe@beam.apache.org
For additional commands, e-mail: builds-help@beam.apache.org
Build failed in Jenkins: beam_PostCommit_Java_ValidatesRunner_Flink #12509
Posted by Apache Jenkins Server <je...@builds.apache.org>.
See <https://ci-beam.apache.org/job/beam_PostCommit_Java_ValidatesRunner_Flink/12509/display/redirect?page=changes>
Changes:
[noreply] Add getters to CheckResult in IT framework (#29411)
------------------------------------------
Started by timer
Running as SYSTEM
[EnvInject] - Loading node environment variables.
Building remotely on apache-beam-jenkins-11 (beam) in workspace <https://ci-beam.apache.org/job/beam_PostCommit_Java_ValidatesRunner_Flink/ws/>
The recommended git tool is: NONE
No credentials specified
Wiping out workspace first.
Cloning the remote Git repository
Using shallow clone with depth 1
Avoid fetching tags
Cloning repository https://github.com/apache/beam.git
> git init <https://ci-beam.apache.org/job/beam_PostCommit_Java_ValidatesRunner_Flink/ws/src> # timeout=10
Fetching upstream changes from https://github.com/apache/beam.git
> git --version # timeout=10
> git --version # 'git version 2.25.1'
> git fetch --no-tags --force --progress --depth=1 -- https://github.com/apache/beam.git +refs/heads/*:refs/remotes/origin/* # timeout=10
> git config remote.origin.url https://github.com/apache/beam.git # timeout=10
> git config --add remote.origin.fetch +refs/heads/*:refs/remotes/origin/* # timeout=10
> git config remote.origin.url https://github.com/apache/beam.git # timeout=10
Using shallow fetch with depth 1
Fetching upstream changes from https://github.com/apache/beam.git
> git fetch --no-tags --force --progress --depth=1 -- https://github.com/apache/beam.git +refs/heads/*:refs/remotes/origin/* +refs/pull/${ghprbPullId}/*:refs/remotes/origin/pr/${ghprbPullId}/* # timeout=10
> git rev-parse origin/master^{commit} # timeout=10
Checking out Revision 8fa5b19f5468c716e16c688994b538cc2abd3811 (origin/master)
> git config core.sparsecheckout # timeout=10
> git checkout -f 8fa5b19f5468c716e16c688994b538cc2abd3811 # timeout=10
Commit message: "Add getters to CheckResult in IT framework (#29411)"
> git rev-list --no-walk 2ad459113134dfffd3caeeb15e821bb644e08663 # timeout=10
No emails were triggered.
[EnvInject] - Executing scripts and injecting environment variables after the SCM step.
[EnvInject] - Injecting as environment variables the properties content
SETUPTOOLS_USE_DISTUTILS=stdlib
SPARK_LOCAL_IP=127.0.0.1
[EnvInject] - Variables injected successfully.
[Gradle] - Launching build.
[src] $ <https://ci-beam.apache.org/job/beam_PostCommit_Java_ValidatesRunner_Flink/ws/src/gradlew> --continue --max-workers=8 -Dorg.gradle.jvmargs=-Xms2g -Dorg.gradle.jvmargs=-Xmx6g -Dorg.gradle.vfs.watch=false -Pdocker-pull-licenses :runners:flink:1.15:validatesRunner
To honour the JVM settings for this build a single-use Daemon process will be forked. For more on this, please refer to https://docs.gradle.org/8.4/userguide/gradle_daemon.html#sec:disabling_the_daemon in the Gradle documentation.
Daemon will be stopped at the end of the build
Configuration on demand is an incubating feature.
Gradle Enterprise plugins resolution: https://plugins.gradle.org/m2
Enforcing Gradle Enterprise: https://ge.apache.org, allowUntrustedServer: false
> Task :buildSrc:compileJava NO-SOURCE
> Task :buildSrc:compileGroovy FROM-CACHE
> Task :buildSrc:pluginDescriptors
> Task :buildSrc:processResources
> Task :buildSrc:classes
> Task :buildSrc:jar
> Task :model:job-management:createCheckerFrameworkManifest
> Task :runners:core-construction-java:createCheckerFrameworkManifest
> Task :model:pipeline:createCheckerFrameworkManifest
> Task :sdks:java:transform-service:launcher:createCheckerFrameworkManifest
> Task :runners:core-construction-java:processResources NO-SOURCE
> Task :model:job-management:extractProto
> Task :sdks:java:fn-execution:createCheckerFrameworkManifest
> Task :sdks:java:extensions:avro:createCheckerFrameworkManifest
> Task :runners:core-java:createCheckerFrameworkManifest
> Task :model:fn-execution:createCheckerFrameworkManifest
> Task :sdks:java:core:createCheckerFrameworkManifest
> Task :sdks:java:extensions:avro:generateAvroProtocol NO-SOURCE
> Task :sdks:java:fn-execution:processResources NO-SOURCE
> Task :runners:core-java:processResources NO-SOURCE
> Task :sdks:java:extensions:avro:generateAvroJava NO-SOURCE
> Task :sdks:java:extensions:avro:processResources NO-SOURCE
> Task :model:fn-execution:extractProto
> Task :runners:java-fn-execution:createCheckerFrameworkManifest
> Task :runners:java-fn-execution:processResources NO-SOURCE
> Task :model:job-management:processResources
> Task :sdks:java:harness:createCheckerFrameworkManifest
> Task :sdks:java:core:generateGrammarSource FROM-CACHE
> Task :sdks:java:harness:processResources NO-SOURCE
> Task :runners:java-job-service:createCheckerFrameworkManifest
> Task :sdks:java:expansion-service:createCheckerFrameworkManifest
> Task :runners:java-job-service:processResources NO-SOURCE
> Task :sdks:java:expansion-service:processResources NO-SOURCE
> Task :runners:core-java:processTestResources NO-SOURCE
> Task :model:fn-execution:processResources
> Task :sdks:java:build-tools:createCheckerFrameworkManifest
> Task :sdks:java:extensions:google-cloud-platform-core:createCheckerFrameworkManifest
> Task :sdks:java:extensions:google-cloud-platform-core:processResources NO-SOURCE
> Task :runners:flink:1.15:copySourceOverrides
> Task :runners:flink:1.15:createCheckerFrameworkManifest
> Task :runners:flink:1.15:copyResourcesOverrides NO-SOURCE
> Task :runners:flink:1.15:processResources
> Task :sdks:java:core:processResources
> Task :sdks:java:core:generateTestGrammarSource NO-SOURCE
> Task :sdks:java:build-tools:compileJava FROM-CACHE
> Task :sdks:java:core:processTestResources
> Task :sdks:java:transform-service:launcher:compileJava FROM-CACHE
> Task :sdks:java:transform-service:launcher:processResources
> Task :sdks:java:transform-service:launcher:classes
> Task :sdks:java:build-tools:processResources
> Task :sdks:java:build-tools:classes
> Task :sdks:java:transform-service:launcher:jar
> Task :sdks:java:build-tools:jar
> Task :sdks:java:transform-service:launcher:shadowJar FROM-CACHE
> Task :model:pipeline:extractIncludeProto
> Task :model:pipeline:extractProto
> Task :model:pipeline:generateProto FROM-CACHE
> Task :model:pipeline:compileJava FROM-CACHE
> Task :model:pipeline:processResources
> Task :model:pipeline:classes
> Task :model:pipeline:jar
> Task :model:pipeline:shadowJar FROM-CACHE
> Task :model:fn-execution:extractIncludeProto
> Task :model:job-management:extractIncludeProto
> Task :model:job-management:generateProto FROM-CACHE
> Task :model:fn-execution:generateProto FROM-CACHE
> Task :model:job-management:compileJava FROM-CACHE
> Task :model:job-management:classes
> Task :model:fn-execution:compileJava FROM-CACHE
> Task :model:fn-execution:classes
> Task :model:job-management:shadowJar FROM-CACHE
> Task :model:fn-execution:shadowJar FROM-CACHE
> Task :sdks:java:core:compileJava FROM-CACHE
> Task :sdks:java:core:classes
> Task :sdks:java:core:shadowJar FROM-CACHE
> Task :sdks:java:extensions:avro:compileJava FROM-CACHE
> Task :sdks:java:extensions:avro:classes UP-TO-DATE
> Task :sdks:java:extensions:avro:jar
> Task :sdks:java:fn-execution:compileJava FROM-CACHE
> Task :sdks:java:fn-execution:classes UP-TO-DATE
> Task :sdks:java:fn-execution:jar
> Task :runners:core-construction-java:compileJava FROM-CACHE
> Task :runners:core-construction-java:classes UP-TO-DATE
> Task :runners:core-construction-java:jar
> Task :runners:core-java:compileJava FROM-CACHE
> Task :runners:core-java:classes UP-TO-DATE
> Task :runners:core-java:jar
> Task :sdks:java:core:compileTestJava FROM-CACHE
> Task :sdks:java:core:testClasses
> Task :sdks:java:core:shadowTestJar FROM-CACHE
> Task :sdks:java:extensions:google-cloud-platform-core:compileJava FROM-CACHE
> Task :sdks:java:extensions:google-cloud-platform-core:classes UP-TO-DATE
> Task :sdks:java:extensions:google-cloud-platform-core:jar
> Task :sdks:java:harness:compileJava FROM-CACHE
> Task :sdks:java:harness:classes UP-TO-DATE
> Task :sdks:java:harness:jar
> Task :runners:core-java:compileTestJava FROM-CACHE
> Task :runners:core-java:testClasses UP-TO-DATE
> Task :runners:core-java:testJar
> Task :runners:java-fn-execution:compileJava FROM-CACHE
> Task :runners:java-fn-execution:classes UP-TO-DATE
> Task :runners:java-fn-execution:jar
> Task :sdks:java:expansion-service:compileJava FROM-CACHE
> Task :sdks:java:expansion-service:classes UP-TO-DATE
> Task :sdks:java:expansion-service:jar
> Task :runners:java-job-service:compileJava FROM-CACHE
> Task :runners:java-job-service:classes UP-TO-DATE
> Task :runners:java-job-service:jar
> Task :runners:flink:1.15:compileJava FROM-CACHE
> Task :runners:flink:1.15:classes
> Task :runners:flink:1.15:jar
> Task :runners:flink:1.15:validatesRunnerBatch
> Task :runners:flink:1.15:validatesRunnerBatchWithDataStream
org.apache.beam.sdk.transforms.ParDoLifecycleTest > testTeardownCalledAfterExceptionInStartBundleStateful FAILED
java.lang.AssertionError at Assert.java:89
org.apache.beam.sdk.transforms.ViewTest > testTriggeredLatestSingleton FAILED
org.apache.beam.sdk.Pipeline$PipelineExecutionException at ViewTest.java:330
Caused by: java.lang.IllegalArgumentException at PCollectionViews.java:412
294 tests completed, 2 failed, 1 skipped
> Task :runners:flink:1.15:validatesRunnerBatchWithDataStream FAILED
> Task :runners:flink:1.15:validatesRunnerStreaming
> Task :runners:flink:1.15:validatesRunnerStreamingCheckpointing
FAILURE: Build failed with an exception.
* What went wrong:
Execution failed for task ':runners:flink:1.15:validatesRunnerBatchWithDataStream'.
> There were failing tests. See the report at: file://<https://ci-beam.apache.org/job/beam_PostCommit_Java_ValidatesRunner_Flink/ws/src/runners/flink/1.15/build/reports/tests/validatesRunnerBatchWithDataStream/index.html>
Deprecated Gradle features were used in this build, making it incompatible with Gradle 9.0.
You can use '--warning-mode all' to show the individual deprecation warnings and determine if they come from your own scripts or plugins.
For more on this, please refer to https://docs.gradle.org/8.4/userguide/command_line_interface.html#sec:command_line_warnings in the Gradle documentation.
BUILD FAILED in 39m 46s
81 actionable tasks: 52 executed, 29 from cache
Publishing build scan...
https://ge.apache.org/s/hxu4kjn2vlnqy
Build step 'Invoke Gradle script' changed build result to FAILURE
Build step 'Invoke Gradle script' marked build as failure
---------------------------------------------------------------------
To unsubscribe, e-mail: builds-unsubscribe@beam.apache.org
For additional commands, e-mail: builds-help@beam.apache.org