You are viewing a plain text version of this content. The canonical link for it is here.
Posted to builds@mesos.apache.org by Apache Jenkins Server <je...@builds.apache.org> on 2017/01/16 17:07:56 UTC

Build failed in Jenkins: Mesos-Buildbot » cmake,gcc,--verbose,GLOG_v=1 MESOS_VERBOSE=1,ubuntu:14.04,(docker||Hadoop)&&(!ubuntu-us1)&&(!ubuntu-6)&&(!ubuntu-eu2) #3114

See <https://builds.apache.org/job/Mesos-Buildbot/BUILDTOOL=cmake,COMPILER=gcc,CONFIGURATION=--verbose,ENVIRONMENT=GLOG_v=1%20MESOS_VERBOSE=1,OS=ubuntu%3A14.04,label_exp=(docker%7C%7CHadoop)&&(!ubuntu-us1)&&(!ubuntu-6)&&(!ubuntu-eu2)/3114/changes>

Changes:

[vinodkone] Ensured master always relinks during scheduler re-registration.

[vinodkone] Added MESOS-6676 to CHANGELOG for 1.0.3.

------------------------------------------
Started by upstream project "Mesos-Buildbot" build number 3114
originally caused by:
 Started by an SCM change
 Started by an SCM change
[EnvInject] - Loading node environment variables.
Building remotely on H7 (Hadoop) in workspace <https://builds.apache.org/job/Mesos-Buildbot/BUILDTOOL=cmake,COMPILER=gcc,CONFIGURATION=--verbose,ENVIRONMENT=GLOG_v=1%20MESOS_VERBOSE=1,OS=ubuntu%3A14.04,label_exp=(docker%7C%7CHadoop)&&(!ubuntu-us1)&&(!ubuntu-6)&&(!ubuntu-eu2)/ws/>
Cloning the remote Git repository
Cloning repository https://git-wip-us.apache.org/repos/asf/mesos.git
 > git init <https://builds.apache.org/job/Mesos-Buildbot/BUILDTOOL=cmake,COMPILER=gcc,CONFIGURATION=--verbose,ENVIRONMENT=GLOG_v=1%20MESOS_VERBOSE=1,OS=ubuntu%3A14.04,label_exp=(docker%7C%7CHadoop)&&(!ubuntu-us1)&&(!ubuntu-6)&&(!ubuntu-eu2)/ws/> # timeout=10
Fetching upstream changes from https://git-wip-us.apache.org/repos/asf/mesos.git
 > git --version # timeout=10
 > git -c core.askpass=true fetch --tags --progress https://git-wip-us.apache.org/repos/asf/mesos.git +refs/heads/*:refs/remotes/origin/*
 > git config remote.origin.url https://git-wip-us.apache.org/repos/asf/mesos.git # timeout=10
 > git config --add remote.origin.fetch +refs/heads/*:refs/remotes/origin/* # timeout=10
 > git config remote.origin.url https://git-wip-us.apache.org/repos/asf/mesos.git # timeout=10
Fetching upstream changes from https://git-wip-us.apache.org/repos/asf/mesos.git
 > git -c core.askpass=true fetch --tags --progress https://git-wip-us.apache.org/repos/asf/mesos.git +refs/heads/*:refs/remotes/origin/*
Checking out Revision 64b7a192f101ee6bb81a58222c10aeda2250aae7 (origin/1.0.x)
 > git config core.sparsecheckout # timeout=10
 > git checkout -f 64b7a192f101ee6bb81a58222c10aeda2250aae7
 > git rev-list c82a283d87af557128a96ec02f2ef9a00f00d4df # timeout=10
[(docker||Hadoop)&&(!ubuntu-us1)&&(!ubuntu-6)&&(!ubuntu-eu2)] $ /bin/bash -xe /tmp/hudson2516781027274915452.sh
+ ./support/docker-build.sh
/tmp/hudson2516781027274915452.sh: line 2: ./support/docker-build.sh: No such file or directory
Build step 'Execute shell' marked build as failure

Jenkins build is back to normal : Mesos-Buildbot » cmake,gcc,--verbose,GLOG_v=1 MESOS_VERBOSE=1,ubuntu:14.04,(docker||Hadoop)&&(!ubuntu-us1)&&(!ubuntu-6)&&(!ubuntu-eu2) #3117

Posted by Apache Jenkins Server <je...@builds.apache.org>.
See <https://builds.apache.org/job/Mesos-Buildbot/BUILDTOOL=cmake,COMPILER=gcc,CONFIGURATION=--verbose,ENVIRONMENT=GLOG_v=1%20MESOS_VERBOSE=1,OS=ubuntu%3A14.04,label_exp=(docker%7C%7CHadoop)&&(!ubuntu-us1)&&(!ubuntu-6)&&(!ubuntu-eu2)/3117/changes>


Build failed in Jenkins: Mesos-Buildbot » cmake,gcc,--verbose,GLOG_v=1 MESOS_VERBOSE=1,ubuntu:14.04,(docker||Hadoop)&&(!ubuntu-us1)&&(!ubuntu-6)&&(!ubuntu-eu2) #3116

Posted by Apache Jenkins Server <je...@builds.apache.org>.
See <https://builds.apache.org/job/Mesos-Buildbot/BUILDTOOL=cmake,COMPILER=gcc,CONFIGURATION=--verbose,ENVIRONMENT=GLOG_v=1%20MESOS_VERBOSE=1,OS=ubuntu%3A14.04,label_exp=(docker%7C%7CHadoop)&&(!ubuntu-us1)&&(!ubuntu-6)&&(!ubuntu-eu2)/3116/>

------------------------------------------
[...truncated 161134 lines...]
[       OK ] Endpoint/SlaveEndpointTest.AuthorizedRequest/0 (11 ms)
[ RUN      ] Endpoint/SlaveEndpointTest.AuthorizedRequest/1
I0116 23:33:39.970631 26197 containerizer.cpp:220] Using isolation: posix/cpu,posix/mem,filesystem/posix,network/cni
W0116 23:33:39.970958 26197 backend.cpp:76] Failed to create 'aufs' backend: AufsBackend requires root privileges, but is running as user mesos
W0116 23:33:39.971051 26197 backend.cpp:76] Failed to create 'bind' backend: BindBackend requires root privileges
I0116 23:33:39.972172 26202 slave.cpp:209] Mesos agent started on (675)@172.17.0.2:45352
I0116 23:33:39.972188 26202 slave.cpp:210] Flags at startup: --acls="" --appc_simple_discovery_uri_prefix="http://" --appc_store_dir="/tmp/mesos/store/appc" --authenticate_http_readonly="true" --authenticate_http_readwrite="true" --authenticatee="crammd5" --authentication_backoff_factor="1secs" --authorizer="local" --cgroups_cpu_enable_pids_and_tids_count="false" --cgroups_enable_cfs="false" --cgroups_hierarchy="/sys/fs/cgroup" --cgroups_limit_swap="false" --cgroups_root="mesos" --container_disk_watch_interval="15secs" --containerizers="mesos" --credential="/tmp/Endpoint_SlaveEndpointTest_AuthorizedRequest_1_uAYobP/credential" --default_role="*" --disk_watch_interval="1mins" --docker="docker" --docker_kill_orphans="true" --docker_registry="https://registry-1.docker.io" --docker_remove_delay="6hrs" --docker_socket="/var/run/docker.sock" --docker_stop_timeout="0ns" --docker_store_dir="/tmp/mesos/store/docker" --docker_volume_checkpoint_dir="/var/run/mesos/isolators/docker/volume" --enforce_container_disk_quota="false" --executor_registration_timeout="1mins" --executor_shutdown_grace_period="5secs" --fetcher_cache_dir="/tmp/Endpoint_SlaveEndpointTest_AuthorizedRequest_1_uAYobP/fetch" --fetcher_cache_size="2GB" --frameworks_home="" --gc_delay="1weeks" --gc_disk_headroom="0.1" --hadoop_home="" --help="false" --hostname_lookup="true" --http_authenticators="basic" --http_command_executor="false" --http_credentials="/tmp/Endpoint_SlaveEndpointTest_AuthorizedRequest_1_uAYobP/http_credentials" --http_heartbeat_interval="30secs" --image_provisioner_backend="copy" --initialize_driver_logging="true" --isolation="posix/cpu,posix/mem" --launcher="posix" --launcher_dir="/mesos/build/src" --logbufsecs="0" --logging_level="INFO" --max_completed_executors_per_framework="150" --oversubscribed_resources_interval="15secs" --perf_duration="10secs" --perf_interval="1mins" --qos_correction_interval_min="0ns" --quiet="false" --recover="reconnect" --recovery_timeout="15mins" --registration_backoff_factor="10ms" --resources="cpus:2;gpus:0;mem:1024;disk:1024;ports:[31000-32000]" --revocable_cpu_low_priority="true" --runtime_dir="/tmp/Endpoint_SlaveEndpointTest_AuthorizedRequest_1_uAYobP" --sandbox_directory="/mnt/mesos/sandbox" --strict="true" --switch_user="true" --systemd_enable_support="true" --systemd_runtime_directory="/run/systemd/system" --version="false" --work_dir="/tmp/Endpoint_SlaveEndpointTest_AuthorizedRequest_1_HgEMLB"
I0116 23:33:39.972594 26202 credentials.hpp:86] Loading credential for authentication from '/tmp/Endpoint_SlaveEndpointTest_AuthorizedRequest_1_uAYobP/credential'
I0116 23:33:39.972676 26202 slave.cpp:352] Agent using credential for: test-principal
I0116 23:33:39.972690 26202 credentials.hpp:37] Loading credentials for authentication from '/tmp/Endpoint_SlaveEndpointTest_AuthorizedRequest_1_uAYobP/http_credentials'
I0116 23:33:39.972781 26202 http.cpp:922] Using default 'basic' HTTP authenticator for realm 'mesos-agent-readonly'
I0116 23:33:39.972831 26202 http.cpp:922] Using default 'basic' HTTP authenticator for realm 'mesos-agent-readwrite'
I0116 23:33:39.973274 26202 slave.cpp:539] Agent resources: cpus(*):2; mem(*):1024; disk(*):1024; ports(*):[31000-32000]
I0116 23:33:39.973307 26202 slave.cpp:547] Agent attributes: [  ]
I0116 23:33:39.973314 26202 slave.cpp:552] Agent hostname: 4b7ce65eaafd
I0116 23:33:39.973842 26206 state.cpp:60] Recovering state from '/tmp/Endpoint_SlaveEndpointTest_AuthorizedRequest_1_HgEMLB/meta'
I0116 23:33:39.974038 26210 status_update_manager.cpp:203] Recovering status update manager
I0116 23:33:39.974140 26208 containerizer.cpp:599] Recovering containerizer
I0116 23:33:39.974639 26202 provisioner.cpp:251] Provisioner recovery complete
I0116 23:33:39.974862 26205 slave.cpp:5417] Finished recovery
I0116 23:33:39.975335 26205 slave.cpp:5591] Querying resource estimator for oversubscribable resources
I0116 23:33:39.975517 26205 slave.cpp:5605] Received oversubscribable resources {} from the resource estimator
I0116 23:33:39.976295 26203 process.cpp:3676] Handling HTTP event for process 'slave(675)' with path: '/slave(675)/monitor/statistics.json'
I0116 23:33:39.976821 26209 http.cpp:874] Authorizing principal 'test-principal' to GET the '/monitor/statistics.json' endpoint
I0116 23:33:39.978163 26201 slave.cpp:796] Agent terminating
[       OK ] Endpoint/SlaveEndpointTest.AuthorizedRequest/1 (12 ms)
[ RUN      ] Endpoint/SlaveEndpointTest.AuthorizedRequest/2
I0116 23:33:39.983232 26197 containerizer.cpp:220] Using isolation: posix/cpu,posix/mem,filesystem/posix,network/cni
W0116 23:33:39.983551 26197 backend.cpp:76] Failed to create 'aufs' backend: AufsBackend requires root privileges, but is running as user mesos
W0116 23:33:39.983630 26197 backend.cpp:76] Failed to create 'bind' backend: BindBackend requires root privileges
I0116 23:33:39.984573 26205 slave.cpp:209] Mesos agent started on (676)@172.17.0.2:45352
I0116 23:33:39.984591 26205 slave.cpp:210] Flags at startup: --acls="" --appc_simple_discovery_uri_prefix="http://" --appc_store_dir="/tmp/mesos/store/appc" --authenticate_http_readonly="true" --authenticate_http_readwrite="true" --authenticatee="crammd5" --authentication_backoff_factor="1secs" --authorizer="local" --cgroups_cpu_enable_pids_and_tids_count="false" --cgroups_enable_cfs="false" --cgroups_hierarchy="/sys/fs/cgroup" --cgroups_limit_swap="false" --cgroups_root="mesos" --container_disk_watch_interval="15secs" --containerizers="mesos" --credential="/tmp/Endpoint_SlaveEndpointTest_AuthorizedRequest_2_GeByWG/credential" --default_role="*" --disk_watch_interval="1mins" --docker="docker" --docker_kill_orphans="true" --docker_registry="https://registry-1.docker.io" --docker_remove_delay="6hrs" --docker_socket="/var/run/docker.sock" --docker_stop_timeout="0ns" --docker_store_dir="/tmp/mesos/store/docker" --docker_volume_checkpoint_dir="/var/run/mesos/isolators/docker/volume" --enforce_container_disk_quota="false" --executor_registration_timeout="1mins" --executor_shutdown_grace_period="5secs" --fetcher_cache_dir="/tmp/Endpoint_SlaveEndpointTest_AuthorizedRequest_2_GeByWG/fetch" --fetcher_cache_size="2GB" --frameworks_home="" --gc_delay="1weeks" --gc_disk_headroom="0.1" --hadoop_home="" --help="false" --hostname_lookup="true" --http_authenticators="basic" --http_command_executor="false" --http_credentials="/tmp/Endpoint_SlaveEndpointTest_AuthorizedRequest_2_GeByWG/http_credentials" --http_heartbeat_interval="30secs" --image_provisioner_backend="copy" --initialize_driver_logging="true" --isolation="posix/cpu,posix/mem" --launcher="posix" --launcher_dir="/mesos/build/src" --logbufsecs="0" --logging_level="INFO" --max_completed_executors_per_framework="150" --oversubscribed_resources_interval="15secs" --perf_duration="10secs" --perf_interval="1mins" --qos_correction_interval_min="0ns" --quiet="false" --recover="reconnect" --recovery_timeout="15mins" --registration_backoff_factor="10ms" --resources="cpus:2;gpus:0;mem:1024;disk:1024;ports:[31000-32000]" --revocable_cpu_low_priority="true" --runtime_dir="/tmp/Endpoint_SlaveEndpointTest_AuthorizedRequest_2_GeByWG" --sandbox_directory="/mnt/mesos/sandbox" --strict="true" --switch_user="true" --systemd_enable_support="true" --systemd_runtime_directory="/run/systemd/system" --version="false" --work_dir="/tmp/Endpoint_SlaveEndpointTest_AuthorizedRequest_2_D5JWut"
I0116 23:33:39.985062 26205 credentials.hpp:86] Loading credential for authentication from '/tmp/Endpoint_SlaveEndpointTest_AuthorizedRequest_2_GeByWG/credential'
I0116 23:33:39.985152 26205 slave.cpp:352] Agent using credential for: test-principal
I0116 23:33:39.985165 26205 credentials.hpp:37] Loading credentials for authentication from '/tmp/Endpoint_SlaveEndpointTest_AuthorizedRequest_2_GeByWG/http_credentials'
I0116 23:33:39.985249 26205 http.cpp:922] Using default 'basic' HTTP authenticator for realm 'mesos-agent-readonly'
I0116 23:33:39.985294 26205 http.cpp:922] Using default 'basic' HTTP authenticator for realm 'mesos-agent-readwrite'
I0116 23:33:39.985563 26205 slave.cpp:539] Agent resources: cpus(*):2; mem(*):1024; disk(*):1024; ports(*):[31000-32000]
I0116 23:33:39.985595 26205 slave.cpp:547] Agent attributes: [  ]
I0116 23:33:39.985600 26205 slave.cpp:552] Agent hostname: 4b7ce65eaafd
I0116 23:33:39.986021 26205 state.cpp:60] Recovering state from '/tmp/Endpoint_SlaveEndpointTest_AuthorizedRequest_2_D5JWut/meta'
I0116 23:33:39.986124 26205 status_update_manager.cpp:203] Recovering status update manager
I0116 23:33:39.986163 26205 containerizer.cpp:599] Recovering containerizer
I0116 23:33:39.986492 26205 provisioner.cpp:251] Provisioner recovery complete
I0116 23:33:39.986589 26205 slave.cpp:5417] Finished recovery
I0116 23:33:39.986873 26205 slave.cpp:5591] Querying resource estimator for oversubscribable resources
I0116 23:33:39.987030 26205 slave.cpp:5605] Received oversubscribable resources {} from the resource estimator
I0116 23:33:39.987834 26200 process.cpp:3676] Handling HTTP event for process 'slave(676)' with path: '/slave(676)/containers'
I0116 23:33:39.988277 26198 http.cpp:874] Authorizing principal 'test-principal' to GET the '/containers' endpoint
I0116 23:33:39.989589 26197 slave.cpp:796] Agent terminating
[       OK ] Endpoint/SlaveEndpointTest.AuthorizedRequest/2 (12 ms)
[ RUN      ] Endpoint/SlaveEndpointTest.UnauthorizedRequest/0
I0116 23:33:39.996418 26197 containerizer.cpp:220] Using isolation: posix/cpu,posix/mem,filesystem/posix,network/cni
W0116 23:33:39.996748 26197 backend.cpp:76] Failed to create 'aufs' backend: AufsBackend requires root privileges, but is running as user mesos
W0116 23:33:39.996830 26197 backend.cpp:76] Failed to create 'bind' backend: BindBackend requires root privileges
I0116 23:33:39.997942 26207 slave.cpp:209] Mesos agent started on (677)@172.17.0.2:45352
I0116 23:33:39.998188 26207 slave.cpp:210] Flags at startup: --acls="" --appc_simple_discovery_uri_prefix="http://" --appc_store_dir="/tmp/mesos/store/appc" --authenticate_http_readonly="true" --authenticate_http_readwrite="true" --authenticatee="crammd5" --authentication_backoff_factor="1secs" --authorizer="local" --cgroups_cpu_enable_pids_and_tids_count="false" --cgroups_enable_cfs="false" --cgroups_hierarchy="/sys/fs/cgroup" --cgroups_limit_swap="false" --cgroups_root="mesos" --container_disk_watch_interval="15secs" --containerizers="mesos" --credential="/tmp/Endpoint_SlaveEndpointTest_UnauthorizedRequest_0_KhwUPy/credential" --default_role="*" --disk_watch_interval="1mins" --docker="docker" --docker_kill_orphans="true" --docker_registry="https://registry-1.docker.io" --docker_remove_delay="6hrs" --docker_socket="/var/run/docker.sock" --docker_stop_timeout="0ns" --docker_store_dir="/tmp/mesos/store/docker" --docker_volume_checkpoint_dir="/var/run/mesos/isolators/docker/volume" --enforce_container_disk_quota="false" --executor_registration_timeout="1mins" --executor_shutdown_grace_period="5secs" --fetcher_cache_dir="/tmp/Endpoint_SlaveEndpointTest_UnauthorizedRequest_0_KhwUPy/fetch" --fetcher_cache_size="2GB" --frameworks_home="" --gc_delay="1weeks" --gc_disk_headroom="0.1" --hadoop_home="" --help="false" --hostname_lookup="true" --http_authenticators="basic" --http_command_executor="false" --http_credentials="/tmp/Endpoint_SlaveEndpointTest_UnauthorizedRequest_0_KhwUPy/http_credentials" --http_heartbeat_interval="30secs" --image_provisioner_backend="copy" --initialize_driver_logging="true" --isolation="posix/cpu,posix/mem" --launcher="posix" --launcher_dir="/mesos/build/src" --logbufsecs="0" --logging_level="INFO" --max_completed_executors_per_framework="150" --oversubscribed_resources_interval="15secs" --perf_duration="10secs" --perf_interval="1mins" --qos_correction_interval_min="0ns" --quiet="false" --recover="reconnect" --recovery_timeout="15mins" --registration_backoff_factor="10ms" --resources="cpus:2;gpus:0;mem:1024;disk:1024;ports:[31000-32000]" --revocable_cpu_low_priority="true" --runtime_dir="/tmp/Endpoint_SlaveEndpointTest_UnauthorizedRequest_0_KhwUPy" --sandbox_directory="/mnt/mesos/sandbox" --strict="true" --switch_user="true" --systemd_enable_support="true" --systemd_runtime_directory="/run/systemd/system" --version="false" --work_dir="/tmp/Endpoint_SlaveEndpointTest_UnauthorizedRequest_0_XKHaml"
I0116 23:33:39.998888 26207 credentials.hpp:86] Loading credential for authentication from '/tmp/Endpoint_SlaveEndpointTest_UnauthorizedRequest_0_KhwUPy/credential'
I0116 23:33:39.999142 26207 slave.cpp:352] Agent using credential for: test-principal
I0116 23:33:39.999285 26207 credentials.hpp:37] Loading credentials for authentication from '/tmp/Endpoint_SlaveEndpointTest_UnauthorizedRequest_0_KhwUPy/http_credentials'
I0116 23:33:39.999524 26207 http.cpp:922] Using default 'basic' HTTP authenticator for realm 'mesos-agent-readonly'
I0116 23:33:39.999608 26207 http.cpp:922] Using default 'basic' HTTP authenticator for realm 'mesos-agent-readwrite'
I0116 23:33:40.000080 26207 slave.cpp:539] Agent resources: cpus(*):2; mem(*):1024; disk(*):1024; ports(*):[31000-32000]
I0116 23:33:40.000123 26207 slave.cpp:547] Agent attributes: [  ]
I0116 23:33:40.000129 26207 slave.cpp:552] Agent hostname: 4b7ce65eaafd
I0116 23:33:40.000655 26202 state.cpp:60] Recovering state from '/tmp/Endpoint_SlaveEndpointTest_UnauthorizedRequest_0_XKHaml/meta'
I0116 23:33:40.000824 26201 status_update_manager.cpp:203] Recovering status update manager
I0116 23:33:40.000972 26202 containerizer.cpp:599] Recovering containerizer
I0116 23:33:40.001551 26202 provisioner.cpp:251] Provisioner recovery complete
I0116 23:33:40.001868 26212 slave.cpp:5417] Finished recovery
I0116 23:33:40.002290 26212 slave.cpp:5591] Querying resource estimator for oversubscribable resources
I0116 23:33:40.002365 26202 slave.cpp:5605] Received oversubscribable resources {} from the resource estimator
I0116 23:33:40.003130 26211 process.cpp:3676] Handling HTTP event for process 'slave(677)' with path: '/slave(677)/monitor/statistics'
I0116 23:33:40.003551 26205 http.cpp:874] Authorizing principal 'test-principal' to GET the '/monitor/statistics' endpoint
I0116 23:33:40.004621 26213 slave.cpp:796] Agent terminating
[       OK ] Endpoint/SlaveEndpointTest.UnauthorizedRequest/0 (13 ms)
[ RUN      ] Endpoint/SlaveEndpointTest.UnauthorizedRequest/1
I0116 23:33:40.008873 26197 containerizer.cpp:220] Using isolation: posix/cpu,posix/mem,filesystem/posix,network/cni
W0116 23:33:40.009219 26197 backend.cpp:76] Failed to create 'aufs' backend: AufsBackend requires root privileges, but is running as user mesos
W0116 23:33:40.009292 26197 backend.cpp:76] Failed to create 'bind' backend: BindBackend requires root privileges
I0116 23:33:40.010372 26211 slave.cpp:209] Mesos agent started on (678)@172.17.0.2:45352
I0116 23:33:40.010390 26211 slave.cpp:210] Flags at startup: --acls="" --appc_simple_discovery_uri_prefix="http://" --appc_store_dir="/tmp/mesos/store/appc" --authenticate_http_readonly="true" --authenticate_http_readwrite="true" --authenticatee="crammd5" --authentication_backoff_factor="1secs" --authorizer="local" --cgroups_cpu_enable_pids_and_tids_count="false" --cgroups_enable_cfs="false" --cgroups_hierarchy="/sys/fs/cgroup" --cgroups_limit_swap="false" --cgroups_root="mesos" --container_disk_watch_interval="15secs" --containerizers="mesos" --credential="/tmp/Endpoint_SlaveEndpointTest_UnauthorizedRequest_1_AcK5Rq/credential" --default_role="*" --disk_watch_interval="1mins" --docker="docker" --docker_kill_orphans="true" --docker_registry="https://registry-1.docker.io" --docker_remove_delay="6hrs" --docker_socket="/var/run/docker.sock" --docker_stop_timeout="0ns" --docker_store_dir="/tmp/mesos/store/docker" --docker_volume_checkpoint_dir="/var/run/mesos/isolators/docker/volume" --enforce_container_disk_quota="false" --executor_registration_timeout="1mins" --executor_shutdown_grace_period="5secs" --fetcher_cache_dir="/tmp/Endpoint_SlaveEndpointTest_UnauthorizedRequest_1_AcK5Rq/fetch" --fetcher_cache_size="2GB" --frameworks_home="" --gc_delay="1weeks" --gc_disk_headroom="0.1" --hadoop_home="" --help="false" --hostname_lookup="true" --http_authenticators="basic" --http_command_executor="false" --http_credentials="/tmp/Endpoint_SlaveEndpointTest_UnauthorizedRequest_1_AcK5Rq/http_credentials" --http_heartbeat_interval="30secs" --image_provisioner_backend="copy" --initialize_driver_logging="true" --isolation="posix/cpu,posix/mem" --launcher="posix" --launcher_dir="/mesos/build/src" --logbufsecs="0" --logging_level="INFO" --max_completed_executors_per_framework="150" --oversubscribed_resources_interval="15secs" --perf_duration="10secs" --perf_interval="1mins" --qos_correction_interval_min="0ns" --quiet="false" --recover="reconnect" --recovery_timeout="15mins" --registration_backoff_factor="10ms" --resources="cpus:2;gpus:0;mem:1024;disk:1024;ports:[31000-32000]" --revocable_cpu_low_priority="true" --runtime_dir="/tmp/Endpoint_SlaveEndpointTest_UnauthorizedRequest_1_AcK5Rq" --sandbox_directory="/mnt/mesos/sandbox" --strict="true" --switch_user="true" --systemd_enable_support="true" --systemd_runtime_directory="/run/systemd/system" --version="false" --work_dir="/tmp/Endpoint_SlaveEndpointTest_UnauthorizedRequest_1_hlnhmd"
I0116 23:33:40.010783 26211 credentials.hpp:86] Loading credential for authentication from '/tmp/Endpoint_SlaveEndpointTest_UnauthorizedRequest_1_AcK5Rq/credential'
I0116 23:33:40.010870 26211 slave.cpp:352] Agent using credential for: test-principal
I0116 23:33:40.010886 26211 credentials.hpp:37] Loading credentials for authentication from '/tmp/Endpoint_SlaveEndpointTest_UnauthorizedRequest_1_AcK5Rq/http_credentials'
I0116 23:33:40.010983 26211 http.cpp:922] Using default 'basic' HTTP authenticator for realm 'mesos-agent-readonly'
I0116 23:33:40.011029 26211 http.cpp:922] Using default 'basic' HTTP authenticator for realm 'mesos-agent-readwrite'
I0116 23:33:40.011348 26211 slave.cpp:539] Agent resources: cpus(*):2; mem(*):1024; disk(*):1024; ports(*):[31000-32000]
I0116 23:33:40.011379 26211 slave.cpp:547] Agent attributes: [  ]
I0116 23:33:40.011384 26211 slave.cpp:552] Agent hostname: 4b7ce65eaafd
I0116 23:33:40.011788 26210 state.cpp:60] Recovering state from '/tmp/Endpoint_SlaveEndpointTest_UnauthorizedRequest_1_hlnhmd/meta'
I0116 23:33:40.011909 26206 status_update_manager.cpp:203] Recovering status update manager
I0116 23:33:40.011986 26206 containerizer.cpp:599] Recovering containerizer
I0116 23:33:40.012564 26198 provisioner.cpp:251] Provisioner recovery complete
I0116 23:33:40.012759 26202 slave.cpp:5417] Finished recovery
I0116 23:33:40.013150 26202 slave.cpp:5591] Querying resource estimator for oversubscribable resources
I0116 23:33:40.013274 26207 slave.cpp:5605] Received oversubscribable resources {} from the resource estimator
I0116 23:33:40.013944 26202 process.cpp:3676] Handling HTTP event for process 'slave(678)' with path: '/slave(678)/monitor/statistics.json'
I0116 23:33:40.014372 26212 http.cpp:874] Authorizing principal 'test-principal' to GET the '/monitor/statistics.json' endpoint
I0116 23:33:40.015336 26203 slave.cpp:796] Agent terminating
[       OK ] Endpoint/SlaveEndpointTest.UnauthorizedRequest/1 (11 ms)
[ RUN      ] Endpoint/SlaveEndpointTest.UnauthorizedRequest/2
I0116 23:33:40.019480 26197 containerizer.cpp:220] Using isolation: posix/cpu,posix/mem,filesystem/posix,network/cni
W0116 23:33:40.019783 26197 backend.cpp:76] Failed to create 'aufs' backend: AufsBackend requires root privileges, but is running as user mesos
W0116 23:33:40.019865 26197 backend.cpp:76] Failed to create 'bind' backend: BindBackend requires root privileges
I0116 23:33:40.020867 26206 slave.cpp:209] Mesos agent started on (679)@172.17.0.2:45352
I0116 23:33:40.020891 26206 slave.cpp:210] Flags at startup: --acls="" --appc_simple_discovery_uri_prefix="http://" --appc_store_dir="/tmp/mesos/store/appc" --authenticate_http_readonly="true" --authenticate_http_readwrite="true" --authenticatee="crammd5" --authentication_backoff_factor="1secs" --authorizer="local" --cgroups_cpu_enable_pids_and_tids_count="false" --cgroups_enable_cfs="false" --cgroups_hierarchy="/sys/fs/cgroup" --cgroups_limit_swap="false" --cgroups_root="mesos" --container_disk_watch_interval="15secs" --containerizers="mesos" --credential="/tmp/Endpoint_SlaveEndpointTest_UnauthorizedRequest_2_2sbg1i/credential" --default_role="*" --disk_watch_interval="1mins" --docker="docker" --docker_kill_orphans="true" --docker_registry="https://registry-1.docker.io" --docker_remove_delay="6hrs" --docker_socket="/var/run/docker.sock" --docker_stop_timeout="0ns" --docker_store_dir="/tmp/mesos/store/docker" --docker_volume_checkpoint_dir="/var/run/mesos/isolators/docker/volume" --enforce_container_disk_quota="false" --executor_registration_timeout="1mins" --executor_shutdown_grace_period="5secs" --fetcher_cache_dir="/tmp/Endpoint_SlaveEndpointTest_UnauthorizedRequest_2_2sbg1i/fetch" --fetcher_cache_size="2GB" --frameworks_home="" --gc_delay="1weeks" --gc_disk_headroom="0.1" --hadoop_home="" --help="false" --hostname_lookup="true" --http_authenticators="basic" --http_command_executor="false" --http_credentials="/tmp/Endpoint_SlaveEndpointTest_UnauthorizedRequest_2_2sbg1i/http_credentials" --http_heartbeat_interval="30secs" --image_provisioner_backend="copy" --initialize_driver_logging="true" --isolation="posix/cpu,posix/mem" --launcher="posix" --launcher_dir="/mesos/build/src" --logbufsecs="0" --logging_level="INFO" --max_completed_executors_per_framework="150" --oversubscribed_resources_interval="15secs" --perf_duration="10secs" --perf_interval="1mins" --qos_correction_interval_min="0ns" --quiet="false" --recover="reconnect" --recovery_timeout="15mins" --registration_backoff_factor="10ms" --resources="cpus:2;gpus:0;mem:1024;disk:1024;ports:[31000-32000]" --revocable_cpu_low_priority="true" --runtime_dir="/tmp/Endpoint_SlaveEndpointTest_UnauthorizedRequest_2_2sbg1i" --sandbox_directory="/mnt/mesos/sandbox" --strict="true" --switch_user="true" --systemd_enable_support="true" --systemd_runtime_directory="/run/systemd/system" --version="false" --work_dir="/tmp/Endpoint_SlaveEndpointTest_UnauthorizedRequest_2_XLZHt5"
I0116 23:33:40.021409 26206 credentials.hpp:86] Loading credential for authentication from '/tmp/Endpoint_SlaveEndpointTest_UnauthorizedRequest_2_2sbg1i/credential'
I0116 23:33:40.021539 26206 slave.cpp:352] Agent using credential for: test-principal
I0116 23:33:40.021556 26206 credentials.hpp:37] Loading credentials for authentication from '/tmp/Endpoint_SlaveEndpointTest_UnauthorizedRequest_2_2sbg1i/http_credentials'
I0116 23:33:40.021683 26206 http.cpp:922] Using default 'basic' HTTP authenticator for realm 'mesos-agent-readonly'
I0116 23:33:40.021749 26206 http.cpp:922] Using default 'basic' HTTP authenticator for realm 'mesos-agent-readwrite'
I0116 23:33:40.022145 26206 slave.cpp:539] Agent resources: cpus(*):2; mem(*):1024; disk(*):1024; ports(*):[31000-32000]
I0116 23:33:40.022193 26206 slave.cpp:547] Agent attributes: [  ]
I0116 23:33:40.022203 26206 slave.cpp:552] Agent hostname: 4b7ce65eaafd
I0116 23:33:40.022897 26206 state.cpp:60] Recovering state from '/tmp/Endpoint_SlaveEndpointTest_UnauthorizedRequest_2_XLZHt5/meta'
I0116 23:33:40.023061 26206 status_update_manager.cpp:203] Recovering status update manager
I0116 23:33:40.023125 26206 containerizer.cpp:599] Recovering containerizer
I0116 23:33:40.023660 26206 provisioner.cpp:251] Provisioner recovery complete
I0116 23:33:40.023808 26206 slave.cpp:5417] Finished recovery
I0116 23:33:40.024152 26206 slave.cpp:5591] Querying resource estimator for oversubscribable resources
I0116 23:33:40.024312 26206 slave.cpp:5605] Received oversubscribable resources {} from the resource estimator
I0116 23:33:40.025135 26212 process.cpp:3676] Handling HTTP event for process 'slave(679)' with path: '/slave(679)/containers'
I0116 23:33:40.025539 26212 http.cpp:874] Authorizing principal 'test-principal' to GET the '/containers' endpoint
I0116 23:33:40.026939 26197 slave.cpp:796] Agent terminating
[       OK ] Endpoint/SlaveEndpointTest.UnauthorizedRequest/2 (12 ms)
[ RUN      ] Endpoint/SlaveEndpointTest.NoAuthorizer/0
I0116 23:33:40.031800 26197 containerizer.cpp:220] Using isolation: posix/cpu,posix/mem,filesystem/posix,network/cni
W0116 23:33:40.032083 26197 backend.cpp:76] Failed to create 'aufs' backend: AufsBackend requires root privileges, but is running as user mesos
W0116 23:33:40.032157 26197 backend.cpp:76] Failed to create 'bind' backend: BindBackend requires root privileges
I0116 23:33:40.032721 26197 cluster.cpp:446] Creating default 'local' authorizer
I0116 23:33:40.033234 26201 slave.cpp:209] Mesos agent started on (680)@172.17.0.2:45352
I0116 23:33:40.033251 26201 slave.cpp:210] Flags at startup: --acls="" --appc_simple_discovery_uri_prefix="http://" --appc_store_dir="/tmp/mesos/store/appc" --authenticate_http_readonly="true" --authenticate_http_readwrite="true" --authenticatee="crammd5" --authentication_backoff_factor="1secs" --authorizer="local" --cgroups_cpu_enable_pids_and_tids_count="false" --cgroups_enable_cfs="false" --cgroups_hierarchy="/sys/fs/cgroup" --cgroups_limit_swap="false" --cgroups_root="mesos" --container_disk_watch_interval="15secs" --containerizers="mesos" --credential="/tmp/Endpoint_SlaveEndpointTest_NoAuthorizer_0_wApaib/credential" --default_role="*" --disk_watch_interval="1mins" --docker="docker" --docker_kill_orphans="true" --docker_registry="https://registry-1.docker.io" --docker_remove_delay="6hrs" --docker_socket="/var/run/docker.sock" --docker_stop_timeout="0ns" --docker_store_dir="/tmp/mesos/store/docker" --docker_volume_checkpoint_dir="/var/run/mesos/isolators/docker/volume" --enforce_container_disk_quota="false" --executor_registration_timeout="1mins" --executor_shutdown_grace_period="5secs" --fetcher_cache_dir="/tmp/Endpoint_SlaveEndpointTest_NoAuthorizer_0_wApaib/fetch" --fetcher_cache_size="2GB" --frameworks_home="" --gc_delay="1weeks" --gc_disk_headroom="0.1" --hadoop_home="" --help="false" --hostname_lookup="true" --http_authenticators="basic" --http_command_executor="false" --http_credentials="/tmp/Endpoint_SlaveEndpointTest_NoAuthorizer_0_wApaib/http_credentials" --http_heartbeat_interval="30secs" --image_provisioner_backend="copy" --initialize_driver_logging="true" --isolation="posix/cpu,posix/mem" --launcher="posix" --launcher_dir="/mesos/build/src" --logbufsecs="0" --logging_level="INFO" --max_completed_executors_per_framework="150" --oversubscribed_resources_interval="15secs" --perf_duration="10secs" --perf_interval="1mins" --qos_correction_interval_min="0ns" --quiet="false" --recover="reconnect" --recovery_timeout="15mins" --registration_backoff_factor="10ms" --resources="cpus:2;gpus:0;mem:1024;disk:1024;ports:[31000-32000]" --revocable_cpu_low_priority="true" --runtime_dir="/tmp/Endpoint_SlaveEndpointTest_NoAuthorizer_0_wApaib" --sandbox_directory="/mnt/mesos/sandbox" --strict="true" --switch_user="true" --systemd_enable_support="true" --systemd_runtime_directory="/run/systemd/system" --version="false" --work_dir="/tmp/Endpoint_SlaveEndpointTest_NoAuthorizer_0_Gz1CIX"
I0116 23:33:40.033633 26201 credentials.hpp:86] Loading credential for authentication from '/tmp/Endpoint_SlaveEndpointTest_NoAuthorizer_0_wApaib/credential'
I0116 23:33:40.033715 26201 slave.cpp:352] Agent using credential for: test-principal
I0116 23:33:40.033730 26201 credentials.hpp:37] Loading credentials for authentication from '/tmp/Endpoint_SlaveEndpointTest_NoAuthorizer_0_wApaib/http_credentials'
I0116 23:33:40.033828 26201 http.cpp:922] Using default 'basic' HTTP authenticator for realm 'mesos-agent-readonly'
I0116 23:33:40.033872 26201 http.cpp:922] Using default 'basic' HTTP authenticator for realm 'mesos-agent-readwrite'
I0116 23:33:40.034255 26201 slave.cpp:539] Agent resources: cpus(*):2; mem(*):1024; disk(*):1024; ports(*):[31000-32000]
I0116 23:33:40.034289 26201 slave.cpp:547] Agent attributes: [  ]
I0116 23:33:40.034294 26201 slave.cpp:552] Agent hostname: 4b7ce65eaafd
I0116 23:33:40.034653 26205 state.cpp:60] Recovering state from '/tmp/Endpoint_SlaveEndpointTest_NoAuthorizer_0_Gz1CIX/meta'
I0116 23:33:40.034823 26201 status_update_manager.cpp:203] Recovering status update manager
I0116 23:33:40.034947 26211 containerizer.cpp:599] Recovering containerizer
I0116 23:33:40.035418 26208 provisioner.cpp:251] Provisioner recovery complete
I0116 23:33:40.035586 26201 slave.cpp:5417] Finished recovery
I0116 23:33:40.035980 26201 slave.cpp:5591] Querying resource estimator for oversubscribable resources
I0116 23:33:40.036240 26203 slave.cpp:5605] Received oversubscribable resources {} from the resource estimator
I0116 23:33:40.036895 26200 process.cpp:3676] Handling HTTP event for process 'slave(680)' with path: '/slave(680)/monitor/statistics'
I0116 23:33:40.037273 26205 http.cpp:874] Authorizing principal 'test-principal' to GET the '/monitor/statistics' endpoint
I0116 23:33:40.038458 26201 slave.cpp:796] Agent terminating
[       OK ] Endpoint/SlaveEndpointTest.NoAuthorizer/0 (11 ms)
[ RUN      ] Endpoint/SlaveEndpointTest.NoAuthorizer/1
I0116 23:33:40.043048 26197 containerizer.cpp:220] Using isolation: posix/cpu,posix/mem,filesystem/posix,network/cni
W0116 23:33:40.043386 26197 backend.cpp:76] Failed to create 'aufs' backend: AufsBackend requires root privileges, but is running as user mesos
W0116 23:33:40.043464 26197 backend.cpp:76] Failed to create 'bind' backend: BindBackend requires root privileges
I0116 23:33:40.043997 26197 cluster.cpp:446] Creating default 'local' authorizer
I0116 23:33:40.044531 26206 slave.cpp:209] Mesos agent started on (681)@172.17.0.2:45352
I0116 23:33:40.044559 26206 slave.cpp:210] Flags at startup: --acls="" --appc_simple_discovery_uri_prefix="http://" --appc_store_dir="/tmp/mesos/store/appc" --authenticate_http_readonly="true" --authenticate_http_readwrite="true" --authenticatee="crammd5" --authentication_backoff_factor="1secs" --authorizer="local" --cgroups_cpu_enable_pids_and_tids_count="false" --cgroups_enable_cfs="false" --cgroups_hierarchy="/sys/fs/cgroup" --cgroups_limit_swap="false" --cgroups_root="mesos" --container_disk_watch_interval="15secs" --containerizers="mesos" --credential="/tmp/Endpoint_SlaveEndpointTest_NoAuthorizer_1_Iz3rG3/credential" --default_role="*" --disk_watch_interval="1mins" --docker="docker" --docker_kill_orphans="true" --docker_registry="https://registry-1.docker.io" --docker_remove_delay="6hrs" --docker_socket="/var/run/docker.sock" --docker_stop_timeout="0ns" --docker_store_dir="/tmp/mesos/store/docker" --docker_volume_checkpoint_dir="/var/run/mesos/isolators/docker/volume" --enforce_container_disk_quota="false" --executor_registration_timeout="1mins" --executor_shutdown_grace_period="5secs" --fetcher_cache_dir="/tmp/Endpoint_SlaveEndpointTest_NoAuthorizer_1_Iz3rG3/fetch" --fetcher_cache_size="2GB" --frameworks_home="" --gc_delay="1weeks" --gc_disk_headroom="0.1" --hadoop_home="" --help="false" --hostname_lookup="true" --http_authenticators="basic" --http_command_executor="false" --http_credentials="/tmp/Endpoint_SlaveEndpointTest_NoAuthorizer_1_Iz3rG3/http_credentials" --http_heartbeat_interval="30secs" --image_provisioner_backend="copy" --initialize_driver_logging="true" --isolation="posix/cpu,posix/mem" --launcher="posix" --launcher_dir="/mesos/build/src" --logbufsecs="0" --logging_level="INFO" --max_completed_executors_per_framework="150" --oversubscribed_resources_interval="15secs" --perf_duration="10secs" --perf_interval="1mins" --qos_correction_interval_min="0ns" --quiet="false" --recover="reconnect" --recovery_timeout="15mins" --registration_backoff_factor="10ms" --resources="cpus:2;gpus:0;mem:1024;disk:1024;ports:[31000-32000]" --revocable_cpu_low_priority="true" --runtime_dir="/tmp/Endpoint_SlaveEndpointTest_NoAuthorizer_1_Iz3rG3" --sandbox_directory="/mnt/mesos/sandbox" --strict="true" --switch_user="true" --systemd_enable_support="true" --systemd_runtime_directory="/run/systemd/system" --version="false" --work_dir="/tmp/Endpoint_SlaveEndpointTest_NoAuthorizer_1_n3G54P"
I0116 23:33:40.044881 26206 credentials.hpp:86] Loading credential for authentication from '/tmp/Endpoint_SlaveEndpointTest_NoAuthorizer_1_Iz3rG3/credential'
I0116 23:33:40.045089 26206 slave.cpp:352] Agent using credential for: test-principal
I0116 23:33:40.045102 26206 credentials.hpp:37] Loading credentials for authentication from '/tmp/Endpoint_SlaveEndpointTest_NoAuthorizer_1_Iz3rG3/http_credentials'
I0116 23:33:40.045224 26206 http.cpp:922] Using default 'basic' HTTP authenticator for realm 'mesos-agent-readonly'
I0116 23:33:40.045310 26206 http.cpp:922] Using default 'basic' HTTP authenticator for realm 'mesos-agent-readwrite'
I0116 23:33:40.045742 26206 slave.cpp:539] Agent resources: cpus(*):2; mem(*):1024; disk(*):1024; ports(*):[31000-32000]
I0116 23:33:40.045796 26206 slave.cpp:547] Agent attributes: [  ]
I0116 23:33:40.045811 26206 slave.cpp:552] Agent hostname: 4b7ce65eaafd
I0116 23:33:40.046514 26206 state.cpp:60] Recovering state from '/tmp/Endpoint_SlaveEndpointTest_NoAuthorizer_1_n3G54P/meta'
I0116 23:33:40.046679 26206 status_update_manager.cpp:203] Recovering status update manager
I0116 23:33:40.046747 26206 containerizer.cpp:599] Recovering containerizer
I0116 23:33:40.047336 26206 provisioner.cpp:251] Provisioner recovery complete
I0116 23:33:40.047493 26206 slave.cpp:5417] Finished recovery
I0116 23:33:40.047935 26206 slave.cpp:5591] Querying resource estimator for oversubscribable resources
I0116 23:33:40.048099 26206 slave.cpp:5605] Received oversubscribable resources {} from the resource estimator
I0116 23:33:40.049700 26205 process.cpp:3676] Handling HTTP event for process 'slave(681)' with path: '/slave(681)/monitor/statistics.json'
I0116 23:33:40.050114 26205 http.cpp:874] Authorizing principal 'test-principal' to GET the '/monitor/statistics.json' endpoint
I0116 23:33:40.051713 26199 slave.cpp:796] Agent terminating
[       OK ] Endpoint/SlaveEndpointTest.NoAuthorizer/1 (13 ms)
[ RUN      ] Endpoint/SlaveEndpointTest.NoAuthorizer/2
I0116 23:33:40.056208 26197 containerizer.cpp:220] Using isolation: posix/cpu,posix/mem,filesystem/posix,network/cni
W0116 23:33:40.056519 26197 backend.cpp:76] Failed to create 'aufs' backend: AufsBackend requires root privileges, but is running as user mesos
W0116 23:33:40.056646 26197 backend.cpp:76] Failed to create 'bind' backend: BindBackend requires root privileges
I0116 23:33:40.057677 26197 cluster.cpp:446] Creating default 'local' authorizer
I0116 23:33:40.058101 26201 slave.cpp:209] Mesos agent started on (682)@172.17.0.2:45352
I0116 23:33:40.058117 26201 slave.cpp:210] Flags at startup: --acls="" --appc_simple_discovery_uri_prefix="http://" --appc_store_dir="/tmp/mesos/store/appc" --authenticate_http_readonly="true" --authenticate_http_readwrite="true" --authenticatee="crammd5" --authentication_backoff_factor="1secs" --authorizer="local" --cgroups_cpu_enable_pids_and_tids_count="false" --cgroups_enable_cfs="false" --cgroups_hierarchy="/sys/fs/cgroup" --cgroups_limit_swap="false" --cgroups_root="mesos" --container_disk_watch_interval="15secs" --containerizers="mesos" --credential="/tmp/Endpoint_SlaveEndpointTest_NoAuthorizer_2_u1R4cW/credential" --default_role="*" --disk_watch_interval="1mins" --docker="docker" --docker_kill_orphans="true" --docker_registry="https://registry-1.docker.io" --docker_remove_delay="6hrs" --docker_socket="/var/run/docker.sock" --docker_stop_timeout="0ns" --docker_store_dir="/tmp/mesos/store/docker" --docker_volume_checkpoint_dir="/var/run/mesos/isolators/docker/volume" --enforce_container_disk_quota="false" --executor_registration_timeout="1mins" --executor_shutdown_grace_period="5secs" --fetcher_cache_dir="/tmp/Endpoint_SlaveEndpointTest_NoAuthorizer_2_u1R4cW/fetch" --fetcher_cache_size="2GB" --frameworks_home="" --gc_delay="1weeks" --gc_disk_headroom="0.1" --hadoop_home="" --help="false" --hostname_lookup="true" --http_authenticators="basic" --http_command_executor="false" --http_credentials="/tmp/Endpoint_SlaveEndpointTest_NoAuthorizer_2_u1R4cW/http_credentials" --http_heartbeat_interval="30secs" --image_provisioner_backend="copy" --initialize_driver_logging="true" --isolation="posix/cpu,posix/mem" --launcher="posix" --launcher_dir="/mesos/build/src" --logbufsecs="0" --logging_level="INFO" --max_completed_executors_per_framework="150" --oversubscribed_resources_interval="15secs" --perf_duration="10secs" --perf_interval="1mins" --qos_correction_interval_min="0ns" --quiet="false" --recover="reconnect" --recovery_timeout="15mins" --registration_backoff_factor="10ms" --resources="cpus:2;gpus:0;mem:1024;disk:1024;ports:[31000-32000]" --revocable_cpu_low_priority="true" --runtime_dir="/tmp/Endpoint_SlaveEndpointTest_NoAuthorizer_2_u1R4cW" --sandbox_directory="/mnt/mesos/sandbox" --strict="true" --switch_user="true" --systemd_enable_support="true" --systemd_runtime_directory="/run/systemd/system" --version="false" --work_dir="/tmp/Endpoint_SlaveEndpointTest_NoAuthorizer_2_JhAAzI"
I0116 23:33:40.058464 26201 credentials.hpp:86] Loading credential for authentication from '/tmp/Endpoint_SlaveEndpointTest_NoAuthorizer_2_u1R4cW/credential'
I0116 23:33:40.058559 26201 slave.cpp:352] Agent using credential for: test-principal
I0116 23:33:40.058573 26201 credentials.hpp:37] Loading credentials for authentication from '/tmp/Endpoint_SlaveEndpointTest_NoAuthorizer_2_u1R4cW/http_credentials'
I0116 23:33:40.058688 26201 http.cpp:922] Using default 'basic' HTTP authenticator for realm 'mesos-agent-readonly'
I0116 23:33:40.058753 26201 http.cpp:922] Using default 'basic' HTTP authenticator for realm 'mesos-agent-readwrite'
I0116 23:33:40.059144 26201 slave.cpp:539] Agent resources: cpus(*):2; mem(*):1024; disk(*):1024; ports(*):[31000-32000]
I0116 23:33:40.059176 26201 slave.cpp:547] Agent attributes: [  ]
I0116 23:33:40.059181 26201 slave.cpp:552] Agent hostname: 4b7ce65eaafd
I0116 23:33:40.059556 26213 state.cpp:60] Recovering state from '/tmp/Endpoint_SlaveEndpointTest_NoAuthorizer_2_JhAAzI/meta'
I0116 23:33:40.059698 26211 status_update_manager.cpp:203] Recovering status update manager
I0116 23:33:40.059762 26211 containerizer.cpp:599] Recovering containerizer
I0116 23:33:40.060159 26211 provisioner.cpp:251] Provisioner recovery complete
I0116 23:33:40.060271 26211 slave.cpp:5417] Finished recovery
I0116 23:33:40.060591 26211 slave.cpp:5591] Querying resource estimator for oversubscribable resources
I0116 23:33:40.060708 26211 slave.cpp:5605] Received oversubscribable resources {} from the resource estimator
I0116 23:33:40.061417 26202 process.cpp:3676] Handling HTTP event for process 'slave(682)' with path: '/slave(682)/containers'
I0116 23:33:40.061847 26213 http.cpp:874] Authorizing principal 'test-principal' to GET the '/containers' endpoint
I0116 23:33:40.063345 26200 slave.cpp:796] Agent terminating
[       OK ] Endpoint/SlaveEndpointTest.NoAuthorizer/2 (12 ms)
[----------] 9 tests from Endpoint/SlaveEndpointTest (109 ms total)

[----------] Global test environment tear-down
[==========] 1401 tests from 157 test cases ran. (182459 ms total)
[  PASSED  ] 1400 tests.
[  FAILED  ] 1 test, listed below:
[  FAILED  ] SlaveRecoveryTest/0.RecoverTerminatedExecutor, where TypeParam = mesos::internal::slave::MesosContainerizer

 1 FAILED TEST
  YOU HAVE 14 DISABLED TESTS

make[3]: *** [CMakeFiles/check] Error 1
make[3]: Leaving directory `/mesos/build'
make[2]: *** [CMakeFiles/check.dir/all] Error 2
make[2]: Leaving directory `/mesos/build'
make[1]: *** [CMakeFiles/check.dir/rule] Error 2
make[1]: Leaving directory `/mesos/build'
make: *** [check] Error 2
+ docker rmi mesos-1484606345-371
Untagged: mesos-1484606345-371:latest
Deleted: sha256:56cfdce63b6f9decaa94ed2fecefd62105168cc5f732039d9e8c754ad7146b9c
Deleted: sha256:521d8018b8d79577906819adee7d1fcea97066c992d617c6f12c6ad96f315085
Deleted: sha256:23f2ffc9dba37829c1f99314b3b8dd13af9d31770ab7ee376dbe0e62154e2d3d
Deleted: sha256:5578420bdc9181cb690477bcb11801689ea97f4ea4a7d6dea49bcadadad10dd8
Deleted: sha256:085921b6b8ac2072d53a5829e522cffdbc01e825749a5289eafc83c36c068355
Deleted: sha256:c1dbff7de4bf36295889c16fae50b63e6e96230d6427e7375e8a7751ac794f33
Deleted: sha256:126cb55ed715dca9a59ff210a833714bb99a33f2ef91966991a3099a61d04248
Deleted: sha256:ead553514b6e573abbaebb8b3acba5ef16e64ad23ac9fa48f7eded11fc3d5d3c
Deleted: sha256:8a8000a1e78538a92553dbb107fcbdab85753525f39d2c1a2cdebfcb1d6a662e
Deleted: sha256:e06d70fd8ad8fdc20bd2d7d76b1cde0e94c6f0fdf3bc79dc0475d036c21bfeb6
Deleted: sha256:958cdb0a9669055b980395483c208cd10bea59af149e63565ca53fb6f4f13670
Deleted: sha256:6fcabb3f0cb8a6a5083b3579876227999eb2839809f7fcaf1e9865175c15e36c
Deleted: sha256:b023750883cce5a1dfa35cfa595f3747485da37c3f28abb45f26e4b902452f49
Deleted: sha256:3b5bb8492b8f671fdc49f2eb70ed9cbe4d4367b1b96433d4601c3cdfc3f69b9d
Deleted: sha256:4df7d0fea4aef3a368f9a0ebaa48dca61d7e52b2f5983635275a152cc37fc232
Deleted: sha256:c20dc04b2f1f8b82f6e0b96b232ceba39611c67e1f7917db5260647dd153710c
Deleted: sha256:b4663914ca66397ad0836abc9c04a809ccab12227c5dacdcba533bd367313b28
Deleted: sha256:ce65e59fe5d1f5ab38792e1ba8c5c041a48e464ca0b71c33cf4820a997a1ec19
Deleted: sha256:cef447c4c4ee3b4fff2bbcfd645fc846d7d98d393f9f576e026b1e6490770d8d
Deleted: sha256:dc7897e1a6985098df7f84d98ee3b02eb94c511c7156d57acc487819b205ef4d
Deleted: sha256:600833b478f499d662fd0aa56acbf559387f522977f911f9badb7126e72e753c
Deleted: sha256:d8b6bad6a8af9cd2605be9f38b895f70c7b3bcb3267723adf1f9eaac24f4fbf0
Deleted: sha256:23ac4b3b0894a1fb26b67c000fc6bbd007d6c1e9399262328ddcd211b19c9939
Deleted: sha256:38867a7195ee8ab860bce487919fc7dc471b2ac3a33e7c93022adeb1c7fa61cb
Build step 'Execute shell' marked build as failure

Build failed in Jenkins: Mesos-Buildbot » cmake,gcc,--verbose,GLOG_v=1 MESOS_VERBOSE=1,ubuntu:14.04,(docker||Hadoop)&&(!ubuntu-us1)&&(!ubuntu-6)&&(!ubuntu-eu2) #3115

Posted by Apache Jenkins Server <je...@builds.apache.org>.
See <https://builds.apache.org/job/Mesos-Buildbot/BUILDTOOL=cmake,COMPILER=gcc,CONFIGURATION=--verbose,ENVIRONMENT=GLOG_v=1%20MESOS_VERBOSE=1,OS=ubuntu%3A14.04,label_exp=(docker%7C%7CHadoop)&&(!ubuntu-us1)&&(!ubuntu-6)&&(!ubuntu-eu2)/3115/changes>

Changes:

[haosdent] Extended copyright in website footer to 2017.

[vinodkone] Updated CHANGELOG for 1.0.3.

------------------------------------------
[...truncated 161580 lines...]
[       OK ] Endpoint/SlaveEndpointTest.AuthorizedRequest/0 (13 ms)
[ RUN      ] Endpoint/SlaveEndpointTest.AuthorizedRequest/1
I0116 18:31:47.566514 26192 containerizer.cpp:220] Using isolation: posix/cpu,posix/mem,filesystem/posix,network/cni
W0116 18:31:47.566890 26192 backend.cpp:76] Failed to create 'aufs' backend: AufsBackend requires root privileges, but is running as user mesos
W0116 18:31:47.566997 26192 backend.cpp:76] Failed to create 'bind' backend: BindBackend requires root privileges
I0116 18:31:47.568526 26197 slave.cpp:209] Mesos agent started on (675)@172.17.0.2:39138
I0116 18:31:47.568545 26197 slave.cpp:210] Flags at startup: --acls="" --appc_simple_discovery_uri_prefix="http://" --appc_store_dir="/tmp/mesos/store/appc" --authenticate_http_readonly="true" --authenticate_http_readwrite="true" --authenticatee="crammd5" --authentication_backoff_factor="1secs" --authorizer="local" --cgroups_cpu_enable_pids_and_tids_count="false" --cgroups_enable_cfs="false" --cgroups_hierarchy="/sys/fs/cgroup" --cgroups_limit_swap="false" --cgroups_root="mesos" --container_disk_watch_interval="15secs" --containerizers="mesos" --credential="/tmp/Endpoint_SlaveEndpointTest_AuthorizedRequest_1_kJyHyE/credential" --default_role="*" --disk_watch_interval="1mins" --docker="docker" --docker_kill_orphans="true" --docker_registry="https://registry-1.docker.io" --docker_remove_delay="6hrs" --docker_socket="/var/run/docker.sock" --docker_stop_timeout="0ns" --docker_store_dir="/tmp/mesos/store/docker" --docker_volume_checkpoint_dir="/var/run/mesos/isolators/docker/volume" --enforce_container_disk_quota="false" --executor_registration_timeout="1mins" --executor_shutdown_grace_period="5secs" --fetcher_cache_dir="/tmp/Endpoint_SlaveEndpointTest_AuthorizedRequest_1_kJyHyE/fetch" --fetcher_cache_size="2GB" --frameworks_home="" --gc_delay="1weeks" --gc_disk_headroom="0.1" --hadoop_home="" --help="false" --hostname_lookup="true" --http_authenticators="basic" --http_command_executor="false" --http_credentials="/tmp/Endpoint_SlaveEndpointTest_AuthorizedRequest_1_kJyHyE/http_credentials" --http_heartbeat_interval="30secs" --image_provisioner_backend="copy" --initialize_driver_logging="true" --isolation="posix/cpu,posix/mem" --launcher="posix" --launcher_dir="/mesos/build/src" --logbufsecs="0" --logging_level="INFO" --max_completed_executors_per_framework="150" --oversubscribed_resources_interval="15secs" --perf_duration="10secs" --perf_interval="1mins" --qos_correction_interval_min="0ns" --quiet="false" --recover="reconnect" --recovery_timeout="15mins" --registration_backoff_factor="10ms" --resources="cpus:2;gpus:0;mem:1024;disk:1024;ports:[31000-32000]" --revocable_cpu_low_priority="true" --runtime_dir="/tmp/Endpoint_SlaveEndpointTest_AuthorizedRequest_1_kJyHyE" --sandbox_directory="/mnt/mesos/sandbox" --strict="true" --switch_user="true" --systemd_enable_support="true" --systemd_runtime_directory="/run/systemd/system" --version="false" --work_dir="/tmp/Endpoint_SlaveEndpointTest_AuthorizedRequest_1_uBiGYa"
I0116 18:31:47.568949 26197 credentials.hpp:86] Loading credential for authentication from '/tmp/Endpoint_SlaveEndpointTest_AuthorizedRequest_1_kJyHyE/credential'
I0116 18:31:47.569046 26197 slave.cpp:352] Agent using credential for: test-principal
I0116 18:31:47.569064 26197 credentials.hpp:37] Loading credentials for authentication from '/tmp/Endpoint_SlaveEndpointTest_AuthorizedRequest_1_kJyHyE/http_credentials'
I0116 18:31:47.569175 26197 http.cpp:922] Using default 'basic' HTTP authenticator for realm 'mesos-agent-readonly'
I0116 18:31:47.569222 26197 http.cpp:922] Using default 'basic' HTTP authenticator for realm 'mesos-agent-readwrite'
I0116 18:31:47.569716 26197 slave.cpp:539] Agent resources: cpus(*):2; mem(*):1024; disk(*):1024; ports(*):[31000-32000]
I0116 18:31:47.569757 26197 slave.cpp:547] Agent attributes: [  ]
I0116 18:31:47.569767 26197 slave.cpp:552] Agent hostname: 5bfe6702496e
I0116 18:31:47.570217 26204 state.cpp:60] Recovering state from '/tmp/Endpoint_SlaveEndpointTest_AuthorizedRequest_1_uBiGYa/meta'
I0116 18:31:47.570492 26194 status_update_manager.cpp:203] Recovering status update manager
I0116 18:31:47.570595 26204 containerizer.cpp:599] Recovering containerizer
I0116 18:31:47.571210 26204 provisioner.cpp:251] Provisioner recovery complete
I0116 18:31:47.571436 26206 slave.cpp:5417] Finished recovery
I0116 18:31:47.571910 26206 slave.cpp:5591] Querying resource estimator for oversubscribable resources
I0116 18:31:47.572054 26203 slave.cpp:5605] Received oversubscribable resources {} from the resource estimator
I0116 18:31:47.572798 26195 process.cpp:3676] Handling HTTP event for process 'slave(675)' with path: '/slave(675)/monitor/statistics.json'
I0116 18:31:47.573292 26197 http.cpp:874] Authorizing principal 'test-principal' to GET the '/monitor/statistics.json' endpoint
I0116 18:31:47.574867 26194 slave.cpp:796] Agent terminating
[       OK ] Endpoint/SlaveEndpointTest.AuthorizedRequest/1 (15 ms)
[ RUN      ] Endpoint/SlaveEndpointTest.AuthorizedRequest/2
I0116 18:31:47.582744 26192 containerizer.cpp:220] Using isolation: posix/cpu,posix/mem,filesystem/posix,network/cni
W0116 18:31:47.583159 26192 backend.cpp:76] Failed to create 'aufs' backend: AufsBackend requires root privileges, but is running as user mesos
W0116 18:31:47.583251 26192 backend.cpp:76] Failed to create 'bind' backend: BindBackend requires root privileges
I0116 18:31:47.584656 26194 slave.cpp:209] Mesos agent started on (676)@172.17.0.2:39138
I0116 18:31:47.584673 26194 slave.cpp:210] Flags at startup: --acls="" --appc_simple_discovery_uri_prefix="http://" --appc_store_dir="/tmp/mesos/store/appc" --authenticate_http_readonly="true" --authenticate_http_readwrite="true" --authenticatee="crammd5" --authentication_backoff_factor="1secs" --authorizer="local" --cgroups_cpu_enable_pids_and_tids_count="false" --cgroups_enable_cfs="false" --cgroups_hierarchy="/sys/fs/cgroup" --cgroups_limit_swap="false" --cgroups_root="mesos" --container_disk_watch_interval="15secs" --containerizers="mesos" --credential="/tmp/Endpoint_SlaveEndpointTest_AuthorizedRequest_2_wZbC1y/credential" --default_role="*" --disk_watch_interval="1mins" --docker="docker" --docker_kill_orphans="true" --docker_registry="https://registry-1.docker.io" --docker_remove_delay="6hrs" --docker_socket="/var/run/docker.sock" --docker_stop_timeout="0ns" --docker_store_dir="/tmp/mesos/store/docker" --docker_volume_checkpoint_dir="/var/run/mesos/isolators/docker/volume" --enforce_container_disk_quota="false" --executor_registration_timeout="1mins" --executor_shutdown_grace_period="5secs" --fetcher_cache_dir="/tmp/Endpoint_SlaveEndpointTest_AuthorizedRequest_2_wZbC1y/fetch" --fetcher_cache_size="2GB" --frameworks_home="" --gc_delay="1weeks" --gc_disk_headroom="0.1" --hadoop_home="" --help="false" --hostname_lookup="true" --http_authenticators="basic" --http_command_executor="false" --http_credentials="/tmp/Endpoint_SlaveEndpointTest_AuthorizedRequest_2_wZbC1y/http_credentials" --http_heartbeat_interval="30secs" --image_provisioner_backend="copy" --initialize_driver_logging="true" --isolation="posix/cpu,posix/mem" --launcher="posix" --launcher_dir="/mesos/build/src" --logbufsecs="0" --logging_level="INFO" --max_completed_executors_per_framework="150" --oversubscribed_resources_interval="15secs" --perf_duration="10secs" --perf_interval="1mins" --qos_correction_interval_min="0ns" --quiet="false" --recover="reconnect" --recovery_timeout="15mins" --registration_backoff_factor="10ms" --resources="cpus:2;gpus:0;mem:1024;disk:1024;ports:[31000-32000]" --revocable_cpu_low_priority="true" --runtime_dir="/tmp/Endpoint_SlaveEndpointTest_AuthorizedRequest_2_wZbC1y" --sandbox_directory="/mnt/mesos/sandbox" --strict="true" --switch_user="true" --systemd_enable_support="true" --systemd_runtime_directory="/run/systemd/system" --version="false" --work_dir="/tmp/Endpoint_SlaveEndpointTest_AuthorizedRequest_2_UcRWo5"
I0116 18:31:47.585113 26194 credentials.hpp:86] Loading credential for authentication from '/tmp/Endpoint_SlaveEndpointTest_AuthorizedRequest_2_wZbC1y/credential'
I0116 18:31:47.585232 26194 slave.cpp:352] Agent using credential for: test-principal
I0116 18:31:47.585256 26194 credentials.hpp:37] Loading credentials for authentication from '/tmp/Endpoint_SlaveEndpointTest_AuthorizedRequest_2_wZbC1y/http_credentials'
I0116 18:31:47.585389 26194 http.cpp:922] Using default 'basic' HTTP authenticator for realm 'mesos-agent-readonly'
I0116 18:31:47.585441 26194 http.cpp:922] Using default 'basic' HTTP authenticator for realm 'mesos-agent-readwrite'
I0116 18:31:47.585842 26194 slave.cpp:539] Agent resources: cpus(*):2; mem(*):1024; disk(*):1024; ports(*):[31000-32000]
I0116 18:31:47.585885 26194 slave.cpp:547] Agent attributes: [  ]
I0116 18:31:47.585892 26194 slave.cpp:552] Agent hostname: 5bfe6702496e
I0116 18:31:47.586323 26208 state.cpp:60] Recovering state from '/tmp/Endpoint_SlaveEndpointTest_AuthorizedRequest_2_UcRWo5/meta'
I0116 18:31:47.586510 26205 status_update_manager.cpp:203] Recovering status update manager
I0116 18:31:47.586629 26205 containerizer.cpp:599] Recovering containerizer
I0116 18:31:47.587362 26193 provisioner.cpp:251] Provisioner recovery complete
I0116 18:31:47.587625 26208 slave.cpp:5417] Finished recovery
I0116 18:31:47.588062 26208 slave.cpp:5591] Querying resource estimator for oversubscribable resources
I0116 18:31:47.588249 26203 slave.cpp:5605] Received oversubscribable resources {} from the resource estimator
I0116 18:31:47.588918 26193 process.cpp:3676] Handling HTTP event for process 'slave(676)' with path: '/slave(676)/containers'
I0116 18:31:47.589382 26193 http.cpp:874] Authorizing principal 'test-principal' to GET the '/containers' endpoint
I0116 18:31:47.590837 26199 slave.cpp:796] Agent terminating
[       OK ] Endpoint/SlaveEndpointTest.AuthorizedRequest/2 (13 ms)
[ RUN      ] Endpoint/SlaveEndpointTest.UnauthorizedRequest/0
I0116 18:31:47.599467 26192 containerizer.cpp:220] Using isolation: posix/cpu,posix/mem,filesystem/posix,network/cni
W0116 18:31:47.599889 26192 backend.cpp:76] Failed to create 'aufs' backend: AufsBackend requires root privileges, but is running as user mesos
W0116 18:31:47.600033 26192 backend.cpp:76] Failed to create 'bind' backend: BindBackend requires root privileges
I0116 18:31:47.601608 26197 slave.cpp:209] Mesos agent started on (677)@172.17.0.2:39138
I0116 18:31:47.601624 26197 slave.cpp:210] Flags at startup: --acls="" --appc_simple_discovery_uri_prefix="http://" --appc_store_dir="/tmp/mesos/store/appc" --authenticate_http_readonly="true" --authenticate_http_readwrite="true" --authenticatee="crammd5" --authentication_backoff_factor="1secs" --authorizer="local" --cgroups_cpu_enable_pids_and_tids_count="false" --cgroups_enable_cfs="false" --cgroups_hierarchy="/sys/fs/cgroup" --cgroups_limit_swap="false" --cgroups_root="mesos" --container_disk_watch_interval="15secs" --containerizers="mesos" --credential="/tmp/Endpoint_SlaveEndpointTest_UnauthorizedRequest_0_M24lFt/credential" --default_role="*" --disk_watch_interval="1mins" --docker="docker" --docker_kill_orphans="true" --docker_registry="https://registry-1.docker.io" --docker_remove_delay="6hrs" --docker_socket="/var/run/docker.sock" --docker_stop_timeout="0ns" --docker_store_dir="/tmp/mesos/store/docker" --docker_volume_checkpoint_dir="/var/run/mesos/isolators/docker/volume" --enforce_container_disk_quota="false" --executor_registration_timeout="1mins" --executor_shutdown_grace_period="5secs" --fetcher_cache_dir="/tmp/Endpoint_SlaveEndpointTest_UnauthorizedRequest_0_M24lFt/fetch" --fetcher_cache_size="2GB" --frameworks_home="" --gc_delay="1weeks" --gc_disk_headroom="0.1" --hadoop_home="" --help="false" --hostname_lookup="true" --http_authenticators="basic" --http_command_executor="false" --http_credentials="/tmp/Endpoint_SlaveEndpointTest_UnauthorizedRequest_0_M24lFt/http_credentials" --http_heartbeat_interval="30secs" --image_provisioner_backend="copy" --initialize_driver_logging="true" --isolation="posix/cpu,posix/mem" --launcher="posix" --launcher_dir="/mesos/build/src" --logbufsecs="0" --logging_level="INFO" --max_completed_executors_per_framework="150" --oversubscribed_resources_interval="15secs" --perf_duration="10secs" --perf_interval="1mins" --qos_correction_interval_min="0ns" --quiet="false" --recover="reconnect" --recovery_timeout="15mins" --registration_backoff_factor="10ms" --resources="cpus:2;gpus:0;mem:1024;disk:1024;ports:[31000-32000]" --revocable_cpu_low_priority="true" --runtime_dir="/tmp/Endpoint_SlaveEndpointTest_UnauthorizedRequest_0_M24lFt" --sandbox_directory="/mnt/mesos/sandbox" --strict="true" --switch_user="true" --systemd_enable_support="true" --systemd_runtime_directory="/run/systemd/system" --version="false" --work_dir="/tmp/Endpoint_SlaveEndpointTest_UnauthorizedRequest_0_qoOXZZ"
I0116 18:31:47.601954 26197 credentials.hpp:86] Loading credential for authentication from '/tmp/Endpoint_SlaveEndpointTest_UnauthorizedRequest_0_M24lFt/credential'
I0116 18:31:47.602037 26197 slave.cpp:352] Agent using credential for: test-principal
I0116 18:31:47.602057 26197 credentials.hpp:37] Loading credentials for authentication from '/tmp/Endpoint_SlaveEndpointTest_UnauthorizedRequest_0_M24lFt/http_credentials'
I0116 18:31:47.602164 26197 http.cpp:922] Using default 'basic' HTTP authenticator for realm 'mesos-agent-readonly'
I0116 18:31:47.602207 26197 http.cpp:922] Using default 'basic' HTTP authenticator for realm 'mesos-agent-readwrite'
I0116 18:31:47.602573 26197 slave.cpp:539] Agent resources: cpus(*):2; mem(*):1024; disk(*):1024; ports(*):[31000-32000]
I0116 18:31:47.602612 26197 slave.cpp:547] Agent attributes: [  ]
I0116 18:31:47.602622 26197 slave.cpp:552] Agent hostname: 5bfe6702496e
I0116 18:31:47.602941 26199 state.cpp:60] Recovering state from '/tmp/Endpoint_SlaveEndpointTest_UnauthorizedRequest_0_qoOXZZ/meta'
I0116 18:31:47.603200 26198 status_update_manager.cpp:203] Recovering status update manager
I0116 18:31:47.603304 26196 containerizer.cpp:599] Recovering containerizer
I0116 18:31:47.604058 26200 provisioner.cpp:251] Provisioner recovery complete
I0116 18:31:47.604301 26195 slave.cpp:5417] Finished recovery
I0116 18:31:47.604655 26195 slave.cpp:5591] Querying resource estimator for oversubscribable resources
I0116 18:31:47.604785 26200 slave.cpp:5605] Received oversubscribable resources {} from the resource estimator
I0116 18:31:47.605459 26199 process.cpp:3676] Handling HTTP event for process 'slave(677)' with path: '/slave(677)/monitor/statistics'
I0116 18:31:47.605978 26200 http.cpp:874] Authorizing principal 'test-principal' to GET the '/monitor/statistics' endpoint
I0116 18:31:47.606853 26204 slave.cpp:796] Agent terminating
[       OK ] Endpoint/SlaveEndpointTest.UnauthorizedRequest/0 (12 ms)
[ RUN      ] Endpoint/SlaveEndpointTest.UnauthorizedRequest/1
I0116 18:31:47.616328 26192 containerizer.cpp:220] Using isolation: posix/cpu,posix/mem,filesystem/posix,network/cni
W0116 18:31:47.616696 26192 backend.cpp:76] Failed to create 'aufs' backend: AufsBackend requires root privileges, but is running as user mesos
W0116 18:31:47.616783 26192 backend.cpp:76] Failed to create 'bind' backend: BindBackend requires root privileges
I0116 18:31:47.618501 26198 slave.cpp:209] Mesos agent started on (678)@172.17.0.2:39138
I0116 18:31:47.618520 26198 slave.cpp:210] Flags at startup: --acls="" --appc_simple_discovery_uri_prefix="http://" --appc_store_dir="/tmp/mesos/store/appc" --authenticate_http_readonly="true" --authenticate_http_readwrite="true" --authenticatee="crammd5" --authentication_backoff_factor="1secs" --authorizer="local" --cgroups_cpu_enable_pids_and_tids_count="false" --cgroups_enable_cfs="false" --cgroups_hierarchy="/sys/fs/cgroup" --cgroups_limit_swap="false" --cgroups_root="mesos" --container_disk_watch_interval="15secs" --containerizers="mesos" --credential="/tmp/Endpoint_SlaveEndpointTest_UnauthorizedRequest_1_ssZXto/credential" --default_role="*" --disk_watch_interval="1mins" --docker="docker" --docker_kill_orphans="true" --docker_registry="https://registry-1.docker.io" --docker_remove_delay="6hrs" --docker_socket="/var/run/docker.sock" --docker_stop_timeout="0ns" --docker_store_dir="/tmp/mesos/store/docker" --docker_volume_checkpoint_dir="/var/run/mesos/isolators/docker/volume" --enforce_container_disk_quota="false" --executor_registration_timeout="1mins" --executor_shutdown_grace_period="5secs" --fetcher_cache_dir="/tmp/Endpoint_SlaveEndpointTest_UnauthorizedRequest_1_ssZXto/fetch" --fetcher_cache_size="2GB" --frameworks_home="" --gc_delay="1weeks" --gc_disk_headroom="0.1" --hadoop_home="" --help="false" --hostname_lookup="true" --http_authenticators="basic" --http_command_executor="false" --http_credentials="/tmp/Endpoint_SlaveEndpointTest_UnauthorizedRequest_1_ssZXto/http_credentials" --http_heartbeat_interval="30secs" --image_provisioner_backend="copy" --initialize_driver_logging="true" --isolation="posix/cpu,posix/mem" --launcher="posix" --launcher_dir="/mesos/build/src" --logbufsecs="0" --logging_level="INFO" --max_completed_executors_per_framework="150" --oversubscribed_resources_interval="15secs" --perf_duration="10secs" --perf_interval="1mins" --qos_correction_interval_min="0ns" --quiet="false" --recover="reconnect" --recovery_timeout="15mins" --registration_backoff_factor="10ms" --resources="cpus:2;gpus:0;mem:1024;disk:1024;ports:[31000-32000]" --revocable_cpu_low_priority="true" --runtime_dir="/tmp/Endpoint_SlaveEndpointTest_UnauthorizedRequest_1_ssZXto" --sandbox_directory="/mnt/mesos/sandbox" --strict="true" --switch_user="true" --systemd_enable_support="true" --systemd_runtime_directory="/run/systemd/system" --version="false" --work_dir="/tmp/Endpoint_SlaveEndpointTest_UnauthorizedRequest_1_alwQLU"
I0116 18:31:47.618911 26198 credentials.hpp:86] Loading credential for authentication from '/tmp/Endpoint_SlaveEndpointTest_UnauthorizedRequest_1_ssZXto/credential'
I0116 18:31:47.619000 26198 slave.cpp:352] Agent using credential for: test-principal
I0116 18:31:47.619016 26198 credentials.hpp:37] Loading credentials for authentication from '/tmp/Endpoint_SlaveEndpointTest_UnauthorizedRequest_1_ssZXto/http_credentials'
I0116 18:31:47.619124 26198 http.cpp:922] Using default 'basic' HTTP authenticator for realm 'mesos-agent-readonly'
I0116 18:31:47.619174 26198 http.cpp:922] Using default 'basic' HTTP authenticator for realm 'mesos-agent-readwrite'
I0116 18:31:47.619555 26198 slave.cpp:539] Agent resources: cpus(*):2; mem(*):1024; disk(*):1024; ports(*):[31000-32000]
I0116 18:31:47.619596 26198 slave.cpp:547] Agent attributes: [  ]
I0116 18:31:47.619604 26198 slave.cpp:552] Agent hostname: 5bfe6702496e
I0116 18:31:47.619967 26193 state.cpp:60] Recovering state from '/tmp/Endpoint_SlaveEndpointTest_UnauthorizedRequest_1_alwQLU/meta'
I0116 18:31:47.620216 26201 status_update_manager.cpp:203] Recovering status update manager
I0116 18:31:47.620415 26198 containerizer.cpp:599] Recovering containerizer
I0116 18:31:47.621018 26193 provisioner.cpp:251] Provisioner recovery complete
I0116 18:31:47.621220 26193 slave.cpp:5417] Finished recovery
I0116 18:31:47.621620 26193 slave.cpp:5591] Querying resource estimator for oversubscribable resources
I0116 18:31:47.621745 26208 slave.cpp:5605] Received oversubscribable resources {} from the resource estimator
I0116 18:31:47.622411 26207 process.cpp:3676] Handling HTTP event for process 'slave(678)' with path: '/slave(678)/monitor/statistics.json'
I0116 18:31:47.622881 26201 http.cpp:874] Authorizing principal 'test-principal' to GET the '/monitor/statistics.json' endpoint
I0116 18:31:47.624096 26201 slave.cpp:796] Agent terminating
[       OK ] Endpoint/SlaveEndpointTest.UnauthorizedRequest/1 (13 ms)
[ RUN      ] Endpoint/SlaveEndpointTest.UnauthorizedRequest/2
I0116 18:31:47.631155 26192 containerizer.cpp:220] Using isolation: posix/cpu,posix/mem,filesystem/posix,network/cni
W0116 18:31:47.631541 26192 backend.cpp:76] Failed to create 'aufs' backend: AufsBackend requires root privileges, but is running as user mesos
W0116 18:31:47.631641 26192 backend.cpp:76] Failed to create 'bind' backend: BindBackend requires root privileges
I0116 18:31:47.632990 26204 slave.cpp:209] Mesos agent started on (679)@172.17.0.2:39138
I0116 18:31:47.633045 26204 slave.cpp:210] Flags at startup: --acls="" --appc_simple_discovery_uri_prefix="http://" --appc_store_dir="/tmp/mesos/store/appc" --authenticate_http_readonly="true" --authenticate_http_readwrite="true" --authenticatee="crammd5" --authentication_backoff_factor="1secs" --authorizer="local" --cgroups_cpu_enable_pids_and_tids_count="false" --cgroups_enable_cfs="false" --cgroups_hierarchy="/sys/fs/cgroup" --cgroups_limit_swap="false" --cgroups_root="mesos" --container_disk_watch_interval="15secs" --containerizers="mesos" --credential="/tmp/Endpoint_SlaveEndpointTest_UnauthorizedRequest_2_K1Tzsj/credential" --default_role="*" --disk_watch_interval="1mins" --docker="docker" --docker_kill_orphans="true" --docker_registry="https://registry-1.docker.io" --docker_remove_delay="6hrs" --docker_socket="/var/run/docker.sock" --docker_stop_timeout="0ns" --docker_store_dir="/tmp/mesos/store/docker" --docker_volume_checkpoint_dir="/var/run/mesos/isolators/docker/volume" --enforce_container_disk_quota="false" --executor_registration_timeout="1mins" --executor_shutdown_grace_period="5secs" --fetcher_cache_dir="/tmp/Endpoint_SlaveEndpointTest_UnauthorizedRequest_2_K1Tzsj/fetch" --fetcher_cache_size="2GB" --frameworks_home="" --gc_delay="1weeks" --gc_disk_headroom="0.1" --hadoop_home="" --help="false" --hostname_lookup="true" --http_authenticators="basic" --http_command_executor="false" --http_credentials="/tmp/Endpoint_SlaveEndpointTest_UnauthorizedRequest_2_K1Tzsj/http_credentials" --http_heartbeat_interval="30secs" --image_provisioner_backend="copy" --initialize_driver_logging="true" --isolation="posix/cpu,posix/mem" --launcher="posix" --launcher_dir="/mesos/build/src" --logbufsecs="0" --logging_level="INFO" --max_completed_executors_per_framework="150" --oversubscribed_resources_interval="15secs" --perf_duration="10secs" --perf_interval="1mins" --qos_correction_interval_min="0ns" --quiet="false" --recover="reconnect" --recovery_timeout="15mins" --registration_backoff_factor="10ms" --resources="cpus:2;gpus:0;mem:1024;disk:1024;ports:[31000-32000]" --revocable_cpu_low_priority="true" --runtime_dir="/tmp/Endpoint_SlaveEndpointTest_UnauthorizedRequest_2_K1Tzsj" --sandbox_directory="/mnt/mesos/sandbox" --strict="true" --switch_user="true" --systemd_enable_support="true" --systemd_runtime_directory="/run/systemd/system" --version="false" --work_dir="/tmp/Endpoint_SlaveEndpointTest_UnauthorizedRequest_2_Oey2HP"
I0116 18:31:47.633584 26204 credentials.hpp:86] Loading credential for authentication from '/tmp/Endpoint_SlaveEndpointTest_UnauthorizedRequest_2_K1Tzsj/credential'
I0116 18:31:47.633687 26204 slave.cpp:352] Agent using credential for: test-principal
I0116 18:31:47.633704 26204 credentials.hpp:37] Loading credentials for authentication from '/tmp/Endpoint_SlaveEndpointTest_UnauthorizedRequest_2_K1Tzsj/http_credentials'
I0116 18:31:47.633816 26204 http.cpp:922] Using default 'basic' HTTP authenticator for realm 'mesos-agent-readonly'
I0116 18:31:47.633867 26204 http.cpp:922] Using default 'basic' HTTP authenticator for realm 'mesos-agent-readwrite'
I0116 18:31:47.634282 26204 slave.cpp:539] Agent resources: cpus(*):2; mem(*):1024; disk(*):1024; ports(*):[31000-32000]
I0116 18:31:47.634325 26204 slave.cpp:547] Agent attributes: [  ]
I0116 18:31:47.634335 26204 slave.cpp:552] Agent hostname: 5bfe6702496e
I0116 18:31:47.634763 26199 state.cpp:60] Recovering state from '/tmp/Endpoint_SlaveEndpointTest_UnauthorizedRequest_2_Oey2HP/meta'
I0116 18:31:47.634974 26201 status_update_manager.cpp:203] Recovering status update manager
I0116 18:31:47.635113 26195 containerizer.cpp:599] Recovering containerizer
I0116 18:31:47.635668 26199 provisioner.cpp:251] Provisioner recovery complete
I0116 18:31:47.635941 26200 slave.cpp:5417] Finished recovery
I0116 18:31:47.636390 26200 slave.cpp:5591] Querying resource estimator for oversubscribable resources
I0116 18:31:47.636543 26204 slave.cpp:5605] Received oversubscribable resources {} from the resource estimator
I0116 18:31:47.637197 26203 process.cpp:3676] Handling HTTP event for process 'slave(679)' with path: '/slave(679)/containers'
I0116 18:31:47.637717 26195 http.cpp:874] Authorizing principal 'test-principal' to GET the '/containers' endpoint
I0116 18:31:47.638991 26198 slave.cpp:796] Agent terminating
[       OK ] Endpoint/SlaveEndpointTest.UnauthorizedRequest/2 (13 ms)
[ RUN      ] Endpoint/SlaveEndpointTest.NoAuthorizer/0
I0116 18:31:47.646206 26192 containerizer.cpp:220] Using isolation: posix/cpu,posix/mem,filesystem/posix,network/cni
W0116 18:31:47.646595 26192 backend.cpp:76] Failed to create 'aufs' backend: AufsBackend requires root privileges, but is running as user mesos
W0116 18:31:47.646685 26192 backend.cpp:76] Failed to create 'bind' backend: BindBackend requires root privileges
I0116 18:31:47.647418 26192 cluster.cpp:446] Creating default 'local' authorizer
I0116 18:31:47.647979 26193 slave.cpp:209] Mesos agent started on (680)@172.17.0.2:39138
I0116 18:31:47.648000 26193 slave.cpp:210] Flags at startup: --acls="" --appc_simple_discovery_uri_prefix="http://" --appc_store_dir="/tmp/mesos/store/appc" --authenticate_http_readonly="true" --authenticate_http_readwrite="true" --authenticatee="crammd5" --authentication_backoff_factor="1secs" --authorizer="local" --cgroups_cpu_enable_pids_and_tids_count="false" --cgroups_enable_cfs="false" --cgroups_hierarchy="/sys/fs/cgroup" --cgroups_limit_swap="false" --cgroups_root="mesos" --container_disk_watch_interval="15secs" --containerizers="mesos" --credential="/tmp/Endpoint_SlaveEndpointTest_NoAuthorizer_0_kFWOAe/credential" --default_role="*" --disk_watch_interval="1mins" --docker="docker" --docker_kill_orphans="true" --docker_registry="https://registry-1.docker.io" --docker_remove_delay="6hrs" --docker_socket="/var/run/docker.sock" --docker_stop_timeout="0ns" --docker_store_dir="/tmp/mesos/store/docker" --docker_volume_checkpoint_dir="/var/run/mesos/isolators/docker/volume" --enforce_container_disk_quota="false" --executor_registration_timeout="1mins" --executor_shutdown_grace_period="5secs" --fetcher_cache_dir="/tmp/Endpoint_SlaveEndpointTest_NoAuthorizer_0_kFWOAe/fetch" --fetcher_cache_size="2GB" --frameworks_home="" --gc_delay="1weeks" --gc_disk_headroom="0.1" --hadoop_home="" --help="false" --hostname_lookup="true" --http_authenticators="basic" --http_command_executor="false" --http_credentials="/tmp/Endpoint_SlaveEndpointTest_NoAuthorizer_0_kFWOAe/http_credentials" --http_heartbeat_interval="30secs" --image_provisioner_backend="copy" --initialize_driver_logging="true" --isolation="posix/cpu,posix/mem" --launcher="posix" --launcher_dir="/mesos/build/src" --logbufsecs="0" --logging_level="INFO" --max_completed_executors_per_framework="150" --oversubscribed_resources_interval="15secs" --perf_duration="10secs" --perf_interval="1mins" --qos_correction_interval_min="0ns" --quiet="false" --recover="reconnect" --recovery_timeout="15mins" --registration_backoff_factor="10ms" --resources="cpus:2;gpus:0;mem:1024;disk:1024;ports:[31000-32000]" --revocable_cpu_low_priority="true" --runtime_dir="/tmp/Endpoint_SlaveEndpointTest_NoAuthorizer_0_kFWOAe" --sandbox_directory="/mnt/mesos/sandbox" --strict="true" --switch_user="true" --systemd_enable_support="true" --systemd_runtime_directory="/run/systemd/system" --version="false" --work_dir="/tmp/Endpoint_SlaveEndpointTest_NoAuthorizer_0_OjeSNK"
I0116 18:31:47.648422 26193 credentials.hpp:86] Loading credential for authentication from '/tmp/Endpoint_SlaveEndpointTest_NoAuthorizer_0_kFWOAe/credential'
I0116 18:31:47.648525 26193 slave.cpp:352] Agent using credential for: test-principal
I0116 18:31:47.648545 26193 credentials.hpp:37] Loading credentials for authentication from '/tmp/Endpoint_SlaveEndpointTest_NoAuthorizer_0_kFWOAe/http_credentials'
I0116 18:31:47.648670 26193 http.cpp:922] Using default 'basic' HTTP authenticator for realm 'mesos-agent-readonly'
I0116 18:31:47.648731 26193 http.cpp:922] Using default 'basic' HTTP authenticator for realm 'mesos-agent-readwrite'
I0116 18:31:47.649214 26193 slave.cpp:539] Agent resources: cpus(*):2; mem(*):1024; disk(*):1024; ports(*):[31000-32000]
I0116 18:31:47.649260 26193 slave.cpp:547] Agent attributes: [  ]
I0116 18:31:47.649276 26193 slave.cpp:552] Agent hostname: 5bfe6702496e
I0116 18:31:47.649776 26195 state.cpp:60] Recovering state from '/tmp/Endpoint_SlaveEndpointTest_NoAuthorizer_0_OjeSNK/meta'
I0116 18:31:47.649942 26193 status_update_manager.cpp:203] Recovering status update manager
I0116 18:31:47.650005 26193 containerizer.cpp:599] Recovering containerizer
I0116 18:31:47.650718 26200 provisioner.cpp:251] Provisioner recovery complete
I0116 18:31:47.651038 26196 slave.cpp:5417] Finished recovery
I0116 18:31:47.651460 26196 slave.cpp:5591] Querying resource estimator for oversubscribable resources
I0116 18:31:47.651612 26205 slave.cpp:5605] Received oversubscribable resources {} from the resource estimator
I0116 18:31:47.652344 26197 process.cpp:3676] Handling HTTP event for process 'slave(680)' with path: '/slave(680)/monitor/statistics'
I0116 18:31:47.652850 26203 http.cpp:874] Authorizing principal 'test-principal' to GET the '/monitor/statistics' endpoint
I0116 18:31:47.654280 26198 slave.cpp:796] Agent terminating
[       OK ] Endpoint/SlaveEndpointTest.NoAuthorizer/0 (13 ms)
[ RUN      ] Endpoint/SlaveEndpointTest.NoAuthorizer/1
I0116 18:31:47.664083 26192 containerizer.cpp:220] Using isolation: posix/cpu,posix/mem,filesystem/posix,network/cni
W0116 18:31:47.664501 26192 backend.cpp:76] Failed to create 'aufs' backend: AufsBackend requires root privileges, but is running as user mesos
W0116 18:31:47.664608 26192 backend.cpp:76] Failed to create 'bind' backend: BindBackend requires root privileges
I0116 18:31:47.665376 26192 cluster.cpp:446] Creating default 'local' authorizer
I0116 18:31:47.666029 26208 slave.cpp:209] Mesos agent started on (681)@172.17.0.2:39138
I0116 18:31:47.666051 26208 slave.cpp:210] Flags at startup: --acls="" --appc_simple_discovery_uri_prefix="http://" --appc_store_dir="/tmp/mesos/store/appc" --authenticate_http_readonly="true" --authenticate_http_readwrite="true" --authenticatee="crammd5" --authentication_backoff_factor="1secs" --authorizer="local" --cgroups_cpu_enable_pids_and_tids_count="false" --cgroups_enable_cfs="false" --cgroups_hierarchy="/sys/fs/cgroup" --cgroups_limit_swap="false" --cgroups_root="mesos" --container_disk_watch_interval="15secs" --containerizers="mesos" --credential="/tmp/Endpoint_SlaveEndpointTest_NoAuthorizer_1_eHj9T9/credential" --default_role="*" --disk_watch_interval="1mins" --docker="docker" --docker_kill_orphans="true" --docker_registry="https://registry-1.docker.io" --docker_remove_delay="6hrs" --docker_socket="/var/run/docker.sock" --docker_stop_timeout="0ns" --docker_store_dir="/tmp/mesos/store/docker" --docker_volume_checkpoint_dir="/var/run/mesos/isolators/docker/volume" --enforce_container_disk_quota="false" --executor_registration_timeout="1mins" --executor_shutdown_grace_period="5secs" --fetcher_cache_dir="/tmp/Endpoint_SlaveEndpointTest_NoAuthorizer_1_eHj9T9/fetch" --fetcher_cache_size="2GB" --frameworks_home="" --gc_delay="1weeks" --gc_disk_headroom="0.1" --hadoop_home="" --help="false" --hostname_lookup="true" --http_authenticators="basic" --http_command_executor="false" --http_credentials="/tmp/Endpoint_SlaveEndpointTest_NoAuthorizer_1_eHj9T9/http_credentials" --http_heartbeat_interval="30secs" --image_provisioner_backend="copy" --initialize_driver_logging="true" --isolation="posix/cpu,posix/mem" --launcher="posix" --launcher_dir="/mesos/build/src" --logbufsecs="0" --logging_level="INFO" --max_completed_executors_per_framework="150" --oversubscribed_resources_interval="15secs" --perf_duration="10secs" --perf_interval="1mins" --qos_correction_interval_min="0ns" --quiet="false" --recover="reconnect" --recovery_timeout="15mins" --registration_backoff_factor="10ms" --resources="cpus:2;gpus:0;mem:1024;disk:1024;ports:[31000-32000]" --revocable_cpu_low_priority="true" --runtime_dir="/tmp/Endpoint_SlaveEndpointTest_NoAuthorizer_1_eHj9T9" --sandbox_directory="/mnt/mesos/sandbox" --strict="true" --switch_user="true" --systemd_enable_support="true" --systemd_runtime_directory="/run/systemd/system" --version="false" --work_dir="/tmp/Endpoint_SlaveEndpointTest_NoAuthorizer_1_UnRj4F"
I0116 18:31:47.666589 26208 credentials.hpp:86] Loading credential for authentication from '/tmp/Endpoint_SlaveEndpointTest_NoAuthorizer_1_eHj9T9/credential'
I0116 18:31:47.666697 26208 slave.cpp:352] Agent using credential for: test-principal
I0116 18:31:47.666712 26208 credentials.hpp:37] Loading credentials for authentication from '/tmp/Endpoint_SlaveEndpointTest_NoAuthorizer_1_eHj9T9/http_credentials'
I0116 18:31:47.666838 26208 http.cpp:922] Using default 'basic' HTTP authenticator for realm 'mesos-agent-readonly'
I0116 18:31:47.666890 26208 http.cpp:922] Using default 'basic' HTTP authenticator for realm 'mesos-agent-readwrite'
I0116 18:31:47.667357 26208 slave.cpp:539] Agent resources: cpus(*):2; mem(*):1024; disk(*):1024; ports(*):[31000-32000]
I0116 18:31:47.667402 26208 slave.cpp:547] Agent attributes: [  ]
I0116 18:31:47.667415 26208 slave.cpp:552] Agent hostname: 5bfe6702496e
I0116 18:31:47.667970 26193 state.cpp:60] Recovering state from '/tmp/Endpoint_SlaveEndpointTest_NoAuthorizer_1_UnRj4F/meta'
I0116 18:31:47.668119 26197 status_update_manager.cpp:203] Recovering status update manager
I0116 18:31:47.668262 26203 containerizer.cpp:599] Recovering containerizer
I0116 18:31:47.668869 26206 provisioner.cpp:251] Provisioner recovery complete
I0116 18:31:47.669183 26193 slave.cpp:5417] Finished recovery
I0116 18:31:47.669630 26193 slave.cpp:5591] Querying resource estimator for oversubscribable resources
I0116 18:31:47.669741 26207 slave.cpp:5605] Received oversubscribable resources {} from the resource estimator
I0116 18:31:47.670550 26194 process.cpp:3676] Handling HTTP event for process 'slave(681)' with path: '/slave(681)/monitor/statistics.json'
I0116 18:31:47.671128 26198 http.cpp:874] Authorizing principal 'test-principal' to GET the '/monitor/statistics.json' endpoint
I0116 18:31:47.672719 26202 slave.cpp:796] Agent terminating
[       OK ] Endpoint/SlaveEndpointTest.NoAuthorizer/1 (14 ms)
[ RUN      ] Endpoint/SlaveEndpointTest.NoAuthorizer/2
I0116 18:31:47.681203 26192 containerizer.cpp:220] Using isolation: posix/cpu,posix/mem,filesystem/posix,network/cni
W0116 18:31:47.681572 26192 backend.cpp:76] Failed to create 'aufs' backend: AufsBackend requires root privileges, but is running as user mesos
W0116 18:31:47.681715 26192 backend.cpp:76] Failed to create 'bind' backend: BindBackend requires root privileges
I0116 18:31:47.682526 26192 cluster.cpp:446] Creating default 'local' authorizer
I0116 18:31:47.683099 26200 slave.cpp:209] Mesos agent started on (682)@172.17.0.2:39138
I0116 18:31:47.683118 26200 slave.cpp:210] Flags at startup: --acls="" --appc_simple_discovery_uri_prefix="http://" --appc_store_dir="/tmp/mesos/store/appc" --authenticate_http_readonly="true" --authenticate_http_readwrite="true" --authenticatee="crammd5" --authentication_backoff_factor="1secs" --authorizer="local" --cgroups_cpu_enable_pids_and_tids_count="false" --cgroups_enable_cfs="false" --cgroups_hierarchy="/sys/fs/cgroup" --cgroups_limit_swap="false" --cgroups_root="mesos" --container_disk_watch_interval="15secs" --containerizers="mesos" --credential="/tmp/Endpoint_SlaveEndpointTest_NoAuthorizer_2_YcFPo5/credential" --default_role="*" --disk_watch_interval="1mins" --docker="docker" --docker_kill_orphans="true" --docker_registry="https://registry-1.docker.io" --docker_remove_delay="6hrs" --docker_socket="/var/run/docker.sock" --docker_stop_timeout="0ns" --docker_store_dir="/tmp/mesos/store/docker" --docker_volume_checkpoint_dir="/var/run/mesos/isolators/docker/volume" --enforce_container_disk_quota="false" --executor_registration_timeout="1mins" --executor_shutdown_grace_period="5secs" --fetcher_cache_dir="/tmp/Endpoint_SlaveEndpointTest_NoAuthorizer_2_YcFPo5/fetch" --fetcher_cache_size="2GB" --frameworks_home="" --gc_delay="1weeks" --gc_disk_headroom="0.1" --hadoop_home="" --help="false" --hostname_lookup="true" --http_authenticators="basic" --http_command_executor="false" --http_credentials="/tmp/Endpoint_SlaveEndpointTest_NoAuthorizer_2_YcFPo5/http_credentials" --http_heartbeat_interval="30secs" --image_provisioner_backend="copy" --initialize_driver_logging="true" --isolation="posix/cpu,posix/mem" --launcher="posix" --launcher_dir="/mesos/build/src" --logbufsecs="0" --logging_level="INFO" --max_completed_executors_per_framework="150" --oversubscribed_resources_interval="15secs" --perf_duration="10secs" --perf_interval="1mins" --qos_correction_interval_min="0ns" --quiet="false" --recover="reconnect" --recovery_timeout="15mins" --registration_backoff_factor="10ms" --resources="cpus:2;gpus:0;mem:1024;disk:1024;ports:[31000-32000]" --revocable_cpu_low_priority="true" --runtime_dir="/tmp/Endpoint_SlaveEndpointTest_NoAuthorizer_2_YcFPo5" --sandbox_directory="/mnt/mesos/sandbox" --strict="true" --switch_user="true" --systemd_enable_support="true" --systemd_runtime_directory="/run/systemd/system" --version="false" --work_dir="/tmp/Endpoint_SlaveEndpointTest_NoAuthorizer_2_4FBcwB"
I0116 18:31:47.683553 26200 credentials.hpp:86] Loading credential for authentication from '/tmp/Endpoint_SlaveEndpointTest_NoAuthorizer_2_YcFPo5/credential'
I0116 18:31:47.683670 26200 slave.cpp:352] Agent using credential for: test-principal
I0116 18:31:47.683713 26200 credentials.hpp:37] Loading credentials for authentication from '/tmp/Endpoint_SlaveEndpointTest_NoAuthorizer_2_YcFPo5/http_credentials'
I0116 18:31:47.683877 26200 http.cpp:922] Using default 'basic' HTTP authenticator for realm 'mesos-agent-readonly'
I0116 18:31:47.683940 26200 http.cpp:922] Using default 'basic' HTTP authenticator for realm 'mesos-agent-readwrite'
I0116 18:31:47.684310 26200 slave.cpp:539] Agent resources: cpus(*):2; mem(*):1024; disk(*):1024; ports(*):[31000-32000]
I0116 18:31:47.684355 26200 slave.cpp:547] Agent attributes: [  ]
I0116 18:31:47.684368 26200 slave.cpp:552] Agent hostname: 5bfe6702496e
I0116 18:31:47.684736 26205 state.cpp:60] Recovering state from '/tmp/Endpoint_SlaveEndpointTest_NoAuthorizer_2_4FBcwB/meta'
I0116 18:31:47.684944 26204 status_update_manager.cpp:203] Recovering status update manager
I0116 18:31:47.685086 26199 containerizer.cpp:599] Recovering containerizer
I0116 18:31:47.685737 26205 provisioner.cpp:251] Provisioner recovery complete
I0116 18:31:47.685981 26200 slave.cpp:5417] Finished recovery
I0116 18:31:47.686385 26200 slave.cpp:5591] Querying resource estimator for oversubscribable resources
I0116 18:31:47.686565 26194 slave.cpp:5605] Received oversubscribable resources {} from the resource estimator
I0116 18:31:47.687252 26195 process.cpp:3676] Handling HTTP event for process 'slave(682)' with path: '/slave(682)/containers'
I0116 18:31:47.687695 26197 http.cpp:874] Authorizing principal 'test-principal' to GET the '/containers' endpoint
I0116 18:31:47.689209 26192 slave.cpp:796] Agent terminating
[       OK ] Endpoint/SlaveEndpointTest.NoAuthorizer/2 (14 ms)
[----------] 9 tests from Endpoint/SlaveEndpointTest (148 ms total)

[----------] Global test environment tear-down
[==========] 1401 tests from 157 test cases ran. (284679 ms total)
[  PASSED  ] 1400 tests.
[  FAILED  ] 1 test, listed below:
[  FAILED  ] SlaveRecoveryTest/0.RecoverTerminatedExecutor, where TypeParam = mesos::internal::slave::MesosContainerizer

 1 FAILED TEST
  YOU HAVE 14 DISABLED TESTS

make[3]: Leaving directory `/mesos/build'
make[3]: *** [CMakeFiles/check] Error 1
make[2]: Leaving directory `/mesos/build'
make[2]: *** [CMakeFiles/check.dir/all] Error 2
make[1]: *** [CMakeFiles/check.dir/rule] Error 2
make[1]: Leaving directory `/mesos/build'
make: *** [check] Error 2
+ docker rmi mesos-1484588163-7789
Untagged: mesos-1484588163-7789:latest
Deleted: sha256:5b9845d7dc4a8fb8cd8ab8e36b809f9aacae5317d436c67b5b03488789666caa
Deleted: sha256:e7ff3db481b9d0d4d70cda6b0e03ebcf9c0f0793bae61e40683d5478c1a038d6
Deleted: sha256:d6fbecf707b989d16c9f91e95ffb7e17f51383d8f97766731f227f7692cae9eb
Deleted: sha256:7e796fc2fb802bf7467292b27f05a05f0f1e81a5be73205d3fef40dfebec681a
Deleted: sha256:1f7a8e521dd7a5ec3a9ed272e42f3111c7afb917295d1984a44c27936a995e1c
Deleted: sha256:f16396fc9dbee7936551ad24b69bc55dbd96ffefb36cf745eb7ce30264c6db0a
Deleted: sha256:52cc2219d7894e7c2884f2b18fe6f008911a89b20b0d0b06f05327fc1ca4ce2e
Deleted: sha256:ec6b8ca520909e7f80cd86daa66aa731b55089e7b4a2226c6fa9e087e6ad2da5
Deleted: sha256:5cfb1db69c8317957e972d2bd71cffc95d1e1546d8b6775979df8e5e92ff7606
Deleted: sha256:628b14766c4daed07fdf915b29ecfa4243951e45a0909cc88ee9c007154ef18e
Deleted: sha256:54f6b1906c481d70e6f223f59822d407f0872e508f6a6a6e93cf06eabd0546f2
Deleted: sha256:d2577094e0db409fe63ada07c6941cea62a4020e86217fea49460405c9f5cbd9
Deleted: sha256:c0a9dca57d5294733a3810cd5c5d72454aa32326925b333650bf4cff82c0405d
Deleted: sha256:39f584038b18c1dcf64654d8328407111e9ff97eb4e3fd42c0ac51de680499d2
Deleted: sha256:c533fc0083cc09a55037a8d8d048a7f1125dc5add9aadb6f004ba9c402244325
Deleted: sha256:45d8fe0ae153d676d816b1befd59f756a51b3d0344dc9de5ae57ea79cebe4944
Deleted: sha256:c63e8a42d2d9879742c98861dae11dea20071cca2035be9b7285d809924609f9
Deleted: sha256:aee35f13dc9df553e583b1a1a6e0e6201bd5dbbb237963873268611adac73c65
Deleted: sha256:bac7317028f88fe4b8fbfaf69a9833ab1de1b391d813b687c34dcc5b83ea1e13
Deleted: sha256:c7338ef70164233c40f4631af8bb81926a5b624e07545c0f4c7afee824b3dfd2
Deleted: sha256:127997f2d4a82247e3dc428683856471fea8d409c644b9c33b652d66f9ef5391
Deleted: sha256:56ee792e280c27c83aa0ac03a1f886374447d68ef925e0f92dbfbbedc1b172d8
Deleted: sha256:cb7b0c0e38940e14238cce7ddbe4fede977f0dd7c3d441013d70b0e386847e89
Deleted: sha256:fa229ea2a2b385b280b2302752ccb205ca40c070c2c2717f8378c3dd2b1e86b1
Build step 'Execute shell' marked build as failure