You are viewing a plain text version of this content. The canonical link for it is here.
Posted to dev@any23.apache.org by Apache Jenkins Server <je...@builds.apache.org> on 2012/03/05 08:02:13 UTC

Build failed in Jenkins: Any23-trunk #123

See <https://builds.apache.org/job/Any23-trunk/123/>

------------------------------------------
[...truncated 833 lines...]
AU        core/src/main/java/org/apache/any23/writer/TripleHandlerException.java
A         core/src/main/java/org/apache/any23/writer/TurtleWriter.java
A         core/src/main/java/org/apache/any23/writer/CompositeTripleHandler.java
A         core/src/main/java/org/apache/any23/writer/TriXWriter.java
AU        core/src/main/java/org/apache/any23/writer/package-info.java
A         core/src/main/java/org/apache/any23/writer/FormatWriter.java
A         core/src/main/java/org/apache/any23/writer/RDFWriterTripleHandler.java
A         core/src/main/java/org/apache/any23/writer/ReportingTripleHandler.java
A         core/src/main/java/org/apache/any23/writer/NQuadsWriter.java
A         core/src/main/java/org/apache/any23/writer/URIListWriter.java
A         core/src/main/java/org/apache/any23/writer/RDFXMLWriter.java
A         core/src/main/java/org/apache/any23/writer/TripleHandler.java
A         core/src/main/java/org/apache/any23/writer/NTriplesWriter.java
A         core/src/main/java/org/apache/any23/util
A         core/src/main/java/org/apache/any23/util/FileUtils.java
A         core/src/main/java/org/apache/any23/util/LogUtils.java
A         core/src/main/java/org/apache/any23/util/URLUtils.java
AU        core/src/main/java/org/apache/any23/util/package-info.java
A         core/src/main/java/org/apache/any23/util/StringUtils.java
A         core/src/main/java/org/apache/any23/util/DiscoveryUtils.java
AU        core/src/main/java/org/apache/any23/util/MathUtils.java
A         core/src/main/java/org/apache/any23/util/StreamUtils.java
AU        core/src/main/java/org/apache/any23/util/ReaderInputStream.java
A         core/src/main/resources
A         core/src/main/resources/default-configuration.properties
A         core/src/main/resources/org
A         core/src/main/resources/org/apache
A         core/src/main/resources/org/apache/any23
A         core/src/main/resources/org/apache/any23/prefixes
AU        core/src/main/resources/org/apache/any23/prefixes/prefixes.properties
A         core/src/main/resources/org/apache/any23/mime
A         core/src/main/resources/org/apache/any23/mime/tika-config.xml
A         core/src/main/resources/org/apache/any23/mime/mimetypes.xml
A         core/src/main/resources/org/apache/any23/extractor
A         core/src/main/resources/org/apache/any23/extractor/microdata
A         core/src/main/resources/org/apache/any23/extractor/microdata/example-microdata.html
A         core/src/main/resources/org/apache/any23/extractor/html
A         core/src/main/resources/org/apache/any23/extractor/html/example-meta.html
A         core/src/main/resources/org/apache/any23/extractor/html/example-mf-species.html
A         core/src/main/resources/org/apache/any23/extractor/html/example-mf-xfn.html
A         core/src/main/resources/org/apache/any23/extractor/html/example-head-link.html
A         core/src/main/resources/org/apache/any23/extractor/html/example-mf-adr.html
A         core/src/main/resources/org/apache/any23/extractor/html/example-mf-hresume.html
A         core/src/main/resources/org/apache/any23/extractor/html/example-mf-hreview.html
A         core/src/main/resources/org/apache/any23/extractor/html/example-icbm.html
A         core/src/main/resources/org/apache/any23/extractor/html/example-mf-geo.html
A         core/src/main/resources/org/apache/any23/extractor/html/example-mf-hrecipe.html
A         core/src/main/resources/org/apache/any23/extractor/html/example-mf-hcalendar.html
A         core/src/main/resources/org/apache/any23/extractor/html/example-mf-hcard.html
A         core/src/main/resources/org/apache/any23/extractor/html/example-mf-hlisting.html
A         core/src/main/resources/org/apache/any23/extractor/html/example-script-turtle.html
A         core/src/main/resources/org/apache/any23/extractor/html/example-title.html
A         core/src/main/resources/org/apache/any23/extractor/html/example-mf-license.html
A         core/src/main/resources/org/apache/any23/extractor/csv
A         core/src/main/resources/org/apache/any23/extractor/csv/example-csv.csv
A         core/src/main/resources/org/apache/any23/extractor/rdf
A         core/src/main/resources/org/apache/any23/extractor/rdf/example-rdfxml.rdf
A         core/src/main/resources/org/apache/any23/extractor/rdf/example-nquads.nq
A         core/src/main/resources/org/apache/any23/extractor/rdf/example-ntriples.nt
A         core/src/main/resources/org/apache/any23/extractor/rdf/example-turtle.ttl
A         core/src/main/resources/org/apache/any23/extractor/rdf/example-trix.trx
A         core/src/main/resources/org/apache/any23/extractor/rdfa
A         core/src/main/resources/org/apache/any23/extractor/rdfa/rdfa.xslt
A         core/src/main/resources/org/apache/any23/extractor/rdfa/example-rdfa11.html
AU        core/pom.xml
AU        DISCLAIMER.txt
AU        pom.xml
AU        README.txt
 U        .
At revision 1296945
no revision recorded for https://svn.apache.org/repos/asf/incubator/any23/trunk in the previous build
Parsing POMs
Modules changed, recalculating dependency graph
[Any23-trunk] $ /home/hudson/tools/java/latest1.6/bin/java -cp /home/jenkins/jenkins-slave/maven3-agent.jar:/home/hudson/tools/maven/latest/boot/plexus-classworlds-2.4.jar org.jvnet.hudson.maven3.agent.Maven3Main /home/hudson/tools/maven/latest /x1/jenkins/jenkins-slave/slave.jar /home/jenkins/jenkins-slave/maven3-interceptor.jar 34860
<===[JENKINS REMOTING CAPACITY]===>   channel started
Executing Maven:  -B -f <https://builds.apache.org/job/Any23-trunk/ws/pom.xml> -Dmaven.repo.local=/home/jenkins/jenkins-slave/maven-repositories/0 install
[INFO] Scanning for projects...
[INFO] ------------------------------------------------------------------------
[INFO] Reactor Build Order:
[INFO] 
[INFO] Apache Any23 :: Parent
[INFO] Apache Any23 :: Core
[INFO] Apache Any23 :: Plugins :: Basic Crawler
[INFO] Apache Any23 :: Plugins :: HTML Scraper
[INFO] Apache Any23 :: Plugins :: Office Scraper
[INFO] Apache Any23 :: Plugins :: Integration Test
[INFO] Apache Any23 :: Service
[INFO]                                                                         
[INFO] ------------------------------------------------------------------------
[INFO] Building Apache Any23 :: Parent 0.7.0-incubating-SNAPSHOT
[INFO] ------------------------------------------------------------------------
[INFO] 
[INFO] --- buildnumber-maven-plugin:1.0:create (default) @ any23-parent ---
[INFO] Checking for local modifications: skipped.
[INFO] Updating project files from SCM: skipped.
[INFO] Executing: /bin/sh -c cd <https://builds.apache.org/job/Any23-trunk/ws/> && svn --non-interactive info
[INFO] Working directory: <https://builds.apache.org/job/Any23-trunk/ws/>
[INFO] Storing buildNumber: 1296871 at timestamp: 1330930914525
[INFO] Executing: /bin/sh -c cd <https://builds.apache.org/job/Any23-trunk/ws/> && svn --non-interactive info
[INFO] Working directory: <https://builds.apache.org/job/Any23-trunk/ws/>
[INFO] Storing buildScmBranch: trunk
log4j:WARN No appenders could be found for logger (org.apache.commons.beanutils.converters.BooleanConverter).
log4j:WARN Please initialize the log4j system properly.
[INFO] 
[INFO] --- maven-remote-resources-plugin:1.2.1:process (default) @ any23-parent ---
Downloading: http://repo1.maven.org/maven2/org/kohsuke/metainf-services/metainf-services/1.3/metainf-services-1.3.pom
Downloaded: http://repo1.maven.org/maven2/org/kohsuke/metainf-services/metainf-services/1.3/metainf-services-1.3.pom (4 KB at 8.4 KB/sec)
Downloading: http://repo1.maven.org/maven2/org/kohsuke/metainf-services/metainf-services/1.3/metainf-services-1.3.jar
Downloaded: http://repo1.maven.org/maven2/org/kohsuke/metainf-services/metainf-services/1.3/metainf-services-1.3.jar (7 KB at 17.0 KB/sec)
[INFO] 
[INFO] --- maven-site-plugin:3.0:attach-descriptor (attach-descriptor) @ any23-parent ---
[INFO] 
[INFO] --- maven-install-plugin:2.3.1:install (default-install) @ any23-parent ---
[INFO] Installing <https://builds.apache.org/job/Any23-trunk/ws/pom.xml> to /home/jenkins/jenkins-slave/maven-repositories/0/org/apache/any23/any23-parent/0.7.0-incubating-SNAPSHOT/any23-parent-0.7.0-incubating-SNAPSHOT.pom
[INFO] Installing <https://builds.apache.org/job/Any23-trunk/ws/target/any23-parent-0.7.0-incubating-SNAPSHOT-site.xml> to /home/jenkins/jenkins-slave/maven-repositories/0/org/apache/any23/any23-parent/0.7.0-incubating-SNAPSHOT/any23-parent-0.7.0-incubating-SNAPSHOT-site.xml
[JENKINS] Archiving <https://builds.apache.org/job/Any23-trunk/ws/pom.xml> to /home/hudson/hudson/jobs/Any23-trunk/modules/org.apache.any23$any23-parent/builds/2012-03-05_07-01-48/archive/org.apache.any23/any23-parent/0.7.0-incubating-SNAPSHOT/any23-parent-0.7.0-incubating-SNAPSHOT.pom
[JENKINS] Archiving <https://builds.apache.org/job/Any23-trunk/ws/target/any23-parent-0.7.0-incubating-SNAPSHOT-site.xml> to /home/hudson/hudson/jobs/Any23-trunk/modules/org.apache.any23$any23-parent/builds/2012-03-05_07-01-48/archive/org.apache.any23/any23-parent/0.7.0-incubating-SNAPSHOT/any23-parent-0.7.0-incubating-SNAPSHOT-site.xml
[INFO]                                                                         
[INFO] ------------------------------------------------------------------------
[INFO] Building Apache Any23 :: Core 0.7.0-incubating-SNAPSHOT
[INFO] ------------------------------------------------------------------------
Downloading: http://repo1.maven.org/maven2/org/openrdf/sesame/sesame-model/2.6.1/sesame-model-2.6.1.pom
[WARNING] The POM for org.openrdf.sesame:sesame-model:jar:2.6.1 is missing, no dependency information available
Downloading: http://repo1.maven.org/maven2/org/openrdf/sesame/sesame-rio-api/2.6.1/sesame-rio-api-2.6.1.pom
[WARNING] The POM for org.openrdf.sesame:sesame-rio-api:jar:2.6.1 is missing, no dependency information available
Downloading: http://repo1.maven.org/maven2/org/openrdf/sesame/sesame-rio-turtle/2.6.1/sesame-rio-turtle-2.6.1.pom
[WARNING] The POM for org.openrdf.sesame:sesame-rio-turtle:jar:2.6.1 is missing, no dependency information available
Downloading: http://repo1.maven.org/maven2/org/openrdf/sesame/sesame-rio-rdfxml/2.6.1/sesame-rio-rdfxml-2.6.1.pom
[WARNING] The POM for org.openrdf.sesame:sesame-rio-rdfxml:jar:2.6.1 is missing, no dependency information available
Downloading: http://repo1.maven.org/maven2/org/openrdf/sesame/sesame-rio-ntriples/2.6.1/sesame-rio-ntriples-2.6.1.pom
[WARNING] The POM for org.openrdf.sesame:sesame-rio-ntriples:jar:2.6.1 is missing, no dependency information available
Downloading: http://repo1.maven.org/maven2/org/openrdf/sesame/sesame-rio-trix/2.6.1/sesame-rio-trix-2.6.1.pom
[WARNING] The POM for org.openrdf.sesame:sesame-rio-trix:jar:2.6.1 is missing, no dependency information available
Downloading: http://repo1.maven.org/maven2/org/openrdf/sesame/sesame-repository-sail/2.6.1/sesame-repository-sail-2.6.1.pom
[WARNING] The POM for org.openrdf.sesame:sesame-repository-sail:jar:2.6.1 is missing, no dependency information available
Downloading: http://repo1.maven.org/maven2/org/openrdf/sesame/sesame-sail-memory/2.6.1/sesame-sail-memory-2.6.1.pom
[WARNING] The POM for org.openrdf.sesame:sesame-sail-memory:jar:2.6.1 is missing, no dependency information available
Downloading: http://repo1.maven.org/maven2/org/openrdf/sesame/sesame-repository-api/2.6.1/sesame-repository-api-2.6.1.pom
[WARNING] The POM for org.openrdf.sesame:sesame-repository-api:jar:2.6.1 is missing, no dependency information available
Downloading: http://repo1.maven.org/maven2/info/aduna/commons/aduna-commons-xml/2.7.0/aduna-commons-xml-2.7.0.pom
[WARNING] The POM for info.aduna.commons:aduna-commons-xml:jar:2.7.0 is missing, no dependency information available
Downloading: http://repo1.maven.org/maven2/info/aduna/commons/aduna-commons-text/2.7.0/aduna-commons-text-2.7.0.pom
[WARNING] The POM for info.aduna.commons:aduna-commons-text:jar:2.7.0 is missing, no dependency information available
Downloading: http://repo1.maven.org/maven2/info/aduna/commons/aduna-commons-net/2.7.0/aduna-commons-net-2.7.0.pom
[WARNING] The POM for info.aduna.commons:aduna-commons-net:jar:2.7.0 is missing, no dependency information available
Downloading: http://repo1.maven.org/maven2/info/aduna/commons/aduna-commons-lang/2.9.0/aduna-commons-lang-2.9.0.pom
[WARNING] The POM for info.aduna.commons:aduna-commons-lang:jar:2.9.0 is missing, no dependency information available
Downloading: http://repo1.maven.org/maven2/info/aduna/commons/aduna-commons-iteration/2.10.0/aduna-commons-iteration-2.10.0.pom
[WARNING] The POM for info.aduna.commons:aduna-commons-iteration:jar:2.10.0 is missing, no dependency information available
Downloading: http://repo1.maven.org/maven2/info/aduna/commons/aduna-commons-io/2.10.0/aduna-commons-io-2.10.0.pom
[WARNING] The POM for info.aduna.commons:aduna-commons-io:jar:2.10.0 is missing, no dependency information available
Downloading: http://repo1.maven.org/maven2/info/aduna/commons/aduna-commons-concurrent/2.7.0/aduna-commons-concurrent-2.7.0.pom
[WARNING] The POM for info.aduna.commons:aduna-commons-concurrent:jar:2.7.0 is missing, no dependency information available
Downloading: http://repo1.maven.org/maven2/org/apache/commons/commons-csv/1.0-SNAPSHOT-rev1148315/commons-csv-1.0-SNAPSHOT-rev1148315.pom
[WARNING] The POM for org.apache.commons:commons-csv:jar:1.0-SNAPSHOT-rev1148315 is missing, no dependency information available
Downloading: http://repo1.maven.org/maven2/org/openrdf/sesame/sesame-model/2.6.1/sesame-model-2.6.1.jar
Downloading: http://repo1.maven.org/maven2/org/openrdf/sesame/sesame-rio-api/2.6.1/sesame-rio-api-2.6.1.jar
Downloading: http://repo1.maven.org/maven2/org/openrdf/sesame/sesame-rio-rdfxml/2.6.1/sesame-rio-rdfxml-2.6.1.jar
Downloading: http://repo1.maven.org/maven2/org/openrdf/sesame/sesame-rio-ntriples/2.6.1/sesame-rio-ntriples-2.6.1.jar
Downloading: http://repo1.maven.org/maven2/org/openrdf/sesame/sesame-rio-turtle/2.6.1/sesame-rio-turtle-2.6.1.jar
Downloading: http://repo1.maven.org/maven2/org/openrdf/sesame/sesame-rio-trix/2.6.1/sesame-rio-trix-2.6.1.jar
Downloading: http://repo1.maven.org/maven2/org/openrdf/sesame/sesame-repository-sail/2.6.1/sesame-repository-sail-2.6.1.jar
Downloading: http://repo1.maven.org/maven2/org/openrdf/sesame/sesame-sail-memory/2.6.1/sesame-sail-memory-2.6.1.jar
Downloading: http://repo1.maven.org/maven2/org/openrdf/sesame/sesame-repository-api/2.6.1/sesame-repository-api-2.6.1.jar
Downloading: http://repo1.maven.org/maven2/info/aduna/commons/aduna-commons-xml/2.7.0/aduna-commons-xml-2.7.0.jar
Downloading: http://repo1.maven.org/maven2/info/aduna/commons/aduna-commons-text/2.7.0/aduna-commons-text-2.7.0.jar
Downloading: http://repo1.maven.org/maven2/info/aduna/commons/aduna-commons-net/2.7.0/aduna-commons-net-2.7.0.jar
Downloading: http://repo1.maven.org/maven2/info/aduna/commons/aduna-commons-lang/2.9.0/aduna-commons-lang-2.9.0.jar
Downloading: http://repo1.maven.org/maven2/info/aduna/commons/aduna-commons-iteration/2.10.0/aduna-commons-iteration-2.10.0.jar
Downloading: http://repo1.maven.org/maven2/info/aduna/commons/aduna-commons-io/2.10.0/aduna-commons-io-2.10.0.jar
Downloading: http://repo1.maven.org/maven2/info/aduna/commons/aduna-commons-concurrent/2.7.0/aduna-commons-concurrent-2.7.0.jar
Downloading: http://repo1.maven.org/maven2/org/apache/commons/commons-csv/1.0-SNAPSHOT-rev1148315/commons-csv-1.0-SNAPSHOT-rev1148315.jar
[JENKINS] Archiving <https://builds.apache.org/job/Any23-trunk/ws/core/pom.xml> to /home/hudson/hudson/jobs/Any23-trunk/modules/org.apache.any23$any23-core/builds/2012-03-05_07-01-48/archive/org.apache.any23/any23-core/0.7.0-incubating-SNAPSHOT/any23-core-0.7.0-incubating-SNAPSHOT.pom
[INFO] ------------------------------------------------------------------------
[INFO] Reactor Summary:
[INFO] 
[INFO] Apache Any23 :: Parent ............................ SUCCESS [9.849s]
[INFO] Apache Any23 :: Core .............................. FAILURE [8.850s]
[INFO] Apache Any23 :: Plugins :: Basic Crawler .......... SKIPPED
[INFO] Apache Any23 :: Plugins :: HTML Scraper ........... SKIPPED
[INFO] Apache Any23 :: Plugins :: Office Scraper ......... SKIPPED
[INFO] Apache Any23 :: Plugins :: Integration Test ....... SKIPPED
[INFO] Apache Any23 :: Service ........................... SKIPPED
[INFO] ------------------------------------------------------------------------
[INFO] BUILD FAILURE
[INFO] ------------------------------------------------------------------------
[INFO] Total time: 20.364s
[INFO] Finished at: Mon Mar 05 07:02:12 UTC 2012
[INFO] Final Memory: 13M/58M
[INFO] ------------------------------------------------------------------------
mavenExecutionResult exceptions not empty
message : Failed to execute goal on project any23-core: Could not resolve dependencies for project org.apache.any23:any23-core:jar:0.7.0-incubating-SNAPSHOT: The following artifacts could not be resolved: org.openrdf.sesame:sesame-model:jar:2.6.1, org.openrdf.sesame:sesame-rio-api:jar:2.6.1, org.openrdf.sesame:sesame-rio-turtle:jar:2.6.1, org.openrdf.sesame:sesame-rio-rdfxml:jar:2.6.1, org.openrdf.sesame:sesame-rio-ntriples:jar:2.6.1, org.openrdf.sesame:sesame-rio-trix:jar:2.6.1, org.openrdf.sesame:sesame-repository-sail:jar:2.6.1, org.openrdf.sesame:sesame-sail-memory:jar:2.6.1, org.openrdf.sesame:sesame-repository-api:jar:2.6.1, info.aduna.commons:aduna-commons-xml:jar:2.7.0, info.aduna.commons:aduna-commons-text:jar:2.7.0, info.aduna.commons:aduna-commons-net:jar:2.7.0, info.aduna.commons:aduna-commons-lang:jar:2.9.0, info.aduna.commons:aduna-commons-iteration:jar:2.10.0, info.aduna.commons:aduna-commons-io:jar:2.10.0, info.aduna.commons:aduna-commons-concurrent:jar:2.7.0, org.apache.commons:commons-csv:jar:1.0-SNAPSHOT-rev1148315: Could not find artifact org.openrdf.sesame:sesame-model:jar:2.6.1 in central (http://repo1.maven.org/maven2)
cause : Could not resolve dependencies for project org.apache.any23:any23-core:jar:0.7.0-incubating-SNAPSHOT: The following artifacts could not be resolved: org.openrdf.sesame:sesame-model:jar:2.6.1, org.openrdf.sesame:sesame-rio-api:jar:2.6.1, org.openrdf.sesame:sesame-rio-turtle:jar:2.6.1, org.openrdf.sesame:sesame-rio-rdfxml:jar:2.6.1, org.openrdf.sesame:sesame-rio-ntriples:jar:2.6.1, org.openrdf.sesame:sesame-rio-trix:jar:2.6.1, org.openrdf.sesame:sesame-repository-sail:jar:2.6.1, org.openrdf.sesame:sesame-sail-memory:jar:2.6.1, org.openrdf.sesame:sesame-repository-api:jar:2.6.1, info.aduna.commons:aduna-commons-xml:jar:2.7.0, info.aduna.commons:aduna-commons-text:jar:2.7.0, info.aduna.commons:aduna-commons-net:jar:2.7.0, info.aduna.commons:aduna-commons-lang:jar:2.9.0, info.aduna.commons:aduna-commons-iteration:jar:2.10.0, info.aduna.commons:aduna-commons-io:jar:2.10.0, info.aduna.commons:aduna-commons-concurrent:jar:2.7.0, org.apache.commons:commons-csv:jar:1.0-SNAPSHOT-rev1148315: Could not find artifact org.openrdf.sesame:sesame-model:jar:2.6.1 in central (http://repo1.maven.org/maven2)
Stack trace : 
org.apache.maven.lifecycle.LifecycleExecutionException: Failed to execute goal on project any23-core: Could not resolve dependencies for project org.apache.any23:any23-core:jar:0.7.0-incubating-SNAPSHOT: The following artifacts could not be resolved: org.openrdf.sesame:sesame-model:jar:2.6.1, org.openrdf.sesame:sesame-rio-api:jar:2.6.1, org.openrdf.sesame:sesame-rio-turtle:jar:2.6.1, org.openrdf.sesame:sesame-rio-rdfxml:jar:2.6.1, org.openrdf.sesame:sesame-rio-ntriples:jar:2.6.1, org.openrdf.sesame:sesame-rio-trix:jar:2.6.1, org.openrdf.sesame:sesame-repository-sail:jar:2.6.1, org.openrdf.sesame:sesame-sail-memory:jar:2.6.1, org.openrdf.sesame:sesame-repository-api:jar:2.6.1, info.aduna.commons:aduna-commons-xml:jar:2.7.0, info.aduna.commons:aduna-commons-text:jar:2.7.0, info.aduna.commons:aduna-commons-net:jar:2.7.0, info.aduna.commons:aduna-commons-lang:jar:2.9.0, info.aduna.commons:aduna-commons-iteration:jar:2.10.0, info.aduna.commons:aduna-commons-io:jar:2.10.0, info.aduna.commons:aduna-commons-concurrent:jar:2.7.0, org.apache.commons:commons-csv:jar:1.0-SNAPSHOT-rev1148315: Could not find artifact org.openrdf.sesame:sesame-model:jar:2.6.1 in central (http://repo1.maven.org/maven2)
	at org.apache.maven.lifecycle.internal.LifecycleDependencyResolver.getDependencies(LifecycleDependencyResolver.java:196)
	at org.apache.maven.lifecycle.internal.LifecycleDependencyResolver.resolveProjectDependencies(LifecycleDependencyResolver.java:108)
	at org.apache.maven.lifecycle.internal.MojoExecutor.ensureDependenciesAreResolved(MojoExecutor.java:258)
	at org.apache.maven.lifecycle.internal.MojoExecutor.execute(MojoExecutor.java:201)
	at org.apache.maven.lifecycle.internal.MojoExecutor.execute(MojoExecutor.java:153)
	at org.apache.maven.lifecycle.internal.MojoExecutor.execute(MojoExecutor.java:145)
	at org.apache.maven.lifecycle.internal.LifecycleModuleBuilder.buildProject(LifecycleModuleBuilder.java:84)
	at org.apache.maven.lifecycle.internal.LifecycleModuleBuilder.buildProject(LifecycleModuleBuilder.java:59)
	at org.apache.maven.lifecycle.internal.LifecycleStarter.singleThreadedBuild(LifecycleStarter.java:183)
	at org.apache.maven.lifecycle.internal.LifecycleStarter.execute(LifecycleStarter.java:161)
	at org.apache.maven.DefaultMaven.doExecute(DefaultMaven.java:319)
	at org.apache.maven.DefaultMaven.execute(DefaultMaven.java:156)
	at org.jvnet.hudson.maven3.launcher.Maven3Launcher.main(Maven3Launcher.java:79)
	at sun.reflect.NativeMethodAccessorImpl.invoke0(Native Method)
	at sun.reflect.NativeMethodAccessorImpl.invoke(NativeMethodAccessorImpl.java:39)
	at sun.reflect.DelegatingMethodAccessorImpl.invoke(DelegatingMethodAccessorImpl.java:25)
	at java.lang.reflect.Method.invoke(Method.java:597)
	at org.codehaus.plexus.classworlds.launcher.Launcher.launchStandard(Launcher.java:329)
	at org.codehaus.plexus.classworlds.launcher.Launcher.launch(Launcher.java:239)
	at org.jvnet.hudson.maven3.agent.Maven3Main.launch(Maven3Main.java:158)
	at hudson.maven.Maven3Builder.call(Maven3Builder.java:104)
	at hudson.maven.Maven3Builder.call(Maven3Builder.java:70)
	at hudson.remoting.UserRequest.perform(UserRequest.java:118)
	at hudson.remoting.UserRequest.perform(UserRequest.java:48)
	at hudson.remoting.Request$2.run(Request.java:287)
	at hudson.remoting.InterceptingExecutorService$1.call(InterceptingExecutorService.java:72)
	at java.util.concurrent.FutureTask$Sync.innerRun(FutureTask.java:303)
	at java.util.concurrent.FutureTask.run(FutureTask.java:138)
	at java.util.concurrent.ThreadPoolExecutor$Worker.runTask(ThreadPoolExecutor.java:886)
	at java.util.concurrent.ThreadPoolExecutor$Worker.run(ThreadPoolExecutor.java:908)
	at java.lang.Thread.run(Thread.java:662)
Caused by: org.apache.maven.project.DependencyResolutionException: Could not resolve dependencies for project org.apache.any23:any23-core:jar:0.7.0-incubating-SNAPSHOT: The following artifacts could not be resolved: org.openrdf.sesame:sesame-model:jar:2.6.1, org.openrdf.sesame:sesame-rio-api:jar:2.6.1, org.openrdf.sesame:sesame-rio-turtle:jar:2.6.1, org.openrdf.sesame:sesame-rio-rdfxml:jar:2.6.1, org.openrdf.sesame:sesame-rio-ntriples:jar:2.6.1, org.openrdf.sesame:sesame-rio-trix:jar:2.6.1, org.openrdf.sesame:sesame-repository-sail:jar:2.6.1, org.openrdf.sesame:sesame-sail-memory:jar:2.6.1, org.openrdf.sesame:sesame-repository-api:jar:2.6.1, info.aduna.commons:aduna-commons-xml:jar:2.7.0, info.aduna.commons:aduna-commons-text:jar:2.7.0, info.aduna.commons:aduna-commons-net:jar:2.7.0, info.aduna.commons:aduna-commons-lang:jar:2.9.0, info.aduna.commons:aduna-commons-iteration:jar:2.10.0, info.aduna.commons:aduna-commons-io:jar:2.10.0, info.aduna.commons:aduna-commons-concurrent:jar:2.7.0, org.apache.commons:commons-csv:jar:1.0-SNAPSHOT-rev1148315: Could not find artifact org.openrdf.sesame:sesame-model:jar:2.6.1 in central (http://repo1.maven.org/maven2)
	at org.apache.maven.project.DefaultProjectDependenciesResolver.resolve(DefaultProjectDependenciesResolver.java:170)
	at org.apache.maven.lifecycle.internal.LifecycleDependencyResolver.getDependencies(LifecycleDependencyResolver.java:171)
	... 30 more
Caused by: org.sonatype.aether.resolution.DependencyResolutionException: The following artifacts could not be resolved: org.openrdf.sesame:sesame-model:jar:2.6.1, org.openrdf.sesame:sesame-rio-api:jar:2.6.1, org.openrdf.sesame:sesame-rio-turtle:jar:2.6.1, org.openrdf.sesame:sesame-rio-rdfxml:jar:2.6.1, org.openrdf.sesame:sesame-rio-ntriples:jar:2.6.1, org.openrdf.sesame:sesame-rio-trix:jar:2.6.1, org.openrdf.sesame:sesame-repository-sail:jar:2.6.1, org.openrdf.sesame:sesame-sail-memory:jar:2.6.1, org.openrdf.sesame:sesame-repository-api:jar:2.6.1, info.aduna.commons:aduna-commons-xml:jar:2.7.0, info.aduna.commons:aduna-commons-text:jar:2.7.0, info.aduna.commons:aduna-commons-net:jar:2.7.0, info.aduna.commons:aduna-commons-lang:jar:2.9.0, info.aduna.commons:aduna-commons-iteration:jar:2.10.0, info.aduna.commons:aduna-commons-io:jar:2.10.0, info.aduna.commons:aduna-commons-concurrent:jar:2.7.0, org.apache.commons:commons-csv:jar:1.0-SNAPSHOT-rev1148315: Could not find artifact org.openrdf.sesame:sesame-model:jar:2.6.1 in central (http://repo1.maven.org/maven2)
	at org.sonatype.aether.impl.internal.DefaultRepositorySystem.resolveDependencies(DefaultRepositorySystem.java:412)
	at org.apache.maven.project.DefaultProjectDependenciesResolver.resolve(DefaultProjectDependenciesResolver.java:164)
	... 31 more
Caused by: org.sonatype.aether.resolution.ArtifactResolutionException: The following artifacts could not be resolved: org.openrdf.sesame:sesame-model:jar:2.6.1, org.openrdf.sesame:sesame-rio-api:jar:2.6.1, org.openrdf.sesame:sesame-rio-turtle:jar:2.6.1, org.openrdf.sesame:sesame-rio-rdfxml:jar:2.6.1, org.openrdf.sesame:sesame-rio-ntriples:jar:2.6.1, org.openrdf.sesame:sesame-rio-trix:jar:2.6.1, org.openrdf.sesame:sesame-repository-sail:jar:2.6.1, org.openrdf.sesame:sesame-sail-memory:jar:2.6.1, org.openrdf.sesame:sesame-repository-api:jar:2.6.1, info.aduna.commons:aduna-commons-xml:jar:2.7.0, info.aduna.commons:aduna-commons-text:jar:2.7.0, info.aduna.commons:aduna-commons-net:jar:2.7.0, info.aduna.commons:aduna-commons-lang:jar:2.9.0, info.aduna.commons:aduna-commons-iteration:jar:2.10.0, info.aduna.commons:aduna-commons-io:jar:2.10.0, info.aduna.commons:aduna-commons-concurrent:jar:2.7.0, org.apache.commons:commons-csv:jar:1.0-SNAPSHOT-rev1148315: Could not find artifact org.openrdf.sesame:sesame-model:jar:2.6.1 in central (http://repo1.maven.org/maven2)
	at org.sonatype.aether.impl.internal.DefaultArtifactResolver.resolve(DefaultArtifactResolver.java:541)
	at org.sonatype.aether.impl.internal.DefaultArtifactResolver.resolveArtifacts(DefaultArtifactResolver.java:220)
	at org.sonatype.aether.impl.internal.DefaultRepositorySystem.resolveDependencies(DefaultRepositorySystem.java:395)
	... 32 more
Caused by: org.sonatype.aether.transfer.ArtifactNotFoundException: Could not find artifact org.openrdf.sesame:sesame-model:jar:2.6.1 in central (http://repo1.maven.org/maven2)
	at org.sonatype.aether.connector.wagon.WagonRepositoryConnector$4.wrap(WagonRepositoryConnector.java:945)
	at org.sonatype.aether.connector.wagon.WagonRepositoryConnector$4.wrap(WagonRepositoryConnector.java:940)
	at org.sonatype.aether.connector.wagon.WagonRepositoryConnector$GetTask.flush(WagonRepositoryConnector.java:695)
	at org.sonatype.aether.connector.wagon.WagonRepositoryConnector$GetTask.flush(WagonRepositoryConnector.java:689)
	at org.sonatype.aether.connector.wagon.WagonRepositoryConnector.get(WagonRepositoryConnector.java:445)
	at org.sonatype.aether.impl.internal.DefaultArtifactResolver.resolve(DefaultArtifactResolver.java:460)
	... 34 more
Sending e-mails to: any23-dev@incubator.apache.org
channel stopped


Jenkins build is still unstable: Any23-trunk #139

Posted by Apache Jenkins Server <je...@builds.apache.org>.
See <https://builds.apache.org/job/Any23-trunk/139/>


Jenkins build is still unstable: Any23-trunk #138

Posted by Apache Jenkins Server <je...@builds.apache.org>.
See <https://builds.apache.org/job/Any23-trunk/138/>


Jenkins build is still unstable: Any23-trunk #137

Posted by Apache Jenkins Server <je...@builds.apache.org>.
See <https://builds.apache.org/job/Any23-trunk/137/>


Jenkins build is still unstable: Any23-trunk #136

Posted by Apache Jenkins Server <je...@builds.apache.org>.
See <https://builds.apache.org/job/Any23-trunk/136/>


Jenkins build is still unstable: Any23-trunk #135

Posted by Apache Jenkins Server <je...@builds.apache.org>.
See <https://builds.apache.org/job/Any23-trunk/135/>


Jenkins build is still unstable: Any23-trunk #134

Posted by Apache Jenkins Server <je...@builds.apache.org>.
See <https://builds.apache.org/job/Any23-trunk/134/>



Jenkins build is still unstable: Any23-trunk #133

Posted by Apache Jenkins Server <je...@builds.apache.org>.
See <https://builds.apache.org/job/Any23-trunk/133/>



Jenkins build is still unstable: Any23-trunk #132

Posted by Apache Jenkins Server <je...@builds.apache.org>.
See <https://builds.apache.org/job/Any23-trunk/132/>



Jenkins build is still unstable: Any23-trunk #131

Posted by Apache Jenkins Server <je...@builds.apache.org>.
See <https://builds.apache.org/job/Any23-trunk/131/>



Jenkins build is still unstable: Any23-trunk #130

Posted by Apache Jenkins Server <je...@builds.apache.org>.
See <https://builds.apache.org/job/Any23-trunk/changes>



Jenkins build is still unstable: Any23-trunk #129

Posted by Apache Jenkins Server <je...@builds.apache.org>.
See <https://builds.apache.org/job/Any23-trunk/changes>



Jenkins build is unstable: Any23-trunk #128

Posted by Apache Jenkins Server <je...@builds.apache.org>.
See <https://builds.apache.org/job/Any23-trunk/128/changes>



Build failed in Jenkins: Any23-trunk #127

Posted by Apache Jenkins Server <je...@builds.apache.org>.
See <https://builds.apache.org/job/Any23-trunk/127/>

------------------------------------------
[...truncated 714 lines...]
AU        core/src/main/java/org/apache/any23/cli/package-info.java
A         core/src/main/java/org/apache/any23/cli/ExtractorDocumentation.java
A         core/src/main/java/org/apache/any23/cli/Version.java
A         core/src/main/java/org/apache/any23/cli/ToolRunner.java
A         core/src/main/java/org/apache/any23/cli/PluginVerifier.java
A         core/src/main/java/org/apache/any23/cli/Rover.java
A         core/src/main/java/org/apache/any23/cli/Tool.java
AU        core/src/main/java/org/apache/any23/cli/VocabPrinter.java
A         core/src/main/java/org/apache/any23/configuration
A         core/src/main/java/org/apache/any23/configuration/ModifiableConfiguration.java
AU        core/src/main/java/org/apache/any23/configuration/package-info.java
A         core/src/main/java/org/apache/any23/configuration/Configuration.java
A         core/src/main/java/org/apache/any23/configuration/DefaultModifiableConfiguration.java
A         core/src/main/java/org/apache/any23/configuration/DefaultConfiguration.java
A         core/src/main/java/org/apache/any23/io
A         core/src/main/java/org/apache/any23/io/nquads
AU        core/src/main/java/org/apache/any23/io/nquads/package-info.java
A         core/src/main/java/org/apache/any23/io/nquads/NQuadsParser.java
A         core/src/main/java/org/apache/any23/io/nquads/NQuadsWriter.java
A         core/src/main/java/org/apache/any23/io/nquads/NQuads.java
A         core/src/main/java/org/apache/any23/extractor
A         core/src/main/java/org/apache/any23/extractor/ExtractionException.java
A         core/src/main/java/org/apache/any23/extractor/ExtractionResultImpl.java
A         core/src/main/java/org/apache/any23/extractor/ExtractorFactory.java
A         core/src/main/java/org/apache/any23/extractor/xpath
A         core/src/main/java/org/apache/any23/extractor/xpath/XPathExtractor.java
A         core/src/main/java/org/apache/any23/extractor/xpath/TemplateObject.java
A         core/src/main/java/org/apache/any23/extractor/xpath/Variable.java
A         core/src/main/java/org/apache/any23/extractor/xpath/QuadTemplate.java
A         core/src/main/java/org/apache/any23/extractor/xpath/Term.java
A         core/src/main/java/org/apache/any23/extractor/xpath/TemplateXPathExtractionRule.java
A         core/src/main/java/org/apache/any23/extractor/xpath/TemplateSubject.java
A         core/src/main/java/org/apache/any23/extractor/xpath/TemplateXPathExtractionRuleImpl.java
A         core/src/main/java/org/apache/any23/extractor/xpath/TemplatePredicate.java
A         core/src/main/java/org/apache/any23/extractor/xpath/TemplateGraph.java
A         core/src/main/java/org/apache/any23/extractor/xpath/XPathExtractionRule.java
AU        core/src/main/java/org/apache/any23/extractor/ExtractionParameters.java
A         core/src/main/java/org/apache/any23/extractor/ExtractorRegistry.java
A         core/src/main/java/org/apache/any23/extractor/csv
A         core/src/main/java/org/apache/any23/extractor/csv/CSVReaderBuilder.java
A         core/src/main/java/org/apache/any23/extractor/csv/CSVExtractor.java
A         core/src/main/java/org/apache/any23/extractor/Extractor.java
A         core/src/main/java/org/apache/any23/extractor/SimpleExtractorFactory.java
AU        core/src/main/java/org/apache/any23/extractor/SingleDocumentExtractionReport.java
A         core/src/main/java/org/apache/any23/extractor/ExtractionResult.java
A         core/src/main/java/org/apache/any23/extractor/ExtractorDescription.java
A         core/src/main/java/org/apache/any23/extractor/SingleDocumentExtraction.java
AU        core/src/main/java/org/apache/any23/extractor/TagSoupExtractionResult.java
A         core/src/main/java/org/apache/any23/extractor/microdata
A         core/src/main/java/org/apache/any23/extractor/microdata/ItemProp.java
A         core/src/main/java/org/apache/any23/extractor/microdata/MicrodataExtractor.java
A         core/src/main/java/org/apache/any23/extractor/microdata/MicrodataParserException.java
A         core/src/main/java/org/apache/any23/extractor/microdata/MicrodataParser.java
A         core/src/main/java/org/apache/any23/extractor/microdata/ItemScope.java
A         core/src/main/java/org/apache/any23/extractor/microdata/ItemPropValue.java
A         core/src/main/java/org/apache/any23/extractor/microdata/MicrodataParserReport.java
A         core/src/main/java/org/apache/any23/extractor/microdata/Item.java
AU        core/src/main/java/org/apache/any23/extractor/IssueReport.java
A         core/src/main/java/org/apache/any23/extractor/html
A         core/src/main/java/org/apache/any23/extractor/html/TagSoupParser.java
AU        core/src/main/java/org/apache/any23/extractor/html/TurtleHTMLExtractor.java
A         core/src/main/java/org/apache/any23/extractor/html/DomUtils.java
A         core/src/main/java/org/apache/any23/extractor/html/AdrExtractor.java
A         core/src/main/java/org/apache/any23/extractor/html/HTMLDocument.java
A         core/src/main/java/org/apache/any23/extractor/html/HResumeExtractor.java
A         core/src/main/java/org/apache/any23/extractor/html/SpanCloserInputStream.java
A         core/src/main/java/org/apache/any23/extractor/html/HReviewExtractor.java
A         core/src/main/java/org/apache/any23/extractor/html/GeoExtractor.java
A         core/src/main/java/org/apache/any23/extractor/html/ICBMExtractor.java
A         core/src/main/java/org/apache/any23/extractor/html/HTMLMetaExtractor.java
AU        core/src/main/java/org/apache/any23/extractor/html/DocumentReport.java
A         core/src/main/java/org/apache/any23/extractor/html/EntityBasedMicroformatExtractor.java
A         core/src/main/java/org/apache/any23/extractor/html/HRecipeExtractor.java
A         core/src/main/java/org/apache/any23/extractor/html/HeadLinkExtractor.java
A         core/src/main/java/org/apache/any23/extractor/html/HListingExtractor.java
A         core/src/main/java/org/apache/any23/extractor/html/HCardExtractor.java
A         core/src/main/java/org/apache/any23/extractor/html/HCalendarExtractor.java
A         core/src/main/java/org/apache/any23/extractor/html/TitleExtractor.java
A         core/src/main/java/org/apache/any23/extractor/html/annotations
A         core/src/main/java/org/apache/any23/extractor/html/annotations/Includes.java
A         core/src/main/java/org/apache/any23/extractor/html/LicenseExtractor.java
A         core/src/main/java/org/apache/any23/extractor/html/MicroformatExtractor.java
A         core/src/main/java/org/apache/any23/extractor/html/HCardName.java
AU        core/src/main/java/org/apache/any23/extractor/html/SpeciesExtractor.java
A         core/src/main/java/org/apache/any23/extractor/html/XFNExtractor.java
AU        core/src/main/java/org/apache/any23/extractor/package-info.java
A         core/src/main/java/org/apache/any23/extractor/ExtractionContext.java
A         core/src/main/java/org/apache/any23/extractor/ExtractorGroup.java
A         core/src/main/java/org/apache/any23/extractor/rdf
AU        core/src/main/java/org/apache/any23/extractor/rdf/RDFParserFactory.java
A         core/src/main/java/org/apache/any23/extractor/rdf/BaseRDFExtractor.java
A         core/src/main/java/org/apache/any23/extractor/rdf/TriXExtractor.java
AU        core/src/main/java/org/apache/any23/extractor/rdf/NQuadsExtractor.java
A         core/src/main/java/org/apache/any23/extractor/rdf/RDFXMLExtractor.java
A         core/src/main/java/org/apache/any23/extractor/rdf/RDFHandlerAdapter.java
A         core/src/main/java/org/apache/any23/extractor/rdf/TurtleExtractor.java
A         core/src/main/java/org/apache/any23/extractor/rdf/NTriplesExtractor.java
A         core/src/main/java/org/apache/any23/extractor/ExampleInputOutput.java
A         core/src/main/java/org/apache/any23/extractor/rdfa
AU        core/src/main/java/org/apache/any23/extractor/rdfa/XSLTStylesheetException.java
A         core/src/main/java/org/apache/any23/extractor/rdfa/XSLTStylesheet.java
A         core/src/main/java/org/apache/any23/extractor/rdfa/RDFaExtractor.java
A         core/src/main/java/org/apache/any23/extractor/rdfa/RDFa11Extractor.java
A         core/src/main/java/org/apache/any23/extractor/rdfa/RDFa11ParserException.java
A         core/src/main/java/org/apache/any23/extractor/rdfa/RDFa11Parser.java
A         core/src/main/java/org/apache/any23/rdf
A         core/src/main/java/org/apache/any23/rdf/Any23ValueFactoryWrapper.java
AU        core/src/main/java/org/apache/any23/rdf/package-info.java
A         core/src/main/java/org/apache/any23/rdf/Prefixes.java
A         core/src/main/java/org/apache/any23/rdf/PopularPrefixes.java
AU        core/src/main/java/org/apache/any23/rdf/RDFUtils.java
A         core/src/main/java/org/apache/any23/Any23.java
A         core/src/main/java/org/apache/any23/writer
A         core/src/main/java/org/apache/any23/writer/CountingTripleHandler.java
A         core/src/main/java/org/apache/any23/writer/LoggingTripleHandler.java
A         core/src/main/java/org/apache/any23/writer/WriterRegistry.java
A         core/src/main/java/org/apache/any23/writer/JSONWriter.java
A         core/src/main/java/org/apache/any23/writer/BenchmarkTripleHandler.java
A         core/src/main/java/org/apache/any23/writer/Writer.java
A         core/src/main/java/org/apache/any23/writer/RepositoryWriter.java
AU        core/src/main/java/org/apache/any23/writer/TripleHandlerException.java
A         core/src/main/java/org/apache/any23/writer/TurtleWriter.java
A         core/src/main/java/org/apache/any23/writer/CompositeTripleHandler.java
A         core/src/main/java/org/apache/any23/writer/TriXWriter.java
AU        core/src/main/java/org/apache/any23/writer/package-info.java
A         core/src/main/java/org/apache/any23/writer/FormatWriter.java
A         core/src/main/java/org/apache/any23/writer/RDFWriterTripleHandler.java
A         core/src/main/java/org/apache/any23/writer/ReportingTripleHandler.java
A         core/src/main/java/org/apache/any23/writer/NQuadsWriter.java
A         core/src/main/java/org/apache/any23/writer/URIListWriter.java
A         core/src/main/java/org/apache/any23/writer/RDFXMLWriter.java
A         core/src/main/java/org/apache/any23/writer/TripleHandler.java
A         core/src/main/java/org/apache/any23/writer/NTriplesWriter.java
A         core/src/main/java/org/apache/any23/util
A         core/src/main/java/org/apache/any23/util/FileUtils.java
A         core/src/main/java/org/apache/any23/util/LogUtils.java
A         core/src/main/java/org/apache/any23/util/URLUtils.java
AU        core/src/main/java/org/apache/any23/util/package-info.java
A         core/src/main/java/org/apache/any23/util/StringUtils.java
A         core/src/main/java/org/apache/any23/util/DiscoveryUtils.java
AU        core/src/main/java/org/apache/any23/util/MathUtils.java
A         core/src/main/java/org/apache/any23/util/StreamUtils.java
AU        core/src/main/java/org/apache/any23/util/ReaderInputStream.java
A         core/src/main/resources
A         core/src/main/resources/default-configuration.properties
A         core/src/main/resources/org
A         core/src/main/resources/org/apache
A         core/src/main/resources/org/apache/any23
A         core/src/main/resources/org/apache/any23/prefixes
AU        core/src/main/resources/org/apache/any23/prefixes/prefixes.properties
A         core/src/main/resources/org/apache/any23/mime
A         core/src/main/resources/org/apache/any23/mime/tika-config.xml
A         core/src/main/resources/org/apache/any23/mime/mimetypes.xml
A         core/src/main/resources/org/apache/any23/extractor
A         core/src/main/resources/org/apache/any23/extractor/microdata
A         core/src/main/resources/org/apache/any23/extractor/microdata/example-microdata.html
A         core/src/main/resources/org/apache/any23/extractor/html
A         core/src/main/resources/org/apache/any23/extractor/html/example-meta.html
A         core/src/main/resources/org/apache/any23/extractor/html/example-mf-species.html
A         core/src/main/resources/org/apache/any23/extractor/html/example-mf-xfn.html
A         core/src/main/resources/org/apache/any23/extractor/html/example-head-link.html
A         core/src/main/resources/org/apache/any23/extractor/html/example-mf-adr.html
A         core/src/main/resources/org/apache/any23/extractor/html/example-mf-hresume.html
A         core/src/main/resources/org/apache/any23/extractor/html/example-mf-hreview.html
A         core/src/main/resources/org/apache/any23/extractor/html/example-icbm.html
A         core/src/main/resources/org/apache/any23/extractor/html/example-mf-geo.html
A         core/src/main/resources/org/apache/any23/extractor/html/example-mf-hrecipe.html
A         core/src/main/resources/org/apache/any23/extractor/html/example-mf-hcalendar.html
A         core/src/main/resources/org/apache/any23/extractor/html/example-mf-hcard.html
A         core/src/main/resources/org/apache/any23/extractor/html/example-mf-hlisting.html
A         core/src/main/resources/org/apache/any23/extractor/html/example-script-turtle.html
A         core/src/main/resources/org/apache/any23/extractor/html/example-title.html
A         core/src/main/resources/org/apache/any23/extractor/html/example-mf-license.html
A         core/src/main/resources/org/apache/any23/extractor/csv
A         core/src/main/resources/org/apache/any23/extractor/csv/example-csv.csv
A         core/src/main/resources/org/apache/any23/extractor/rdf
A         core/src/main/resources/org/apache/any23/extractor/rdf/example-rdfxml.rdf
A         core/src/main/resources/org/apache/any23/extractor/rdf/example-nquads.nq
A         core/src/main/resources/org/apache/any23/extractor/rdf/example-ntriples.nt
A         core/src/main/resources/org/apache/any23/extractor/rdf/example-turtle.ttl
A         core/src/main/resources/org/apache/any23/extractor/rdf/example-trix.trx
A         core/src/main/resources/org/apache/any23/extractor/rdfa
A         core/src/main/resources/org/apache/any23/extractor/rdfa/rdfa.xslt
A         core/src/main/resources/org/apache/any23/extractor/rdfa/example-rdfa11.html
AU        core/pom.xml
AU        DISCLAIMER.txt
AU        pom.xml
AU        README.txt
 U        .
At revision 1298278
no change for https://svn.apache.org/repos/asf/incubator/any23/trunk since the previous build
Parsing POMs
Modules changed, recalculating dependency graph
[Any23-trunk] $ /home/hudson/tools/java/latest1.6/bin/java -cp /export/home/hudson/hudson-slave/maven-agent.jar:/export/home/hudson/hudson-slave/classworlds.jar hudson.maven.agent.Main /home/hudson/tools/maven/latest /zonestorage/hudson_solaris/home/hudson/hudson-slave/slave.jar /export/home/hudson/hudson-slave/maven-interceptor.jar 38416 /export/home/hudson/hudson-slave/maven2.1-interceptor.jar
channel started
<===[JENKINS REMOTING CAPACITY]===>   Executing Maven:  -B -f <https://builds.apache.org/job/Any23-trunk/ws/pom.xml> -Dmaven.repo.local=/export/home/hudson/hudson-slave/maven-repositories/0 --settings settings.xml clean deploy
[INFO] Scanning for projects...
[INFO] Reactor build order: 
[INFO]   Apache Any23 :: Parent
[INFO]   Apache Any23 :: Core
[INFO]   Apache Any23 :: Plugins :: Basic Crawler
[INFO]   Apache Any23 :: Plugins :: HTML Scraper
[INFO]   Apache Any23 :: Plugins :: Office Scraper
[INFO]   Apache Any23 :: Plugins :: Integration Test
[INFO]   Apache Any23 :: Service
[INFO] ------------------------------------------------------------------------
[INFO] Building Apache Any23 :: Parent
[INFO]    task-segment: [clean, deploy]
[INFO] ------------------------------------------------------------------------
[INFO] [clean:clean {execution: default-clean}]
log4j:WARN No appenders could be found for logger (org.apache.commons.beanutils.converters.BooleanConverter).
log4j:WARN Please initialize the log4j system properly.
[INFO] [cobertura:clean {execution: default}]
[INFO] [buildnumber:create {execution: default}]
[INFO] Checking for local modifications: skipped.
[INFO] Updating project files from SCM: skipped.
[INFO] Executing: /bin/sh -c cd <https://builds.apache.org/job/Any23-trunk/ws/> && svn --non-interactive info
[INFO] Working directory: <https://builds.apache.org/job/Any23-trunk/ws/>
[INFO] Storing buildNumber: 1297498 at timestamp: 1331191405895
[INFO] Executing: /bin/sh -c cd <https://builds.apache.org/job/Any23-trunk/ws/> && svn --non-interactive info
[INFO] Working directory: <https://builds.apache.org/job/Any23-trunk/ws/>
[INFO] Storing buildScmBranch: trunk
[INFO] [remote-resources:process {execution: default}]
[INFO] [site:attach-descriptor {execution: default-attach-descriptor}]
[INFO] [install:install {execution: default-install}]
[INFO] Installing <https://builds.apache.org/job/Any23-trunk/ws/pom.xml> to /export/home/hudson/hudson-slave/maven-repositories/0/org/apache/any23/any23-parent/0.7.0-incubating-SNAPSHOT/any23-parent-0.7.0-incubating-SNAPSHOT.pom
[INFO] Installing <https://builds.apache.org/job/Any23-trunk/ws/target/any23-parent-0.7.0-incubating-SNAPSHOT-site.xml> to /export/home/hudson/hudson-slave/maven-repositories/0/org/apache/any23/any23-parent/0.7.0-incubating-SNAPSHOT/any23-parent-0.7.0-incubating-SNAPSHOT-site.xml
[INFO] [deploy:deploy {execution: default-deploy}]
[INFO] Retrieving previous build number from apache.snapshots.https
[WARNING] *** CHECKSUM FAILED - Checksum failed on download: local = 'e0cb46bc212601b62c1154471a7194d67e6b9f4e'; remote = '61d6161b34093c332a8a9a8b6b7c4f7ade08feff' - RETRYING
[WARNING] *** CHECKSUM FAILED - Checksum failed on download: local = 'e0cb46bc212601b62c1154471a7194d67e6b9f4e'; remote = '61d6161b34093c332a8a9a8b6b7c4f7ade08feff' - IGNORING
Uploading: https://repository.apache.org/content/repositories/snapshots/org/apache/any23/any23-parent/0.7.0-incubating-SNAPSHOT/any23-parent-0.7.0-incubating-20120308.072334-28.pom
[JENKINS] Archiving <https://builds.apache.org/job/Any23-trunk/ws/pom.xml> to /home/hudson/hudson/jobs/Any23-trunk/modules/org.apache.any23$any23-parent/builds/2012-03-08_07-17-35/archive/org.apache.any23/any23-parent/0.7.0-incubating-SNAPSHOT/any23-parent-0.7.0-incubating-SNAPSHOT.pom
[JENKINS] Archiving /export/home/hudson/hudson-slave/maven-repositories/0/org/apache/any23/any23-parent/0.7.0-incubating-SNAPSHOT/any23-parent-0.7.0-incubating-SNAPSHOT.pom to /home/hudson/hudson/jobs/Any23-trunk/modules/org.apache.any23$any23-parent/builds/2012-03-08_07-17-35/archive/org.apache.any23/any23-parent/0.7.0-incubating-20120308.072334-28/any23-parent-0.7.0-incubating-20120308.072334-28.pom
[JENKINS] Archiving <https://builds.apache.org/job/Any23-trunk/ws/target/any23-parent-0.7.0-incubating-SNAPSHOT-site.xml> to /home/hudson/hudson/jobs/Any23-trunk/modules/org.apache.any23$any23-parent/builds/2012-03-08_07-17-35/archive/org.apache.any23/any23-parent/0.7.0-incubating-20120308.072334-28/any23-parent-0.7.0-incubating-20120308.072334-28-site.xml
[INFO] ------------------------------------------------------------------------
[ERROR] BUILD ERROR
[INFO] ------------------------------------------------------------------------
[INFO] Error deploying artifact: Failed to transfer file: https://repository.apache.org/content/repositories/snapshots/org/apache/any23/any23-parent/0.7.0-incubating-SNAPSHOT/any23-parent-0.7.0-incubating-20120308.072334-28.pom. Return code is: 401

[INFO] ------------------------------------------------------------------------
[INFO] For more information, run Maven with the -e switch
[INFO] ------------------------------------------------------------------------
[INFO] Total time: 2 minutes 5 seconds
[INFO] Finished at: Thu Mar 08 07:24:09 GMT+00:00 2012
[INFO] Final Memory: 44M/327M
[INFO] ------------------------------------------------------------------------
Sending e-mails to: any23-dev@incubator.apache.org
channel stopped


Build failed in Jenkins: Any23-trunk #126

Posted by Apache Jenkins Server <je...@builds.apache.org>.
See <https://builds.apache.org/job/Any23-trunk/126/changes>

Changes:

[mostarda] Improved integration test: renamed test to verify Extractor plugins detection. Added test to verify CLI plugins detection. Added minimal Javadoc. This commit is related to issue #ANY23-54 .

------------------------------------------
[...truncated 790 lines...]
A         core/src/main/java/org/apache/any23/extractor/html/HCalendarExtractor.java
A         core/src/main/java/org/apache/any23/extractor/html/TitleExtractor.java
A         core/src/main/java/org/apache/any23/extractor/html/annotations
A         core/src/main/java/org/apache/any23/extractor/html/annotations/Includes.java
A         core/src/main/java/org/apache/any23/extractor/html/LicenseExtractor.java
A         core/src/main/java/org/apache/any23/extractor/html/MicroformatExtractor.java
A         core/src/main/java/org/apache/any23/extractor/html/HCardName.java
AU        core/src/main/java/org/apache/any23/extractor/html/SpeciesExtractor.java
A         core/src/main/java/org/apache/any23/extractor/html/XFNExtractor.java
AU        core/src/main/java/org/apache/any23/extractor/package-info.java
A         core/src/main/java/org/apache/any23/extractor/ExtractionContext.java
A         core/src/main/java/org/apache/any23/extractor/ExtractorGroup.java
A         core/src/main/java/org/apache/any23/extractor/rdf
AU        core/src/main/java/org/apache/any23/extractor/rdf/RDFParserFactory.java
A         core/src/main/java/org/apache/any23/extractor/rdf/BaseRDFExtractor.java
A         core/src/main/java/org/apache/any23/extractor/rdf/TriXExtractor.java
AU        core/src/main/java/org/apache/any23/extractor/rdf/NQuadsExtractor.java
A         core/src/main/java/org/apache/any23/extractor/rdf/RDFXMLExtractor.java
A         core/src/main/java/org/apache/any23/extractor/rdf/RDFHandlerAdapter.java
A         core/src/main/java/org/apache/any23/extractor/rdf/TurtleExtractor.java
A         core/src/main/java/org/apache/any23/extractor/rdf/NTriplesExtractor.java
A         core/src/main/java/org/apache/any23/extractor/ExampleInputOutput.java
A         core/src/main/java/org/apache/any23/extractor/rdfa
AU        core/src/main/java/org/apache/any23/extractor/rdfa/XSLTStylesheetException.java
A         core/src/main/java/org/apache/any23/extractor/rdfa/XSLTStylesheet.java
A         core/src/main/java/org/apache/any23/extractor/rdfa/RDFaExtractor.java
A         core/src/main/java/org/apache/any23/extractor/rdfa/RDFa11Extractor.java
A         core/src/main/java/org/apache/any23/extractor/rdfa/RDFa11ParserException.java
A         core/src/main/java/org/apache/any23/extractor/rdfa/RDFa11Parser.java
A         core/src/main/java/org/apache/any23/rdf
A         core/src/main/java/org/apache/any23/rdf/Any23ValueFactoryWrapper.java
AU        core/src/main/java/org/apache/any23/rdf/package-info.java
A         core/src/main/java/org/apache/any23/rdf/Prefixes.java
A         core/src/main/java/org/apache/any23/rdf/PopularPrefixes.java
AU        core/src/main/java/org/apache/any23/rdf/RDFUtils.java
A         core/src/main/java/org/apache/any23/Any23.java
A         core/src/main/java/org/apache/any23/writer
A         core/src/main/java/org/apache/any23/writer/CountingTripleHandler.java
A         core/src/main/java/org/apache/any23/writer/LoggingTripleHandler.java
A         core/src/main/java/org/apache/any23/writer/WriterRegistry.java
A         core/src/main/java/org/apache/any23/writer/JSONWriter.java
A         core/src/main/java/org/apache/any23/writer/BenchmarkTripleHandler.java
A         core/src/main/java/org/apache/any23/writer/Writer.java
A         core/src/main/java/org/apache/any23/writer/RepositoryWriter.java
AU        core/src/main/java/org/apache/any23/writer/TripleHandlerException.java
A         core/src/main/java/org/apache/any23/writer/TurtleWriter.java
A         core/src/main/java/org/apache/any23/writer/CompositeTripleHandler.java
A         core/src/main/java/org/apache/any23/writer/TriXWriter.java
AU        core/src/main/java/org/apache/any23/writer/package-info.java
A         core/src/main/java/org/apache/any23/writer/FormatWriter.java
A         core/src/main/java/org/apache/any23/writer/RDFWriterTripleHandler.java
A         core/src/main/java/org/apache/any23/writer/ReportingTripleHandler.java
A         core/src/main/java/org/apache/any23/writer/NQuadsWriter.java
A         core/src/main/java/org/apache/any23/writer/URIListWriter.java
A         core/src/main/java/org/apache/any23/writer/RDFXMLWriter.java
A         core/src/main/java/org/apache/any23/writer/TripleHandler.java
A         core/src/main/java/org/apache/any23/writer/NTriplesWriter.java
A         core/src/main/java/org/apache/any23/util
A         core/src/main/java/org/apache/any23/util/FileUtils.java
A         core/src/main/java/org/apache/any23/util/LogUtils.java
A         core/src/main/java/org/apache/any23/util/URLUtils.java
AU        core/src/main/java/org/apache/any23/util/package-info.java
A         core/src/main/java/org/apache/any23/util/StringUtils.java
A         core/src/main/java/org/apache/any23/util/DiscoveryUtils.java
AU        core/src/main/java/org/apache/any23/util/MathUtils.java
A         core/src/main/java/org/apache/any23/util/StreamUtils.java
AU        core/src/main/java/org/apache/any23/util/ReaderInputStream.java
A         core/src/main/resources
A         core/src/main/resources/default-configuration.properties
A         core/src/main/resources/org
A         core/src/main/resources/org/apache
A         core/src/main/resources/org/apache/any23
A         core/src/main/resources/org/apache/any23/prefixes
AU        core/src/main/resources/org/apache/any23/prefixes/prefixes.properties
A         core/src/main/resources/org/apache/any23/mime
A         core/src/main/resources/org/apache/any23/mime/tika-config.xml
A         core/src/main/resources/org/apache/any23/mime/mimetypes.xml
A         core/src/main/resources/org/apache/any23/extractor
A         core/src/main/resources/org/apache/any23/extractor/microdata
A         core/src/main/resources/org/apache/any23/extractor/microdata/example-microdata.html
A         core/src/main/resources/org/apache/any23/extractor/html
A         core/src/main/resources/org/apache/any23/extractor/html/example-meta.html
A         core/src/main/resources/org/apache/any23/extractor/html/example-mf-species.html
A         core/src/main/resources/org/apache/any23/extractor/html/example-mf-xfn.html
A         core/src/main/resources/org/apache/any23/extractor/html/example-head-link.html
A         core/src/main/resources/org/apache/any23/extractor/html/example-mf-adr.html
A         core/src/main/resources/org/apache/any23/extractor/html/example-mf-hresume.html
A         core/src/main/resources/org/apache/any23/extractor/html/example-mf-hreview.html
A         core/src/main/resources/org/apache/any23/extractor/html/example-icbm.html
A         core/src/main/resources/org/apache/any23/extractor/html/example-mf-geo.html
A         core/src/main/resources/org/apache/any23/extractor/html/example-mf-hrecipe.html
A         core/src/main/resources/org/apache/any23/extractor/html/example-mf-hcalendar.html
A         core/src/main/resources/org/apache/any23/extractor/html/example-mf-hcard.html
A         core/src/main/resources/org/apache/any23/extractor/html/example-mf-hlisting.html
A         core/src/main/resources/org/apache/any23/extractor/html/example-script-turtle.html
A         core/src/main/resources/org/apache/any23/extractor/html/example-title.html
A         core/src/main/resources/org/apache/any23/extractor/html/example-mf-license.html
A         core/src/main/resources/org/apache/any23/extractor/csv
A         core/src/main/resources/org/apache/any23/extractor/csv/example-csv.csv
A         core/src/main/resources/org/apache/any23/extractor/rdf
A         core/src/main/resources/org/apache/any23/extractor/rdf/example-rdfxml.rdf
A         core/src/main/resources/org/apache/any23/extractor/rdf/example-nquads.nq
A         core/src/main/resources/org/apache/any23/extractor/rdf/example-ntriples.nt
A         core/src/main/resources/org/apache/any23/extractor/rdf/example-turtle.ttl
A         core/src/main/resources/org/apache/any23/extractor/rdf/example-trix.trx
A         core/src/main/resources/org/apache/any23/extractor/rdfa
A         core/src/main/resources/org/apache/any23/extractor/rdfa/rdfa.xslt
A         core/src/main/resources/org/apache/any23/extractor/rdfa/example-rdfa11.html
AU        core/pom.xml
AU        DISCLAIMER.txt
AU        pom.xml
AU        README.txt
 U        .
At revision 1297866
Parsing POMs
Modules changed, recalculating dependency graph
[Any23-trunk] $ /home/hudson/tools/java/latest1.6/bin/java -cp /home/jenkins/jenkins-slave/maven3-agent.jar:/home/hudson/tools/maven/latest/boot/plexus-classworlds-2.4.jar org.jvnet.hudson.maven3.agent.Maven3Main /home/hudson/tools/maven/latest /home/jenkins/jenkins-slave/slave.jar /home/jenkins/jenkins-slave/maven3-interceptor.jar 34295
<===[JENKINS REMOTING CAPACITY]===>channel started
   Executing Maven:  -B -f <https://builds.apache.org/job/Any23-trunk/ws/pom.xml> -Dmaven.repo.local=/home/jenkins/jenkins-slave/maven-repositories/1 --settings settings.xml clean deploy
[INFO] Scanning for projects...
[INFO] ------------------------------------------------------------------------
[INFO] Reactor Build Order:
[INFO] 
[INFO] Apache Any23 :: Parent
[INFO] Apache Any23 :: Core
[INFO] Apache Any23 :: Plugins :: Basic Crawler
[INFO] Apache Any23 :: Plugins :: HTML Scraper
[INFO] Apache Any23 :: Plugins :: Office Scraper
[INFO] Apache Any23 :: Plugins :: Integration Test
[INFO] Apache Any23 :: Service
[INFO]                                                                         
[INFO] ------------------------------------------------------------------------
[INFO] Building Apache Any23 :: Parent 0.7.0-incubating-SNAPSHOT
[INFO] ------------------------------------------------------------------------
[INFO] 
[INFO] --- maven-clean-plugin:2.4.1:clean (default-clean) @ any23-parent ---
log4j:WARN No appenders could be found for logger (org.apache.commons.beanutils.converters.BooleanConverter).
log4j:WARN Please initialize the log4j system properly.
[INFO] 
[INFO] --- cobertura-maven-plugin:2.0:clean (default) @ any23-parent ---
[INFO] 
[INFO] --- buildnumber-maven-plugin:1.0:create (default) @ any23-parent ---
[INFO] Checking for local modifications: skipped.
[INFO] Updating project files from SCM: skipped.
[INFO] Executing: /bin/sh -c cd <https://builds.apache.org/job/Any23-trunk/ws/> && svn --non-interactive info
[INFO] Working directory: <https://builds.apache.org/job/Any23-trunk/ws/>
[INFO] Storing buildNumber: 1297498 at timestamp: 1331103990843
[INFO] Executing: /bin/sh -c cd <https://builds.apache.org/job/Any23-trunk/ws/> && svn --non-interactive info
[INFO] Working directory: <https://builds.apache.org/job/Any23-trunk/ws/>
[INFO] Storing buildScmBranch: trunk
[INFO] 
[INFO] --- maven-remote-resources-plugin:1.2.1:process (default) @ any23-parent ---
[INFO] 
[INFO] --- maven-site-plugin:3.0:attach-descriptor (attach-descriptor) @ any23-parent ---
[INFO] [INFO] Installing <https://builds.apache.org/job/Any23-trunk/ws/pom.xml> to /home/jenkins/jenkins-slave/maven-repositories/1/org/apache/any23/any23-parent/0.7.0-incubating-SNAPSHOT/any23-parent-0.7.0-incubating-SNAPSHOT.pom

[INFO] --- maven-install-plugin:2.3.1:install (default-install) @ any23-parent ---
[INFO] Installing <https://builds.apache.org/job/Any23-trunk/ws/target/any23-parent-0.7.0-incubating-SNAPSHOT-site.xml> to /home/jenkins/jenkins-slave/maven-repositories/1/org/apache/any23/any23-parent/0.7.0-incubating-SNAPSHOT/any23-parent-0.7.0-incubating-SNAPSHOT-site.xml
[INFO] 
[INFO] --- maven-deploy-plugin:2.5:deploy (default-deploy) @ any23-parent ---
Downloading: https://repository.apache.org/content/repositories/snapshots/org/apache/any23/any23-parent/0.7.0-incubating-SNAPSHOT/maven-metadata.xml
Downloaded: https://repository.apache.org/content/repositories/snapshots/org/apache/any23/any23-parent/0.7.0-incubating-SNAPSHOT/maven-metadata.xml (852 B at 1.0 KB/sec)
Uploading: https://repository.apache.org/content/repositories/snapshots/org/apache/any23/any23-parent/0.7.0-incubating-SNAPSHOT/any23-parent-0.7.0-incubating-20120307.070635-28.pom
[JENKINS] Archiving <https://builds.apache.org/job/Any23-trunk/ws/pom.xml> to /home/hudson/hudson/jobs/Any23-trunk/modules/org.apache.any23$any23-parent/builds/2012-03-07_07-05-41/archive/org.apache.any23/any23-parent/0.7.0-incubating-SNAPSHOT/any23-parent-0.7.0-incubating-SNAPSHOT.pom
[JENKINS] Archiving <https://builds.apache.org/job/Any23-trunk/ws/target/any23-parent-0.7.0-incubating-SNAPSHOT-site.xml> to /home/hudson/hudson/jobs/Any23-trunk/modules/org.apache.any23$any23-parent/builds/2012-03-07_07-05-41/archive/org.apache.any23/any23-parent/0.7.0-incubating-SNAPSHOT/any23-parent-0.7.0-incubating-SNAPSHOT-site.xml
[INFO] ------------------------------------------------------------------------
[INFO] Reactor Summary:
[INFO] 
[INFO] Apache Any23 :: Parent ............................ FAILURE [34.071s]
[INFO] Apache Any23 :: Core .............................. SKIPPED
[INFO] Apache Any23 :: Plugins :: Basic Crawler .......... SKIPPED
[INFO] Apache Any23 :: Plugins :: HTML Scraper ........... SKIPPED
[INFO] Apache Any23 :: Plugins :: Office Scraper ......... SKIPPED
[INFO] Apache Any23 :: Plugins :: Integration Test ....... SKIPPED
[INFO] Apache Any23 :: Service ........................... SKIPPED
[INFO] ------------------------------------------------------------------------
[INFO] BUILD FAILURE
[INFO] ------------------------------------------------------------------------
[INFO] Total time: 38.688s
[INFO] Finished at: Wed Mar 07 07:06:40 UTC 2012
[INFO] Final Memory: 12M/64M
[INFO] ------------------------------------------------------------------------
mavenExecutionResult exceptions not empty
message : Failed to execute goal org.apache.maven.plugins:maven-deploy-plugin:2.5:deploy (default-deploy) on project any23-parent: Failed to deploy artifacts: Could not transfer artifact org.apache.any23:any23-parent:pom:0.7.0-incubating-20120307.070635-28 from/to apache.snapshots.https (https://repository.apache.org/content/repositories/snapshots): Failed to transfer file: https://repository.apache.org/content/repositories/snapshots/org/apache/any23/any23-parent/0.7.0-incubating-SNAPSHOT/any23-parent-0.7.0-incubating-20120307.070635-28.pom. Return code is: 401
cause : Failed to deploy artifacts: Could not transfer artifact org.apache.any23:any23-parent:pom:0.7.0-incubating-20120307.070635-28 from/to apache.snapshots.https (https://repository.apache.org/content/repositories/snapshots): Failed to transfer file: https://repository.apache.org/content/repositories/snapshots/org/apache/any23/any23-parent/0.7.0-incubating-SNAPSHOT/any23-parent-0.7.0-incubating-20120307.070635-28.pom. Return code is: 401
Stack trace : 
org.apache.maven.lifecycle.LifecycleExecutionException: Failed to execute goal org.apache.maven.plugins:maven-deploy-plugin:2.5:deploy (default-deploy) on project any23-parent: Failed to deploy artifacts: Could not transfer artifact org.apache.any23:any23-parent:pom:0.7.0-incubating-20120307.070635-28 from/to apache.snapshots.https (https://repository.apache.org/content/repositories/snapshots): Failed to transfer file: https://repository.apache.org/content/repositories/snapshots/org/apache/any23/any23-parent/0.7.0-incubating-SNAPSHOT/any23-parent-0.7.0-incubating-20120307.070635-28.pom. Return code is: 401
	at org.apache.maven.lifecycle.internal.MojoExecutor.execute(MojoExecutor.java:217)
	at org.apache.maven.lifecycle.internal.MojoExecutor.execute(MojoExecutor.java:153)
	at org.apache.maven.lifecycle.internal.MojoExecutor.execute(MojoExecutor.java:145)
	at org.apache.maven.lifecycle.internal.LifecycleModuleBuilder.buildProject(LifecycleModuleBuilder.java:84)
	at org.apache.maven.lifecycle.internal.LifecycleModuleBuilder.buildProject(LifecycleModuleBuilder.java:59)
	at org.apache.maven.lifecycle.internal.LifecycleStarter.singleThreadedBuild(LifecycleStarter.java:183)
	at org.apache.maven.lifecycle.internal.LifecycleStarter.execute(LifecycleStarter.java:161)
	at org.apache.maven.DefaultMaven.doExecute(DefaultMaven.java:319)
	at org.apache.maven.DefaultMaven.execute(DefaultMaven.java:156)
	at org.jvnet.hudson.maven3.launcher.Maven3Launcher.main(Maven3Launcher.java:79)
	at sun.reflect.NativeMethodAccessorImpl.invoke0(Native Method)
	at sun.reflect.NativeMethodAccessorImpl.invoke(NativeMethodAccessorImpl.java:39)
	at sun.reflect.DelegatingMethodAccessorImpl.invoke(DelegatingMethodAccessorImpl.java:25)
	at java.lang.reflect.Method.invoke(Method.java:597)
	at org.codehaus.plexus.classworlds.launcher.Launcher.launchStandard(Launcher.java:329)
	at org.codehaus.plexus.classworlds.launcher.Launcher.launch(Launcher.java:239)
	at org.jvnet.hudson.maven3.agent.Maven3Main.launch(Maven3Main.java:158)
	at hudson.maven.Maven3Builder.call(Maven3Builder.java:104)
	at hudson.maven.Maven3Builder.call(Maven3Builder.java:70)
	at hudson.remoting.UserRequest.perform(UserRequest.java:118)
	at hudson.remoting.UserRequest.perform(UserRequest.java:48)
	at hudson.remoting.Request$2.run(Request.java:287)
	at hudson.remoting.InterceptingExecutorService$1.call(InterceptingExecutorService.java:72)
	at java.util.concurrent.FutureTask$Sync.innerRun(FutureTask.java:303)
	at java.util.concurrent.FutureTask.run(FutureTask.java:138)
	at java.util.concurrent.ThreadPoolExecutor$Worker.runTask(ThreadPoolExecutor.java:886)
	at java.util.concurrent.ThreadPoolExecutor$Worker.run(ThreadPoolExecutor.java:908)
	at java.lang.Thread.run(Thread.java:662)
Caused by: org.apache.maven.plugin.MojoExecutionException: Failed to deploy artifacts: Could not transfer artifact org.apache.any23:any23-parent:pom:0.7.0-incubating-20120307.070635-28 from/to apache.snapshots.https (https://repository.apache.org/content/repositories/snapshots): Failed to transfer file: https://repository.apache.org/content/repositories/snapshots/org/apache/any23/any23-parent/0.7.0-incubating-SNAPSHOT/any23-parent-0.7.0-incubating-20120307.070635-28.pom. Return code is: 401
	at org.apache.maven.plugin.deploy.DeployMojo.execute(DeployMojo.java:189)
	at org.apache.maven.plugin.DefaultBuildPluginManager.executeMojo(DefaultBuildPluginManager.java:101)
	at org.apache.maven.lifecycle.internal.MojoExecutor.execute(MojoExecutor.java:209)
	... 27 more
Caused by: org.apache.maven.artifact.deployer.ArtifactDeploymentException: Failed to deploy artifacts: Could not transfer artifact org.apache.any23:any23-parent:pom:0.7.0-incubating-20120307.070635-28 from/to apache.snapshots.https (https://repository.apache.org/content/repositories/snapshots): Failed to transfer file: https://repository.apache.org/content/repositories/snapshots/org/apache/any23/any23-parent/0.7.0-incubating-SNAPSHOT/any23-parent-0.7.0-incubating-20120307.070635-28.pom. Return code is: 401
	at org.apache.maven.artifact.deployer.DefaultArtifactDeployer.deploy(DefaultArtifactDeployer.java:141)
	at org.apache.maven.plugin.deploy.DeployMojo.execute(DeployMojo.java:148)
	... 29 more
Caused by: org.sonatype.aether.deployment.DeploymentException: Failed to deploy artifacts: Could not transfer artifact org.apache.any23:any23-parent:pom:0.7.0-incubating-20120307.070635-28 from/to apache.snapshots.https (https://repository.apache.org/content/repositories/snapshots): Failed to transfer file: https://repository.apache.org/content/repositories/snapshots/org/apache/any23/any23-parent/0.7.0-incubating-SNAPSHOT/any23-parent-0.7.0-incubating-20120307.070635-28.pom. Return code is: 401
	at org.sonatype.aether.impl.internal.DefaultDeployer.deploy(DefaultDeployer.java:284)
	at org.sonatype.aether.impl.internal.DefaultDeployer.deploy(DefaultDeployer.java:215)
	at org.sonatype.aether.impl.internal.DefaultRepositorySystem.deploy(DefaultRepositorySystem.java:480)
	at org.apache.maven.artifact.deployer.DefaultArtifactDeployer.deploy(DefaultArtifactDeployer.java:137)
	... 30 more
Caused by: org.sonatype.aether.transfer.ArtifactTransferException: Could not transfer artifact org.apache.any23:any23-parent:pom:0.7.0-incubating-20120307.070635-28 from/to apache.snapshots.https (https://repository.apache.org/content/repositories/snapshots): Failed to transfer file: https://repository.apache.org/content/repositories/snapshots/org/apache/any23/any23-parent/0.7.0-incubating-SNAPSHOT/any23-parent-0.7.0-incubating-20120307.070635-28.pom. Return code is: 401
	at org.sonatype.aether.connector.wagon.WagonRepositoryConnector$4.wrap(WagonRepositoryConnector.java:949)
	at org.sonatype.aether.connector.wagon.WagonRepositoryConnector$4.wrap(WagonRepositoryConnector.java:940)
	at org.sonatype.aether.connector.wagon.WagonRepositoryConnector$PutTask.flush(WagonRepositoryConnector.java:864)
	at org.sonatype.aether.connector.wagon.WagonRepositoryConnector.put(WagonRepositoryConnector.java:466)
	at org.sonatype.aether.impl.internal.DefaultDeployer.deploy(DefaultDeployer.java:278)
	... 33 more
Caused by: org.apache.maven.wagon.TransferFailedException: Failed to transfer file: https://repository.apache.org/content/repositories/snapshots/org/apache/any23/any23-parent/0.7.0-incubating-SNAPSHOT/any23-parent-0.7.0-incubating-20120307.070635-28.pom. Return code is: 401
	at org.apache.maven.wagon.providers.http.LightweightHttpWagon.finishPutTransfer(LightweightHttpWagon.java:205)
	at org.apache.maven.wagon.AbstractWagon.putTransfer(AbstractWagon.java:413)
	at org.apache.maven.wagon.AbstractWagon.transfer(AbstractWagon.java:392)
	at org.apache.maven.wagon.AbstractWagon.putTransfer(AbstractWagon.java:365)
	at org.apache.maven.wagon.StreamWagon.put(StreamWagon.java:163)
	at org.sonatype.aether.connector.wagon.WagonRepositoryConnector$PutTask.run(WagonRepositoryConnector.java:825)
	at org.sonatype.aether.connector.wagon.WagonRepositoryConnector.put(WagonRepositoryConnector.java:465)
	... 34 more
Sending e-mails to: any23-dev@incubator.apache.org
channel stopped
Updating ANY23-54


Build failed in Jenkins: Any23-trunk #125

Posted by Apache Jenkins Server <je...@builds.apache.org>.
See <https://builds.apache.org/job/Any23-trunk/125/changes>

Changes:

[simonetripodi] added custom settings file to include Aduna Software external repo

------------------------------------------
[...truncated 821 lines...]
AU        core/src/main/java/org/apache/any23/rdf/package-info.java
A         core/src/main/java/org/apache/any23/rdf/Prefixes.java
A         core/src/main/java/org/apache/any23/rdf/PopularPrefixes.java
AU        core/src/main/java/org/apache/any23/rdf/RDFUtils.java
A         core/src/main/java/org/apache/any23/Any23.java
A         core/src/main/java/org/apache/any23/writer
A         core/src/main/java/org/apache/any23/writer/CountingTripleHandler.java
A         core/src/main/java/org/apache/any23/writer/LoggingTripleHandler.java
A         core/src/main/java/org/apache/any23/writer/WriterRegistry.java
A         core/src/main/java/org/apache/any23/writer/JSONWriter.java
A         core/src/main/java/org/apache/any23/writer/BenchmarkTripleHandler.java
A         core/src/main/java/org/apache/any23/writer/Writer.java
A         core/src/main/java/org/apache/any23/writer/RepositoryWriter.java
AU        core/src/main/java/org/apache/any23/writer/TripleHandlerException.java
A         core/src/main/java/org/apache/any23/writer/TurtleWriter.java
A         core/src/main/java/org/apache/any23/writer/CompositeTripleHandler.java
A         core/src/main/java/org/apache/any23/writer/TriXWriter.java
AU        core/src/main/java/org/apache/any23/writer/package-info.java
A         core/src/main/java/org/apache/any23/writer/FormatWriter.java
A         core/src/main/java/org/apache/any23/writer/RDFWriterTripleHandler.java
A         core/src/main/java/org/apache/any23/writer/ReportingTripleHandler.java
A         core/src/main/java/org/apache/any23/writer/NQuadsWriter.java
A         core/src/main/java/org/apache/any23/writer/URIListWriter.java
A         core/src/main/java/org/apache/any23/writer/RDFXMLWriter.java
A         core/src/main/java/org/apache/any23/writer/TripleHandler.java
A         core/src/main/java/org/apache/any23/writer/NTriplesWriter.java
A         core/src/main/java/org/apache/any23/util
A         core/src/main/java/org/apache/any23/util/FileUtils.java
A         core/src/main/java/org/apache/any23/util/LogUtils.java
A         core/src/main/java/org/apache/any23/util/URLUtils.java
AU        core/src/main/java/org/apache/any23/util/package-info.java
A         core/src/main/java/org/apache/any23/util/StringUtils.java
A         core/src/main/java/org/apache/any23/util/DiscoveryUtils.java
AU        core/src/main/java/org/apache/any23/util/MathUtils.java
A         core/src/main/java/org/apache/any23/util/StreamUtils.java
AU        core/src/main/java/org/apache/any23/util/ReaderInputStream.java
A         core/src/main/resources
A         core/src/main/resources/default-configuration.properties
A         core/src/main/resources/org
A         core/src/main/resources/org/apache
A         core/src/main/resources/org/apache/any23
A         core/src/main/resources/org/apache/any23/prefixes
AU        core/src/main/resources/org/apache/any23/prefixes/prefixes.properties
A         core/src/main/resources/org/apache/any23/mime
A         core/src/main/resources/org/apache/any23/mime/tika-config.xml
A         core/src/main/resources/org/apache/any23/mime/mimetypes.xml
A         core/src/main/resources/org/apache/any23/extractor
A         core/src/main/resources/org/apache/any23/extractor/microdata
A         core/src/main/resources/org/apache/any23/extractor/microdata/example-microdata.html
A         core/src/main/resources/org/apache/any23/extractor/html
A         core/src/main/resources/org/apache/any23/extractor/html/example-meta.html
A         core/src/main/resources/org/apache/any23/extractor/html/example-mf-species.html
A         core/src/main/resources/org/apache/any23/extractor/html/example-mf-xfn.html
A         core/src/main/resources/org/apache/any23/extractor/html/example-head-link.html
A         core/src/main/resources/org/apache/any23/extractor/html/example-mf-adr.html
A         core/src/main/resources/org/apache/any23/extractor/html/example-mf-hresume.html
A         core/src/main/resources/org/apache/any23/extractor/html/example-mf-hreview.html
A         core/src/main/resources/org/apache/any23/extractor/html/example-icbm.html
A         core/src/main/resources/org/apache/any23/extractor/html/example-mf-geo.html
A         core/src/main/resources/org/apache/any23/extractor/html/example-mf-hrecipe.html
A         core/src/main/resources/org/apache/any23/extractor/html/example-mf-hcalendar.html
A         core/src/main/resources/org/apache/any23/extractor/html/example-mf-hcard.html
A         core/src/main/resources/org/apache/any23/extractor/html/example-mf-hlisting.html
A         core/src/main/resources/org/apache/any23/extractor/html/example-script-turtle.html
A         core/src/main/resources/org/apache/any23/extractor/html/example-title.html
A         core/src/main/resources/org/apache/any23/extractor/html/example-mf-license.html
A         core/src/main/resources/org/apache/any23/extractor/csv
A         core/src/main/resources/org/apache/any23/extractor/csv/example-csv.csv
A         core/src/main/resources/org/apache/any23/extractor/rdf
A         core/src/main/resources/org/apache/any23/extractor/rdf/example-rdfxml.rdf
A         core/src/main/resources/org/apache/any23/extractor/rdf/example-nquads.nq
A         core/src/main/resources/org/apache/any23/extractor/rdf/example-ntriples.nt
A         core/src/main/resources/org/apache/any23/extractor/rdf/example-turtle.ttl
A         core/src/main/resources/org/apache/any23/extractor/rdf/example-trix.trx
A         core/src/main/resources/org/apache/any23/extractor/rdfa
A         core/src/main/resources/org/apache/any23/extractor/rdfa/rdfa.xslt
A         core/src/main/resources/org/apache/any23/extractor/rdfa/example-rdfa11.html
AU        core/pom.xml
AU        DISCLAIMER.txt
AU        pom.xml
AU        README.txt
 U        .
At revision 1297469
Parsing POMs
Modules changed, recalculating dependency graph
[Any23-trunk] $ /home/hudson/tools/java/latest1.6/bin/java -cp /home/hudson/hudson-slave/maven3-agent.jar:/home/hudson/tools/maven/latest/boot/plexus-classworlds-2.4.jar org.jvnet.hudson.maven3.agent.Maven3Main /home/hudson/tools/maven/latest /home/hudson/hudson-slave/slave.jar /home/hudson/hudson-slave/maven3-interceptor.jar 35102
<===[JENKINS REMOTING CAPACITY]===>channel started
   Executing Maven:  -B -f <https://builds.apache.org/job/Any23-trunk/ws/pom.xml> -Dmaven.repo.local=/home/hudson/hudson-slave/maven-repositories/0 --settings settings.xml clean deploy
[INFO] Scanning for projects...
[INFO] ------------------------------------------------------------------------
[INFO] Reactor Build Order:
[INFO] 
[INFO] Apache Any23 :: Parent
[INFO] Apache Any23 :: Core
[INFO] Apache Any23 :: Plugins :: Basic Crawler
[INFO] Apache Any23 :: Plugins :: HTML Scraper
[INFO] Apache Any23 :: Plugins :: Office Scraper
[INFO] Apache Any23 :: Plugins :: Integration Test
[INFO] Apache Any23 :: Service
[INFO]                                                                         
[INFO] ------------------------------------------------------------------------
[INFO] Building Apache Any23 :: Parent 0.7.0-incubating-SNAPSHOT
[INFO] ------------------------------------------------------------------------
Downloading: http://repo1.maven.org/maven2/org/codehaus/mojo/cobertura-maven-plugin/2.0/cobertura-maven-plugin-2.0.pom
Downloaded: http://repo1.maven.org/maven2/org/codehaus/mojo/cobertura-maven-plugin/2.0/cobertura-maven-plugin-2.0.pom (4 KB at 8.9 KB/sec)
Downloading: http://repo1.maven.org/maven2/org/codehaus/mojo/cobertura-maven-plugin/2.0/cobertura-maven-plugin-2.0.jar
Downloaded: http://repo1.maven.org/maven2/org/codehaus/mojo/cobertura-maven-plugin/2.0/cobertura-maven-plugin-2.0.jar (26 KB at 57.9 KB/sec)
[INFO] 
[INFO] --- maven-clean-plugin:2.4.1:clean (default-clean) @ any23-parent ---
log4j:WARN No appenders could be found for logger (org.apache.commons.beanutils.converters.BooleanConverter).
log4j:WARN Please initialize the log4j system properly.
[INFO] Downloading: http://repo1.maven.org/maven2/cobertura/cobertura/1.7/cobertura-1.7.pom

[INFO] --- cobertura-maven-plugin:2.0:clean (default) @ any23-parent ---
Downloaded: http://repo1.maven.org/maven2/cobertura/cobertura/1.7/cobertura-1.7.pom (854 B at 2.2 KB/sec)
Downloading: http://repo1.maven.org/maven2/asm/asm/2.1/asm-2.1.pom
Downloaded: http://repo1.maven.org/maven2/asm/asm/2.1/asm-2.1.pom (807 B at 1.6 KB/sec)
Downloading: http://repo1.maven.org/maven2/javancss/ccl/21.41/ccl-21.41.pom
Downloaded: http://repo1.maven.org/maven2/javancss/ccl/21.41/ccl-21.41.pom (145 B at 0.3 KB/sec)
Downloading: http://repo1.maven.org/maven2/javancss/javancss/21.41/javancss-21.41.pom
Downloaded: http://repo1.maven.org/maven2/javancss/javancss/21.41/javancss-21.41.pom (150 B at 0.3 KB/sec)
Downloading: http://repo1.maven.org/maven2/cobertura/cobertura-runtime/1.7/cobertura-runtime-1.7.pom
Downloaded: http://repo1.maven.org/maven2/cobertura/cobertura-runtime/1.7/cobertura-runtime-1.7.pom (2 KB at 2.7 KB/sec)
Downloading: http://repo1.maven.org/maven2/cobertura/cobertura/1.7/cobertura-1.7.jar
Downloading: http://repo1.maven.org/maven2/asm/asm/2.1/asm-2.1.jar
Downloading: http://repo1.maven.org/maven2/javancss/ccl/21.41/ccl-21.41.jar
Downloading: http://repo1.maven.org/maven2/javancss/javancss/21.41/javancss-21.41.jar
Downloaded: http://repo1.maven.org/maven2/asm/asm/2.1/asm-2.1.jar (33 KB at 31.1 KB/sec)
Downloaded: http://repo1.maven.org/maven2/cobertura/cobertura/1.7/cobertura-1.7.jar (92 KB at 69.3 KB/sec)
Downloaded: http://repo1.maven.org/maven2/javancss/ccl/21.41/ccl-21.41.jar (326 KB at 206.7 KB/sec)
Downloaded: http://repo1.maven.org/maven2/javancss/javancss/21.41/javancss-21.41.jar (101 KB at 55.4 KB/sec)
[INFO] 
[INFO] --- buildnumber-maven-plugin:1.0:create (default) @ any23-parent ---
[INFO] Checking for local modifications: skipped.
[INFO] Updating project files from SCM: skipped.
[INFO] Executing: /bin/sh -c cd <https://builds.apache.org/job/Any23-trunk/ws/> && svn --non-interactive info
[INFO] Working directory: <https://builds.apache.org/job/Any23-trunk/ws/>
[INFO] Storing buildNumber: 1297469 at timestamp: 1331040799812
[INFO] Executing: /bin/sh -c cd <https://builds.apache.org/job/Any23-trunk/ws/> && svn --non-interactive info
[INFO] Working directory: <https://builds.apache.org/job/Any23-trunk/ws/>
[INFO] Storing buildScmBranch: trunk
[INFO] 
[INFO] --- maven-remote-resources-plugin:1.2.1:process (default) @ any23-parent ---
Downloading: http://repo.aduna-software.org/maven2/releases/org/kohsuke/metainf-services/metainf-services/1.3/metainf-services-1.3.pom
Downloading: http://repo1.maven.org/maven2/org/kohsuke/metainf-services/metainf-services/1.3/metainf-services-1.3.pom
Downloaded: http://repo1.maven.org/maven2/org/kohsuke/metainf-services/metainf-services/1.3/metainf-services-1.3.pom (4 KB at 10.4 KB/sec)
Downloading: http://repo.aduna-software.org/maven2/releases/org/kohsuke/metainf-services/metainf-services/1.3/metainf-services-1.3.jar
Downloading: http://repo1.maven.org/maven2/org/kohsuke/metainf-services/metainf-services/1.3/metainf-services-1.3.jar
Downloaded: http://repo1.maven.org/maven2/org/kohsuke/metainf-services/metainf-services/1.3/metainf-services-1.3.jar (7 KB at 22.2 KB/sec)
Downloading: http://repo1.maven.org/maven2/org/jvnet/wagon-svn/wagon-svn/1.12/wagon-svn-1.12.pom
[INFO] 
[INFO] --- maven-site-plugin:3.0:attach-descriptor (attach-descriptor) @ any23-parent ---
Downloaded: http://repo1.maven.org/maven2/org/jvnet/wagon-svn/wagon-svn/1.12/wagon-svn-1.12.pom (3 KB at 6.9 KB/sec)
Downloading: http://repo1.maven.org/maven2/org/jvnet/wagon-svn/wagon-svn/1.12/wagon-svn-1.12.jar
Downloaded: http://repo1.maven.org/maven2/org/jvnet/wagon-svn/wagon-svn/1.12/wagon-svn-1.12.jar (20 KB at 63.1 KB/sec)
[INFO] [INFO] Installing <https://builds.apache.org/job/Any23-trunk/ws/pom.xml> to /home/hudson/hudson-slave/maven-repositories/0/org/apache/any23/any23-parent/0.7.0-incubating-SNAPSHOT/any23-parent-0.7.0-incubating-SNAPSHOT.pom

[INFO] --- maven-install-plugin:2.3.1:install (default-install) @ any23-parent ---
[INFO] Installing <https://builds.apache.org/job/Any23-trunk/ws/target/any23-parent-0.7.0-incubating-SNAPSHOT-site.xml> to /home/hudson/hudson-slave/maven-repositories/0/org/apache/any23/any23-parent/0.7.0-incubating-SNAPSHOT/any23-parent-0.7.0-incubating-SNAPSHOT-site.xml
[INFO] Downloading: https://repository.apache.org/content/repositories/snapshots/org/apache/any23/any23-parent/0.7.0-incubating-SNAPSHOT/maven-metadata.xml

[INFO] --- maven-deploy-plugin:2.5:deploy (default-deploy) @ any23-parent ---
Downloaded: https://repository.apache.org/content/repositories/snapshots/org/apache/any23/any23-parent/0.7.0-incubating-SNAPSHOT/maven-metadata.xml (852 B at 1.2 KB/sec)
Uploading: https://repository.apache.org/content/repositories/snapshots/org/apache/any23/any23-parent/0.7.0-incubating-SNAPSHOT/any23-parent-0.7.0-incubating-20120306.133324-28.pom
[JENKINS] Archiving <https://builds.apache.org/job/Any23-trunk/ws/pom.xml> to /home/hudson/hudson/jobs/Any23-trunk/modules/org.apache.any23$any23-parent/builds/2012-03-06_13-32-34/archive/org.apache.any23/any23-parent/0.7.0-incubating-SNAPSHOT/any23-parent-0.7.0-incubating-SNAPSHOT.pom
[JENKINS] Archiving <https://builds.apache.org/job/Any23-trunk/ws/target/any23-parent-0.7.0-incubating-SNAPSHOT-site.xml> to /home/hudson/hudson/jobs/Any23-trunk/modules/org.apache.any23$any23-parent/builds/2012-03-06_13-32-34/archive/org.apache.any23/any23-parent/0.7.0-incubating-SNAPSHOT/any23-parent-0.7.0-incubating-SNAPSHOT-site.xml
[INFO] ------------------------------------------------------------------------
[INFO] Reactor Summary:
[INFO] 
[INFO] Apache Any23 :: Parent ............................ FAILURE [37.375s]
[INFO] Apache Any23 :: Core .............................. SKIPPED
[INFO] Apache Any23 :: Plugins :: Basic Crawler .......... SKIPPED
[INFO] Apache Any23 :: Plugins :: HTML Scraper ........... SKIPPED
[INFO] Apache Any23 :: Plugins :: Office Scraper ......... SKIPPED
[INFO] Apache Any23 :: Plugins :: Integration Test ....... SKIPPED
[INFO] Apache Any23 :: Service ........................... SKIPPED
[INFO] ------------------------------------------------------------------------
[INFO] BUILD FAILURE
[INFO] ------------------------------------------------------------------------
[INFO] Total time: 42.095s
[INFO] Finished at: Tue Mar 06 13:33:29 UTC 2012
[INFO] Final Memory: 13M/80M
[INFO] ------------------------------------------------------------------------
mavenExecutionResult exceptions not empty
message : Failed to execute goal org.apache.maven.plugins:maven-deploy-plugin:2.5:deploy (default-deploy) on project any23-parent: Failed to deploy artifacts: Could not transfer artifact org.apache.any23:any23-parent:pom:0.7.0-incubating-20120306.133324-28 from/to apache.snapshots.https (https://repository.apache.org/content/repositories/snapshots): Failed to transfer file: https://repository.apache.org/content/repositories/snapshots/org/apache/any23/any23-parent/0.7.0-incubating-SNAPSHOT/any23-parent-0.7.0-incubating-20120306.133324-28.pom. Return code is: 401
cause : Failed to deploy artifacts: Could not transfer artifact org.apache.any23:any23-parent:pom:0.7.0-incubating-20120306.133324-28 from/to apache.snapshots.https (https://repository.apache.org/content/repositories/snapshots): Failed to transfer file: https://repository.apache.org/content/repositories/snapshots/org/apache/any23/any23-parent/0.7.0-incubating-SNAPSHOT/any23-parent-0.7.0-incubating-20120306.133324-28.pom. Return code is: 401
Stack trace : 
org.apache.maven.lifecycle.LifecycleExecutionException: Failed to execute goal org.apache.maven.plugins:maven-deploy-plugin:2.5:deploy (default-deploy) on project any23-parent: Failed to deploy artifacts: Could not transfer artifact org.apache.any23:any23-parent:pom:0.7.0-incubating-20120306.133324-28 from/to apache.snapshots.https (https://repository.apache.org/content/repositories/snapshots): Failed to transfer file: https://repository.apache.org/content/repositories/snapshots/org/apache/any23/any23-parent/0.7.0-incubating-SNAPSHOT/any23-parent-0.7.0-incubating-20120306.133324-28.pom. Return code is: 401
	at org.apache.maven.lifecycle.internal.MojoExecutor.execute(MojoExecutor.java:217)
	at org.apache.maven.lifecycle.internal.MojoExecutor.execute(MojoExecutor.java:153)
	at org.apache.maven.lifecycle.internal.MojoExecutor.execute(MojoExecutor.java:145)
	at org.apache.maven.lifecycle.internal.LifecycleModuleBuilder.buildProject(LifecycleModuleBuilder.java:84)
	at org.apache.maven.lifecycle.internal.LifecycleModuleBuilder.buildProject(LifecycleModuleBuilder.java:59)
	at org.apache.maven.lifecycle.internal.LifecycleStarter.singleThreadedBuild(LifecycleStarter.java:183)
	at org.apache.maven.lifecycle.internal.LifecycleStarter.execute(LifecycleStarter.java:161)
	at org.apache.maven.DefaultMaven.doExecute(DefaultMaven.java:319)
	at org.apache.maven.DefaultMaven.execute(DefaultMaven.java:156)
	at org.jvnet.hudson.maven3.launcher.Maven3Launcher.main(Maven3Launcher.java:79)
	at sun.reflect.NativeMethodAccessorImpl.invoke0(Native Method)
	at sun.reflect.NativeMethodAccessorImpl.invoke(NativeMethodAccessorImpl.java:39)
	at sun.reflect.DelegatingMethodAccessorImpl.invoke(DelegatingMethodAccessorImpl.java:25)
	at java.lang.reflect.Method.invoke(Method.java:597)
	at org.codehaus.plexus.classworlds.launcher.Launcher.launchStandard(Launcher.java:329)
	at org.codehaus.plexus.classworlds.launcher.Launcher.launch(Launcher.java:239)
	at org.jvnet.hudson.maven3.agent.Maven3Main.launch(Maven3Main.java:158)
	at hudson.maven.Maven3Builder.call(Maven3Builder.java:104)
	at hudson.maven.Maven3Builder.call(Maven3Builder.java:70)
	at hudson.remoting.UserRequest.perform(UserRequest.java:118)
	at hudson.remoting.UserRequest.perform(UserRequest.java:48)
	at hudson.remoting.Request$2.run(Request.java:287)
	at hudson.remoting.InterceptingExecutorService$1.call(InterceptingExecutorService.java:72)
	at java.util.concurrent.FutureTask$Sync.innerRun(FutureTask.java:303)
	at java.util.concurrent.FutureTask.run(FutureTask.java:138)
	at java.util.concurrent.ThreadPoolExecutor$Worker.runTask(ThreadPoolExecutor.java:886)
	at java.util.concurrent.ThreadPoolExecutor$Worker.run(ThreadPoolExecutor.java:908)
	at java.lang.Thread.run(Thread.java:662)
Caused by: org.apache.maven.plugin.MojoExecutionException: Failed to deploy artifacts: Could not transfer artifact org.apache.any23:any23-parent:pom:0.7.0-incubating-20120306.133324-28 from/to apache.snapshots.https (https://repository.apache.org/content/repositories/snapshots): Failed to transfer file: https://repository.apache.org/content/repositories/snapshots/org/apache/any23/any23-parent/0.7.0-incubating-SNAPSHOT/any23-parent-0.7.0-incubating-20120306.133324-28.pom. Return code is: 401
	at org.apache.maven.plugin.deploy.DeployMojo.execute(DeployMojo.java:189)
	at org.apache.maven.plugin.DefaultBuildPluginManager.executeMojo(DefaultBuildPluginManager.java:101)
	at org.apache.maven.lifecycle.internal.MojoExecutor.execute(MojoExecutor.java:209)
	... 27 more
Caused by: org.apache.maven.artifact.deployer.ArtifactDeploymentException: Failed to deploy artifacts: Could not transfer artifact org.apache.any23:any23-parent:pom:0.7.0-incubating-20120306.133324-28 from/to apache.snapshots.https (https://repository.apache.org/content/repositories/snapshots): Failed to transfer file: https://repository.apache.org/content/repositories/snapshots/org/apache/any23/any23-parent/0.7.0-incubating-SNAPSHOT/any23-parent-0.7.0-incubating-20120306.133324-28.pom. Return code is: 401
	at org.apache.maven.artifact.deployer.DefaultArtifactDeployer.deploy(DefaultArtifactDeployer.java:141)
	at org.apache.maven.plugin.deploy.DeployMojo.execute(DeployMojo.java:148)
	... 29 more
Caused by: org.sonatype.aether.deployment.DeploymentException: Failed to deploy artifacts: Could not transfer artifact org.apache.any23:any23-parent:pom:0.7.0-incubating-20120306.133324-28 from/to apache.snapshots.https (https://repository.apache.org/content/repositories/snapshots): Failed to transfer file: https://repository.apache.org/content/repositories/snapshots/org/apache/any23/any23-parent/0.7.0-incubating-SNAPSHOT/any23-parent-0.7.0-incubating-20120306.133324-28.pom. Return code is: 401
	at org.sonatype.aether.impl.internal.DefaultDeployer.deploy(DefaultDeployer.java:284)
	at org.sonatype.aether.impl.internal.DefaultDeployer.deploy(DefaultDeployer.java:215)
	at org.sonatype.aether.impl.internal.DefaultRepositorySystem.deploy(DefaultRepositorySystem.java:480)
	at org.apache.maven.artifact.deployer.DefaultArtifactDeployer.deploy(DefaultArtifactDeployer.java:137)
	... 30 more
Caused by: org.sonatype.aether.transfer.ArtifactTransferException: Could not transfer artifact org.apache.any23:any23-parent:pom:0.7.0-incubating-20120306.133324-28 from/to apache.snapshots.https (https://repository.apache.org/content/repositories/snapshots): Failed to transfer file: https://repository.apache.org/content/repositories/snapshots/org/apache/any23/any23-parent/0.7.0-incubating-SNAPSHOT/any23-parent-0.7.0-incubating-20120306.133324-28.pom. Return code is: 401
	at org.sonatype.aether.connector.wagon.WagonRepositoryConnector$4.wrap(WagonRepositoryConnector.java:949)
	at org.sonatype.aether.connector.wagon.WagonRepositoryConnector$4.wrap(WagonRepositoryConnector.java:940)
	at org.sonatype.aether.connector.wagon.WagonRepositoryConnector$PutTask.flush(WagonRepositoryConnector.java:864)
	at org.sonatype.aether.connector.wagon.WagonRepositoryConnector.put(WagonRepositoryConnector.java:466)
	at org.sonatype.aether.impl.internal.DefaultDeployer.deploy(DefaultDeployer.java:278)
	... 33 more
Caused by: org.apache.maven.wagon.TransferFailedException: Failed to transfer file: https://repository.apache.org/content/repositories/snapshots/org/apache/any23/any23-parent/0.7.0-incubating-SNAPSHOT/any23-parent-0.7.0-incubating-20120306.133324-28.pom. Return code is: 401
	at org.apache.maven.wagon.providers.http.LightweightHttpWagon.finishPutTransfer(LightweightHttpWagon.java:205)
	at org.apache.maven.wagon.AbstractWagon.putTransfer(AbstractWagon.java:413)
	at org.apache.maven.wagon.AbstractWagon.transfer(AbstractWagon.java:392)
	at org.apache.maven.wagon.AbstractWagon.putTransfer(AbstractWagon.java:365)
	at org.apache.maven.wagon.StreamWagon.put(StreamWagon.java:163)
	at org.sonatype.aether.connector.wagon.WagonRepositoryConnector$PutTask.run(WagonRepositoryConnector.java:825)
	at org.sonatype.aether.connector.wagon.WagonRepositoryConnector.put(WagonRepositoryConnector.java:465)
	... 34 more
Sending e-mails to: any23-dev@incubator.apache.org
channel stopped


Build failed in Jenkins: Any23-trunk #124

Posted by Apache Jenkins Server <je...@builds.apache.org>.
See <https://builds.apache.org/job/Any23-trunk/124/>

------------------------------------------
[...truncated 859 lines...]
A         core/src/main/resources/org/apache
A         core/src/main/resources/org/apache/any23
A         core/src/main/resources/org/apache/any23/prefixes
AU        core/src/main/resources/org/apache/any23/prefixes/prefixes.properties
A         core/src/main/resources/org/apache/any23/mime
A         core/src/main/resources/org/apache/any23/mime/tika-config.xml
A         core/src/main/resources/org/apache/any23/mime/mimetypes.xml
A         core/src/main/resources/org/apache/any23/extractor
A         core/src/main/resources/org/apache/any23/extractor/microdata
A         core/src/main/resources/org/apache/any23/extractor/microdata/example-microdata.html
A         core/src/main/resources/org/apache/any23/extractor/html
A         core/src/main/resources/org/apache/any23/extractor/html/example-meta.html
A         core/src/main/resources/org/apache/any23/extractor/html/example-mf-species.html
A         core/src/main/resources/org/apache/any23/extractor/html/example-mf-xfn.html
A         core/src/main/resources/org/apache/any23/extractor/html/example-head-link.html
A         core/src/main/resources/org/apache/any23/extractor/html/example-mf-adr.html
A         core/src/main/resources/org/apache/any23/extractor/html/example-mf-hresume.html
A         core/src/main/resources/org/apache/any23/extractor/html/example-mf-hreview.html
A         core/src/main/resources/org/apache/any23/extractor/html/example-icbm.html
A         core/src/main/resources/org/apache/any23/extractor/html/example-mf-geo.html
A         core/src/main/resources/org/apache/any23/extractor/html/example-mf-hrecipe.html
A         core/src/main/resources/org/apache/any23/extractor/html/example-mf-hcalendar.html
A         core/src/main/resources/org/apache/any23/extractor/html/example-mf-hcard.html
A         core/src/main/resources/org/apache/any23/extractor/html/example-mf-hlisting.html
A         core/src/main/resources/org/apache/any23/extractor/html/example-script-turtle.html
A         core/src/main/resources/org/apache/any23/extractor/html/example-title.html
A         core/src/main/resources/org/apache/any23/extractor/html/example-mf-license.html
A         core/src/main/resources/org/apache/any23/extractor/csv
A         core/src/main/resources/org/apache/any23/extractor/csv/example-csv.csv
A         core/src/main/resources/org/apache/any23/extractor/rdf
A         core/src/main/resources/org/apache/any23/extractor/rdf/example-rdfxml.rdf
A         core/src/main/resources/org/apache/any23/extractor/rdf/example-nquads.nq
A         core/src/main/resources/org/apache/any23/extractor/rdf/example-ntriples.nt
A         core/src/main/resources/org/apache/any23/extractor/rdf/example-turtle.ttl
A         core/src/main/resources/org/apache/any23/extractor/rdf/example-trix.trx
A         core/src/main/resources/org/apache/any23/extractor/rdfa
A         core/src/main/resources/org/apache/any23/extractor/rdfa/rdfa.xslt
A         core/src/main/resources/org/apache/any23/extractor/rdfa/example-rdfa11.html
AU        core/pom.xml
AU        DISCLAIMER.txt
AU        pom.xml
AU        README.txt
 U        .
At revision 1297356
no change for https://svn.apache.org/repos/asf/incubator/any23/trunk since the previous build
Parsing POMs
Modules changed, recalculating dependency graph
[Any23-trunk] $ /home/hudson/tools/java/latest1.6/bin/java -cp /home/jenkins/jenkins-slave/maven3-agent.jar:/home/hudson/tools/maven/latest/boot/plexus-classworlds-2.4.jar org.jvnet.hudson.maven3.agent.Maven3Main /home/hudson/tools/maven/latest /home/jenkins/jenkins-slave/slave.jar /home/jenkins/jenkins-slave/maven3-interceptor.jar 42081
<===[JENKINS REMOTING CAPACITY]===>channel started
   Executing Maven:  -B -f <https://builds.apache.org/job/Any23-trunk/ws/pom.xml> -Dmaven.repo.local=/home/jenkins/jenkins-slave/maven-repositories/0 install
[INFO] Scanning for projects...
[INFO] ------------------------------------------------------------------------
[INFO] Reactor Build Order:
[INFO] 
[INFO] Apache Any23 :: Parent
[INFO] Apache Any23 :: Core
[INFO] Apache Any23 :: Plugins :: Basic Crawler
[INFO] Apache Any23 :: Plugins :: HTML Scraper
[INFO] Apache Any23 :: Plugins :: Office Scraper
[INFO] Apache Any23 :: Plugins :: Integration Test
[INFO] Apache Any23 :: Service
[INFO]                                                                         
[INFO] ------------------------------------------------------------------------
[INFO] Building Apache Any23 :: Parent 0.7.0-incubating-SNAPSHOT
[INFO] ------------------------------------------------------------------------
Downloading: http://repo1.maven.org/maven2/org/codehaus/mojo/cobertura-maven-plugin/2.0/cobertura-maven-plugin-2.0.pom
Downloaded: http://repo1.maven.org/maven2/org/codehaus/mojo/cobertura-maven-plugin/2.0/cobertura-maven-plugin-2.0.pom (4 KB at 7.0 KB/sec)
Downloading: http://repo1.maven.org/maven2/org/codehaus/mojo/cobertura-maven-plugin/2.0/cobertura-maven-plugin-2.0.jar
Downloaded: http://repo1.maven.org/maven2/org/codehaus/mojo/cobertura-maven-plugin/2.0/cobertura-maven-plugin-2.0.jar (26 KB at 60.5 KB/sec)
[INFO] 
[INFO] --- buildnumber-maven-plugin:1.0:create (default) @ any23-parent ---
[INFO] Checking for local modifications: skipped.
[INFO] Updating project files from SCM: skipped.
[INFO] Executing: /bin/sh -c cd <https://builds.apache.org/job/Any23-trunk/ws/> && svn --non-interactive info
[INFO] Working directory: <https://builds.apache.org/job/Any23-trunk/ws/>
[INFO] Storing buildNumber: 1296871 at timestamp: 1331017349011
[INFO] Executing: /bin/sh -c cd <https://builds.apache.org/job/Any23-trunk/ws/> && svn --non-interactive info
[INFO] Working directory: <https://builds.apache.org/job/Any23-trunk/ws/>
[INFO] Storing buildScmBranch: trunk
log4j:WARN No appenders could be found for logger (org.apache.commons.beanutils.converters.BooleanConverter).
log4j:WARN Please initialize the log4j system properly.
[INFO] 
[INFO] --- maven-remote-resources-plugin:1.2.1:process (default) @ any23-parent ---
Downloading: http://repo1.maven.org/maven2/org/kohsuke/metainf-services/metainf-services/1.3/metainf-services-1.3.pom
Downloaded: http://repo1.maven.org/maven2/org/kohsuke/metainf-services/metainf-services/1.3/metainf-services-1.3.pom (4 KB at 8.9 KB/sec)
Downloading: http://repo1.maven.org/maven2/org/kohsuke/metainf-services/metainf-services/1.3/metainf-services-1.3.jar
Downloaded: http://repo1.maven.org/maven2/org/kohsuke/metainf-services/metainf-services/1.3/metainf-services-1.3.jar (7 KB at 15.3 KB/sec)
[INFO] Downloading: http://repo1.maven.org/maven2/org/jvnet/wagon-svn/wagon-svn/1.12/wagon-svn-1.12.pom

[INFO] --- maven-site-plugin:3.0:attach-descriptor (attach-descriptor) @ any23-parent ---
Downloaded: http://repo1.maven.org/maven2/org/jvnet/wagon-svn/wagon-svn/1.12/wagon-svn-1.12.pom (3 KB at 7.4 KB/sec)
Downloading: http://repo1.maven.org/maven2/org/jvnet/hudson/svnkit/svnkit/1.1.4-hudson-4/svnkit-1.1.4-hudson-4.pom
Downloaded: http://repo1.maven.org/maven2/org/jvnet/hudson/svnkit/svnkit/1.1.4-hudson-4/svnkit-1.1.4-hudson-4.pom (2 KB at 2.3 KB/sec)
Downloading: http://repo1.maven.org/maven2/org/jvnet/wagon-svn/wagon-svn/1.12/wagon-svn-1.12.jar
Downloading: http://repo1.maven.org/maven2/org/jvnet/hudson/svnkit/svnkit/1.1.4-hudson-4/svnkit-1.1.4-hudson-4.jar
Downloaded: http://repo1.maven.org/maven2/org/jvnet/wagon-svn/wagon-svn/1.12/wagon-svn-1.12.jar (20 KB at 29.6 KB/sec)
Downloaded: http://repo1.maven.org/maven2/org/jvnet/hudson/svnkit/svnkit/1.1.4-hudson-4/svnkit-1.1.4-hudson-4.jar (1195 KB at 1307.0 KB/sec)
[INFO] [INFO] Installing <https://builds.apache.org/job/Any23-trunk/ws/pom.xml> to /home/jenkins/jenkins-slave/maven-repositories/0/org/apache/any23/any23-parent/0.7.0-incubating-SNAPSHOT/any23-parent-0.7.0-incubating-SNAPSHOT.pom
[INFO] Installing <https://builds.apache.org/job/Any23-trunk/ws/target/any23-parent-0.7.0-incubating-SNAPSHOT-site.xml> to /home/jenkins/jenkins-slave/maven-repositories/0/org/apache/any23/any23-parent/0.7.0-incubating-SNAPSHOT/any23-parent-0.7.0-incubating-SNAPSHOT-site.xml

[INFO] --- maven-install-plugin:2.3.1:install (default-install) @ any23-parent ---
[JENKINS] Archiving <https://builds.apache.org/job/Any23-trunk/ws/pom.xml> to /home/hudson/hudson/jobs/Any23-trunk/modules/org.apache.any23$any23-parent/builds/2012-03-06_07-01-55/archive/org.apache.any23/any23-parent/0.7.0-incubating-SNAPSHOT/any23-parent-0.7.0-incubating-SNAPSHOT.pom
[JENKINS] Archiving <https://builds.apache.org/job/Any23-trunk/ws/target/any23-parent-0.7.0-incubating-SNAPSHOT-site.xml> to /home/hudson/hudson/jobs/Any23-trunk/modules/org.apache.any23$any23-parent/builds/2012-03-06_07-01-55/archive/org.apache.any23/any23-parent/0.7.0-incubating-SNAPSHOT/any23-parent-0.7.0-incubating-SNAPSHOT-site.xml
[INFO]                                                                         
[INFO] ------------------------------------------------------------------------
[INFO] Building Apache Any23 :: Core 0.7.0-incubating-SNAPSHOT
[INFO] ------------------------------------------------------------------------
Downloading: http://repo1.maven.org/maven2/org/apache/maven/plugins/maven-assembly-plugin/2.2.2/maven-assembly-plugin-2.2.2.pom
Downloaded: http://repo1.maven.org/maven2/org/apache/maven/plugins/maven-assembly-plugin/2.2.2/maven-assembly-plugin-2.2.2.pom (16 KB at 43.3 KB/sec)
Downloading: http://repo1.maven.org/maven2/org/apache/maven/plugins/maven-assembly-plugin/2.2.2/maven-assembly-plugin-2.2.2.jar
Downloaded: http://repo1.maven.org/maven2/org/apache/maven/plugins/maven-assembly-plugin/2.2.2/maven-assembly-plugin-2.2.2.jar (216 KB at 286.3 KB/sec)
Downloading: http://repo1.maven.org/maven2/net/sourceforge/nekohtml/nekohtml/1.9.14/nekohtml-1.9.14.pom
Downloaded: http://repo1.maven.org/maven2/net/sourceforge/nekohtml/nekohtml/1.9.14/nekohtml-1.9.14.pom (2 KB at 2.8 KB/sec)
Downloading: http://repo1.maven.org/maven2/org/openrdf/sesame/sesame-model/2.6.1/sesame-model-2.6.1.pom
[WARNING] The POM for org.openrdf.sesame:sesame-model:jar:2.6.1 is missing, no dependency information available
Downloading: http://repo1.maven.org/maven2/org/openrdf/sesame/sesame-rio-api/2.6.1/sesame-rio-api-2.6.1.pom
[WARNING] The POM for org.openrdf.sesame:sesame-rio-api:jar:2.6.1 is missing, no dependency information available
Downloading: http://repo1.maven.org/maven2/org/openrdf/sesame/sesame-rio-turtle/2.6.1/sesame-rio-turtle-2.6.1.pom
[WARNING] The POM for org.openrdf.sesame:sesame-rio-turtle:jar:2.6.1 is missing, no dependency information available
Downloading: http://repo1.maven.org/maven2/org/openrdf/sesame/sesame-rio-rdfxml/2.6.1/sesame-rio-rdfxml-2.6.1.pom
[WARNING] The POM for org.openrdf.sesame:sesame-rio-rdfxml:jar:2.6.1 is missing, no dependency information available
Downloading: http://repo1.maven.org/maven2/org/openrdf/sesame/sesame-rio-ntriples/2.6.1/sesame-rio-ntriples-2.6.1.pom
[WARNING] The POM for org.openrdf.sesame:sesame-rio-ntriples:jar:2.6.1 is missing, no dependency information available
Downloading: http://repo1.maven.org/maven2/org/openrdf/sesame/sesame-rio-trix/2.6.1/sesame-rio-trix-2.6.1.pom
[WARNING] The POM for org.openrdf.sesame:sesame-rio-trix:jar:2.6.1 is missing, no dependency information available
Downloading: http://repo1.maven.org/maven2/org/openrdf/sesame/sesame-repository-sail/2.6.1/sesame-repository-sail-2.6.1.pom
[WARNING] The POM for org.openrdf.sesame:sesame-repository-sail:jar:2.6.1 is missing, no dependency information available
Downloading: http://repo1.maven.org/maven2/org/openrdf/sesame/sesame-sail-memory/2.6.1/sesame-sail-memory-2.6.1.pom
[WARNING] The POM for org.openrdf.sesame:sesame-sail-memory:jar:2.6.1 is missing, no dependency information available
Downloading: http://repo1.maven.org/maven2/org/openrdf/sesame/sesame-repository-api/2.6.1/sesame-repository-api-2.6.1.pom
[WARNING] The POM for org.openrdf.sesame:sesame-repository-api:jar:2.6.1 is missing, no dependency information available
Downloading: http://repo1.maven.org/maven2/info/aduna/commons/aduna-commons-xml/2.7.0/aduna-commons-xml-2.7.0.pom
[WARNING] The POM for info.aduna.commons:aduna-commons-xml:jar:2.7.0 is missing, no dependency information available
Downloading: http://repo1.maven.org/maven2/info/aduna/commons/aduna-commons-text/2.7.0/aduna-commons-text-2.7.0.pom
[WARNING] The POM for info.aduna.commons:aduna-commons-text:jar:2.7.0 is missing, no dependency information available
Downloading: http://repo1.maven.org/maven2/info/aduna/commons/aduna-commons-net/2.7.0/aduna-commons-net-2.7.0.pom
[WARNING] The POM for info.aduna.commons:aduna-commons-net:jar:2.7.0 is missing, no dependency information available
Downloading: http://repo1.maven.org/maven2/info/aduna/commons/aduna-commons-lang/2.9.0/aduna-commons-lang-2.9.0.pom
[WARNING] The POM for info.aduna.commons:aduna-commons-lang:jar:2.9.0 is missing, no dependency information available
Downloading: http://repo1.maven.org/maven2/info/aduna/commons/aduna-commons-iteration/2.10.0/aduna-commons-iteration-2.10.0.pom
[WARNING] The POM for info.aduna.commons:aduna-commons-iteration:jar:2.10.0 is missing, no dependency information available
Downloading: http://repo1.maven.org/maven2/info/aduna/commons/aduna-commons-io/2.10.0/aduna-commons-io-2.10.0.pom
[WARNING] The POM for info.aduna.commons:aduna-commons-io:jar:2.10.0 is missing, no dependency information available
Downloading: http://repo1.maven.org/maven2/info/aduna/commons/aduna-commons-concurrent/2.7.0/aduna-commons-concurrent-2.7.0.pom
[WARNING] The POM for info.aduna.commons:aduna-commons-concurrent:jar:2.7.0 is missing, no dependency information available
Downloading: http://repo1.maven.org/maven2/org/apache/commons/commons-csv/1.0-SNAPSHOT-rev1148315/commons-csv-1.0-SNAPSHOT-rev1148315.pom
[WARNING] The POM for org.apache.commons:commons-csv:jar:1.0-SNAPSHOT-rev1148315 is missing, no dependency information available
Downloading: http://repo1.maven.org/maven2/net/sourceforge/nekohtml/nekohtml/1.9.14/nekohtml-1.9.14.jar
Downloading: http://repo1.maven.org/maven2/org/apache/pdfbox/pdfbox/0.8.0-incubating/pdfbox-0.8.0-incubating.jar
Downloading: http://repo1.maven.org/maven2/org/apache/pdfbox/fontbox/0.8.0-incubator/fontbox-0.8.0-incubator.jar
Downloading: http://repo1.maven.org/maven2/org/apache/pdfbox/jempbox/0.8.0-incubator/jempbox-0.8.0-incubator.jar
Downloading: http://repo1.maven.org/maven2/org/openrdf/sesame/sesame-model/2.6.1/sesame-model-2.6.1.jar
Downloading: http://repo1.maven.org/maven2/org/openrdf/sesame/sesame-rio-api/2.6.1/sesame-rio-api-2.6.1.jar
Downloaded: http://repo1.maven.org/maven2/net/sourceforge/nekohtml/nekohtml/1.9.14/nekohtml-1.9.14.jar (122 KB at 71.7 KB/sec)
Downloading: http://repo1.maven.org/maven2/org/openrdf/sesame/sesame-rio-turtle/2.6.1/sesame-rio-turtle-2.6.1.jar
Downloaded: http://repo1.maven.org/maven2/org/apache/pdfbox/jempbox/0.8.0-incubator/jempbox-0.8.0-incubator.jar (50 KB at 28.8 KB/sec)
Downloading: http://repo1.maven.org/maven2/org/openrdf/sesame/sesame-rio-rdfxml/2.6.1/sesame-rio-rdfxml-2.6.1.jar
Downloaded: http://repo1.maven.org/maven2/org/apache/pdfbox/fontbox/0.8.0-incubator/fontbox-0.8.0-incubator.jar (73 KB at 37.4 KB/sec)
Downloading: http://repo1.maven.org/maven2/org/openrdf/sesame/sesame-rio-ntriples/2.6.1/sesame-rio-ntriples-2.6.1.jar
Downloading: http://repo1.maven.org/maven2/org/openrdf/sesame/sesame-rio-trix/2.6.1/sesame-rio-trix-2.6.1.jar
Downloading: http://repo1.maven.org/maven2/org/openrdf/sesame/sesame-repository-sail/2.6.1/sesame-repository-sail-2.6.1.jar
Downloaded: http://repo1.maven.org/maven2/org/apache/pdfbox/pdfbox/0.8.0-incubating/pdfbox-0.8.0-incubating.jar (4548 KB at 1673.7 KB/sec)
Downloading: http://repo1.maven.org/maven2/org/openrdf/sesame/sesame-sail-memory/2.6.1/sesame-sail-memory-2.6.1.jar
Downloading: http://repo1.maven.org/maven2/org/openrdf/sesame/sesame-repository-api/2.6.1/sesame-repository-api-2.6.1.jar
Downloading: http://repo1.maven.org/maven2/info/aduna/commons/aduna-commons-xml/2.7.0/aduna-commons-xml-2.7.0.jar
Downloading: http://repo1.maven.org/maven2/info/aduna/commons/aduna-commons-text/2.7.0/aduna-commons-text-2.7.0.jar
Downloading: http://repo1.maven.org/maven2/info/aduna/commons/aduna-commons-net/2.7.0/aduna-commons-net-2.7.0.jar
Downloading: http://repo1.maven.org/maven2/info/aduna/commons/aduna-commons-lang/2.9.0/aduna-commons-lang-2.9.0.jar
Downloading: http://repo1.maven.org/maven2/info/aduna/commons/aduna-commons-iteration/2.10.0/aduna-commons-iteration-2.10.0.jar
Downloading: http://repo1.maven.org/maven2/info/aduna/commons/aduna-commons-io/2.10.0/aduna-commons-io-2.10.0.jar
Downloading: http://repo1.maven.org/maven2/info/aduna/commons/aduna-commons-concurrent/2.7.0/aduna-commons-concurrent-2.7.0.jar
Downloading: http://repo1.maven.org/maven2/org/apache/commons/commons-csv/1.0-SNAPSHOT-rev1148315/commons-csv-1.0-SNAPSHOT-rev1148315.jar
[JENKINS] Archiving <https://builds.apache.org/job/Any23-trunk/ws/core/pom.xml> to /home/hudson/hudson/jobs/Any23-trunk/modules/org.apache.any23$any23-core/builds/2012-03-06_07-01-55/archive/org.apache.any23/any23-core/0.7.0-incubating-SNAPSHOT/any23-core-0.7.0-incubating-SNAPSHOT.pom
[INFO] ------------------------------------------------------------------------
[INFO] Reactor Summary:
[INFO] 
[INFO] Apache Any23 :: Parent ............................ SUCCESS [1:22.629s]
[INFO] Apache Any23 :: Core .............................. FAILURE [12.529s]
[INFO] Apache Any23 :: Plugins :: Basic Crawler .......... SKIPPED
[INFO] Apache Any23 :: Plugins :: HTML Scraper ........... SKIPPED
[INFO] Apache Any23 :: Plugins :: Office Scraper ......... SKIPPED
[INFO] Apache Any23 :: Plugins :: Integration Test ....... SKIPPED
[INFO] Apache Any23 :: Service ........................... SKIPPED
[INFO] ------------------------------------------------------------------------
[INFO] BUILD FAILURE
[INFO] ------------------------------------------------------------------------
[INFO] Total time: 1:47.501s
[INFO] Finished at: Tue Mar 06 07:04:07 UTC 2012
[INFO] Final Memory: 12M/67M
[INFO] ------------------------------------------------------------------------
mavenExecutionResult exceptions not empty
message : Failed to execute goal on project any23-core: Could not resolve dependencies for project org.apache.any23:any23-core:jar:0.7.0-incubating-SNAPSHOT: The following artifacts could not be resolved: org.openrdf.sesame:sesame-model:jar:2.6.1, org.openrdf.sesame:sesame-rio-api:jar:2.6.1, org.openrdf.sesame:sesame-rio-turtle:jar:2.6.1, org.openrdf.sesame:sesame-rio-rdfxml:jar:2.6.1, org.openrdf.sesame:sesame-rio-ntriples:jar:2.6.1, org.openrdf.sesame:sesame-rio-trix:jar:2.6.1, org.openrdf.sesame:sesame-repository-sail:jar:2.6.1, org.openrdf.sesame:sesame-sail-memory:jar:2.6.1, org.openrdf.sesame:sesame-repository-api:jar:2.6.1, info.aduna.commons:aduna-commons-xml:jar:2.7.0, info.aduna.commons:aduna-commons-text:jar:2.7.0, info.aduna.commons:aduna-commons-net:jar:2.7.0, info.aduna.commons:aduna-commons-lang:jar:2.9.0, info.aduna.commons:aduna-commons-iteration:jar:2.10.0, info.aduna.commons:aduna-commons-io:jar:2.10.0, info.aduna.commons:aduna-commons-concurrent:jar:2.7.0, org.apache.commons:commons-csv:jar:1.0-SNAPSHOT-rev1148315: Could not find artifact org.openrdf.sesame:sesame-model:jar:2.6.1 in central (http://repo1.maven.org/maven2)
cause : Could not resolve dependencies for project org.apache.any23:any23-core:jar:0.7.0-incubating-SNAPSHOT: The following artifacts could not be resolved: org.openrdf.sesame:sesame-model:jar:2.6.1, org.openrdf.sesame:sesame-rio-api:jar:2.6.1, org.openrdf.sesame:sesame-rio-turtle:jar:2.6.1, org.openrdf.sesame:sesame-rio-rdfxml:jar:2.6.1, org.openrdf.sesame:sesame-rio-ntriples:jar:2.6.1, org.openrdf.sesame:sesame-rio-trix:jar:2.6.1, org.openrdf.sesame:sesame-repository-sail:jar:2.6.1, org.openrdf.sesame:sesame-sail-memory:jar:2.6.1, org.openrdf.sesame:sesame-repository-api:jar:2.6.1, info.aduna.commons:aduna-commons-xml:jar:2.7.0, info.aduna.commons:aduna-commons-text:jar:2.7.0, info.aduna.commons:aduna-commons-net:jar:2.7.0, info.aduna.commons:aduna-commons-lang:jar:2.9.0, info.aduna.commons:aduna-commons-iteration:jar:2.10.0, info.aduna.commons:aduna-commons-io:jar:2.10.0, info.aduna.commons:aduna-commons-concurrent:jar:2.7.0, org.apache.commons:commons-csv:jar:1.0-SNAPSHOT-rev1148315: Could not find artifact org.openrdf.sesame:sesame-model:jar:2.6.1 in central (http://repo1.maven.org/maven2)
Stack trace : 
org.apache.maven.lifecycle.LifecycleExecutionException: Failed to execute goal on project any23-core: Could not resolve dependencies for project org.apache.any23:any23-core:jar:0.7.0-incubating-SNAPSHOT: The following artifacts could not be resolved: org.openrdf.sesame:sesame-model:jar:2.6.1, org.openrdf.sesame:sesame-rio-api:jar:2.6.1, org.openrdf.sesame:sesame-rio-turtle:jar:2.6.1, org.openrdf.sesame:sesame-rio-rdfxml:jar:2.6.1, org.openrdf.sesame:sesame-rio-ntriples:jar:2.6.1, org.openrdf.sesame:sesame-rio-trix:jar:2.6.1, org.openrdf.sesame:sesame-repository-sail:jar:2.6.1, org.openrdf.sesame:sesame-sail-memory:jar:2.6.1, org.openrdf.sesame:sesame-repository-api:jar:2.6.1, info.aduna.commons:aduna-commons-xml:jar:2.7.0, info.aduna.commons:aduna-commons-text:jar:2.7.0, info.aduna.commons:aduna-commons-net:jar:2.7.0, info.aduna.commons:aduna-commons-lang:jar:2.9.0, info.aduna.commons:aduna-commons-iteration:jar:2.10.0, info.aduna.commons:aduna-commons-io:jar:2.10.0, info.aduna.commons:aduna-commons-concurrent:jar:2.7.0, org.apache.commons:commons-csv:jar:1.0-SNAPSHOT-rev1148315: Could not find artifact org.openrdf.sesame:sesame-model:jar:2.6.1 in central (http://repo1.maven.org/maven2)
	at org.apache.maven.lifecycle.internal.LifecycleDependencyResolver.getDependencies(LifecycleDependencyResolver.java:196)
	at org.apache.maven.lifecycle.internal.LifecycleDependencyResolver.resolveProjectDependencies(LifecycleDependencyResolver.java:108)
	at org.apache.maven.lifecycle.internal.MojoExecutor.ensureDependenciesAreResolved(MojoExecutor.java:258)
	at org.apache.maven.lifecycle.internal.MojoExecutor.execute(MojoExecutor.java:201)
	at org.apache.maven.lifecycle.internal.MojoExecutor.execute(MojoExecutor.java:153)
	at org.apache.maven.lifecycle.internal.MojoExecutor.execute(MojoExecutor.java:145)
	at org.apache.maven.lifecycle.internal.LifecycleModuleBuilder.buildProject(LifecycleModuleBuilder.java:84)
	at org.apache.maven.lifecycle.internal.LifecycleModuleBuilder.buildProject(LifecycleModuleBuilder.java:59)
	at org.apache.maven.lifecycle.internal.LifecycleStarter.singleThreadedBuild(LifecycleStarter.java:183)
	at org.apache.maven.lifecycle.internal.LifecycleStarter.execute(LifecycleStarter.java:161)
	at org.apache.maven.DefaultMaven.doExecute(DefaultMaven.java:319)
	at org.apache.maven.DefaultMaven.execute(DefaultMaven.java:156)
	at org.jvnet.hudson.maven3.launcher.Maven3Launcher.main(Maven3Launcher.java:79)
	at sun.reflect.NativeMethodAccessorImpl.invoke0(Native Method)
	at sun.reflect.NativeMethodAccessorImpl.invoke(NativeMethodAccessorImpl.java:39)
	at sun.reflect.DelegatingMethodAccessorImpl.invoke(DelegatingMethodAccessorImpl.java:25)
	at java.lang.reflect.Method.invoke(Method.java:597)
	at org.codehaus.plexus.classworlds.launcher.Launcher.launchStandard(Launcher.java:329)
	at org.codehaus.plexus.classworlds.launcher.Launcher.launch(Launcher.java:239)
	at org.jvnet.hudson.maven3.agent.Maven3Main.launch(Maven3Main.java:158)
	at hudson.maven.Maven3Builder.call(Maven3Builder.java:104)
	at hudson.maven.Maven3Builder.call(Maven3Builder.java:70)
	at hudson.remoting.UserRequest.perform(UserRequest.java:118)
	at hudson.remoting.UserRequest.perform(UserRequest.java:48)
	at hudson.remoting.Request$2.run(Request.java:287)
	at hudson.remoting.InterceptingExecutorService$1.call(InterceptingExecutorService.java:72)
	at java.util.concurrent.FutureTask$Sync.innerRun(FutureTask.java:303)
	at java.util.concurrent.FutureTask.run(FutureTask.java:138)
	at java.util.concurrent.ThreadPoolExecutor$Worker.runTask(ThreadPoolExecutor.java:886)
	at java.util.concurrent.ThreadPoolExecutor$Worker.run(ThreadPoolExecutor.java:908)
	at java.lang.Thread.run(Thread.java:662)
Caused by: org.apache.maven.project.DependencyResolutionException: Could not resolve dependencies for project org.apache.any23:any23-core:jar:0.7.0-incubating-SNAPSHOT: The following artifacts could not be resolved: org.openrdf.sesame:sesame-model:jar:2.6.1, org.openrdf.sesame:sesame-rio-api:jar:2.6.1, org.openrdf.sesame:sesame-rio-turtle:jar:2.6.1, org.openrdf.sesame:sesame-rio-rdfxml:jar:2.6.1, org.openrdf.sesame:sesame-rio-ntriples:jar:2.6.1, org.openrdf.sesame:sesame-rio-trix:jar:2.6.1, org.openrdf.sesame:sesame-repository-sail:jar:2.6.1, org.openrdf.sesame:sesame-sail-memory:jar:2.6.1, org.openrdf.sesame:sesame-repository-api:jar:2.6.1, info.aduna.commons:aduna-commons-xml:jar:2.7.0, info.aduna.commons:aduna-commons-text:jar:2.7.0, info.aduna.commons:aduna-commons-net:jar:2.7.0, info.aduna.commons:aduna-commons-lang:jar:2.9.0, info.aduna.commons:aduna-commons-iteration:jar:2.10.0, info.aduna.commons:aduna-commons-io:jar:2.10.0, info.aduna.commons:aduna-commons-concurrent:jar:2.7.0, org.apache.commons:commons-csv:jar:1.0-SNAPSHOT-rev1148315: Could not find artifact org.openrdf.sesame:sesame-model:jar:2.6.1 in central (http://repo1.maven.org/maven2)
	at org.apache.maven.project.DefaultProjectDependenciesResolver.resolve(DefaultProjectDependenciesResolver.java:170)
	at org.apache.maven.lifecycle.internal.LifecycleDependencyResolver.getDependencies(LifecycleDependencyResolver.java:171)
	... 30 more
Caused by: org.sonatype.aether.resolution.DependencyResolutionException: The following artifacts could not be resolved: org.openrdf.sesame:sesame-model:jar:2.6.1, org.openrdf.sesame:sesame-rio-api:jar:2.6.1, org.openrdf.sesame:sesame-rio-turtle:jar:2.6.1, org.openrdf.sesame:sesame-rio-rdfxml:jar:2.6.1, org.openrdf.sesame:sesame-rio-ntriples:jar:2.6.1, org.openrdf.sesame:sesame-rio-trix:jar:2.6.1, org.openrdf.sesame:sesame-repository-sail:jar:2.6.1, org.openrdf.sesame:sesame-sail-memory:jar:2.6.1, org.openrdf.sesame:sesame-repository-api:jar:2.6.1, info.aduna.commons:aduna-commons-xml:jar:2.7.0, info.aduna.commons:aduna-commons-text:jar:2.7.0, info.aduna.commons:aduna-commons-net:jar:2.7.0, info.aduna.commons:aduna-commons-lang:jar:2.9.0, info.aduna.commons:aduna-commons-iteration:jar:2.10.0, info.aduna.commons:aduna-commons-io:jar:2.10.0, info.aduna.commons:aduna-commons-concurrent:jar:2.7.0, org.apache.commons:commons-csv:jar:1.0-SNAPSHOT-rev1148315: Could not find artifact org.openrdf.sesame:sesame-model:jar:2.6.1 in central (http://repo1.maven.org/maven2)
	at org.sonatype.aether.impl.internal.DefaultRepositorySystem.resolveDependencies(DefaultRepositorySystem.java:412)
	at org.apache.maven.project.DefaultProjectDependenciesResolver.resolve(DefaultProjectDependenciesResolver.java:164)
	... 31 more
Caused by: org.sonatype.aether.resolution.ArtifactResolutionException: The following artifacts could not be resolved: org.openrdf.sesame:sesame-model:jar:2.6.1, org.openrdf.sesame:sesame-rio-api:jar:2.6.1, org.openrdf.sesame:sesame-rio-turtle:jar:2.6.1, org.openrdf.sesame:sesame-rio-rdfxml:jar:2.6.1, org.openrdf.sesame:sesame-rio-ntriples:jar:2.6.1, org.openrdf.sesame:sesame-rio-trix:jar:2.6.1, org.openrdf.sesame:sesame-repository-sail:jar:2.6.1, org.openrdf.sesame:sesame-sail-memory:jar:2.6.1, org.openrdf.sesame:sesame-repository-api:jar:2.6.1, info.aduna.commons:aduna-commons-xml:jar:2.7.0, info.aduna.commons:aduna-commons-text:jar:2.7.0, info.aduna.commons:aduna-commons-net:jar:2.7.0, info.aduna.commons:aduna-commons-lang:jar:2.9.0, info.aduna.commons:aduna-commons-iteration:jar:2.10.0, info.aduna.commons:aduna-commons-io:jar:2.10.0, info.aduna.commons:aduna-commons-concurrent:jar:2.7.0, org.apache.commons:commons-csv:jar:1.0-SNAPSHOT-rev1148315: Could not find artifact org.openrdf.sesame:sesame-model:jar:2.6.1 in central (http://repo1.maven.org/maven2)
	at org.sonatype.aether.impl.internal.DefaultArtifactResolver.resolve(DefaultArtifactResolver.java:541)
	at org.sonatype.aether.impl.internal.DefaultArtifactResolver.resolveArtifacts(DefaultArtifactResolver.java:220)
	at org.sonatype.aether.impl.internal.DefaultRepositorySystem.resolveDependencies(DefaultRepositorySystem.java:395)
	... 32 more
Caused by: org.sonatype.aether.transfer.ArtifactNotFoundException: Could not find artifact org.openrdf.sesame:sesame-model:jar:2.6.1 in central (http://repo1.maven.org/maven2)
	at org.sonatype.aether.connector.wagon.WagonRepositoryConnector$4.wrap(WagonRepositoryConnector.java:945)
	at org.sonatype.aether.connector.wagon.WagonRepositoryConnector$4.wrap(WagonRepositoryConnector.java:940)
	at org.sonatype.aether.connector.wagon.WagonRepositoryConnector$GetTask.flush(WagonRepositoryConnector.java:695)
	at org.sonatype.aether.connector.wagon.WagonRepositoryConnector$GetTask.flush(WagonRepositoryConnector.java:689)
	at org.sonatype.aether.connector.wagon.WagonRepositoryConnector.get(WagonRepositoryConnector.java:445)
	at org.sonatype.aether.impl.internal.DefaultArtifactResolver.resolve(DefaultArtifactResolver.java:460)
	... 34 more
Sending e-mails to: any23-dev@incubator.apache.org
channel stopped