You are viewing a plain text version of this content. The canonical link for it is here.
Posted to builds@cassandra.apache.org by Apache Jenkins Server <je...@builds.apache.org> on 2026/07/30 05:52:58 UTC

Build complete: Cassandra-6.0 #86 [UNSTABLE] 6a5bb352af09632af01029c6e347615d3b017dd8

-------------------------------------------------------------------------------
  Build Cassandra-6.0 #86 Still Unstable
  URL: https://ci-cassandra.apache.org/job/Cassandra-6.0/86/
  -------------------------------------------------------------------------------
  Changes:
  [Stefan Miklosovic] Prepare debian changelog for 5.0.9

[Michael Semb Wever] Jenkins improvements: fail-fast, disk-usage, helm overrides and safety


  -------------------------------------------------------------------------------
  Failed Tests:
  30 tests failed.
FAILED:  dtest-novnode.materialized_views_test.TestMaterializedViews.Tests / dtest-novnode jdk21 52/64 / test_drop_mv
FAILED:  dtest-novnode.materialized_views_test.TestMaterializedViews.Tests / dtest-novnode jdk21 42/64 / test_view_metadata_cleanup
FAILED:  dtest-novnode.materialized_views_test.TestMaterializedViews.Tests / dtest-novnode jdk21 42/64 / test_view_metadata_cleanup
FAILED:  dtest-novnode.secondary_indexes_test.TestSecondaryIndexes.Tests / dtest-novnode jdk17 13/64 / test_6924_dropping_ks
FAILED:  dtest-upgrade-novnode.upgrade_tests.cql_tests.TestCQLNodes2RF1_Upgrade_current_6_0_x_To_indev_6_0_x.Tests / dtest-upgrade-novnode jdk11 144/160 / test_select_distinct_with_deletions
FAILED:  dtest-upgrade-novnode.upgrade_tests.cql_tests.TestCQLNodes3RF3_Upgrade_current_6_0_x_To_indev_6_0_x.Tests / dtest-upgrade-novnode jdk11 22/160 / test_multi_collection
FAILED:  dtest-upgrade-novnode.upgrade_tests.cql_tests.TestCQLNodes3RF3_Upgrade_current_6_0_x_To_indev_6_0_x.Tests / dtest-upgrade-novnode jdk11 23/160 / test_range_query
FAILED:  dtest-upgrade.upgrade_tests.cql_tests.TestCQLNodes2RF1_Upgrade_current_6_0_x_To_indev_6_0_x.Tests / dtest-upgrade jdk11 155/160 / test_conversion_functions
FAILED:  dtest-upgrade.upgrade_tests.cql_tests.TestCQLNodes2RF1_Upgrade_current_6_0_x_To_indev_6_0_x.Tests / dtest-upgrade jdk11 139/160 / test_multi_list_set
FAILED:  dtest-upgrade.upgrade_tests.cql_tests.TestCQLNodes3RF3_Upgrade_current_6_0_x_To_indev_6_0_x.Tests / dtest-upgrade jdk11 33/160 / test_more_user_types
FAILED:  dtest-upgrade.upgrade_tests.cql_tests.TestCQLNodes3RF3_Upgrade_current_6_0_x_To_indev_6_0_x.Tests / dtest-upgrade jdk11 155/160 / test_multi_list_set
FAILED:  dtest-upgrade.upgrade_tests.cql_tests.TestCQLNodes3RF3_Upgrade_current_6_0_x_To_indev_6_0_x.Tests / dtest-upgrade jdk11 141/160 / test_no_clustering
FAILED:  dtest-upgrade.upgrade_tests.cql_tests.TestCQLNodes3RF3_Upgrade_current_6_0_x_To_indev_6_0_x.Tests / dtest-upgrade jdk11 143/160 / test_range_slice
FAILED:  org.apache.cassandra.db.commitlog.BatchCommitLogTest.Tests / test-oa jdk17 16/20 / testBatchCLShutDownImmediately[1]-oa_jdk17_x86_64
FAILED:  org.apache.cassandra.db.compaction.UnifiedCompactionStrategyTest.Tests / test jdk17 15/20 / testDropExpiredSSTables-_jdk17_x86_64
FAILED:  org.apache.cassandra.distributed.test.accord.AccordMigrationTest.Tests / jvm-dtest jdk21 4/16 / testPaxosToAccordCAS-_jdk21_x86_64
FAILED:  org.apache.cassandra.distributed.test.accord.AccordMigrationTest.Tests / jvm-dtest jdk21 4/16 / testPaxosToAccordSerialRead-_jdk21_x86_64
FAILED:  org.apache.cassandra.simulator.test.HarrySimulatorTest.Tests / simulator-dtest jdk11 1/2 / test-_jdk11_x86_64
FAILED:  org.apache.cassandra.simulator.test.SingleNodeSingleTableASTTest.Tests / simulator-dtest jdk11 1/2 / accordMixedReads-_jdk11_x86_64
FAILED:  org.apache.cassandra.distributed.test.accord.InteropAccordCQLTest.Tests / jvm-dtest jdk11 16/16 / testCASSimulatorLite-_jdk11_x86_64
FAILED:  org.apache.cassandra.distributed.test.accord.InteropAccordCQLTest.Tests / jvm-dtest jdk21 16/16 / testCASSimulatorLite-_jdk21_x86_64
FAILED:  org.apache.cassandra.simulator.test.ShortAccordSimulationTest.Tests / simulator-dtest jdk11 1/2 / simulationTest-_jdk11_x86_64
FAILED:  junit.framework.TestSuite.Tests / jvm-dtest jdk11 3/16 / org.apache.cassandra.distributed.test.repair.AutoRepairSchedulerDisallowParallelReplicaRepairAcrossSchedulesTest-_jdk11_x86_64
FAILED:  org.apache.cassandra.simulator.test.EpochStressTest.Tests / simulator-dtest jdk11 2/2 / manyEpochsAndAccordConverges-_jdk11_x86_64
FAILED:  org.apache.cassandra.simulator.test.SingleNodeSingleTableASTTest.Tests / simulator-dtest jdk11 1/2 / accordFull-_jdk11_x86_64
FAILED:  org.apache.cassandra.simulator.test.AccordHarrySimulationTest.Tests / simulator-dtest jdk11 2/2 / test-_jdk11_x86_64
FAILED:  org.apache.cassandra.simulator.test.ShortPaxosSimulationTest.Tests / simulator-dtest jdk11 2/2 / selfReconcileTest-cassandra.testtag_IS_UNDEFINED
FAILED:  org.apache.cassandra.fuzz.sai.MultiNodeSAITest.Tests / jvm-dtest jdk11 3/16 / indexOnlySaiTest-cassandra.testtag_IS_UNDEFINED
FAILED:  org.apache.cassandra.fuzz.sai.MultiNodeSAITest.Tests / jvm-dtest jdk17 3/16 / indexOnlySaiTest-cassandra.testtag_IS_UNDEFINED
FAILED:  org.apache.cassandra.repair.autorepair.AutoRepairParameterizedTest.Tests / test-compression jdk17 17/20 / testGetAllMVs[repairType=PREVIEW_REPAIRED]-cassandra.testtag_IS_UNDEFINED

  -------------------------------------------------------------------------------
  For complete test report and logs see https://nightlies.apache.org/cassandra/Cassandra-6.0/86/