You are viewing a plain text version of this content. The canonical link for it is here.
Posted to builds@beam.apache.org by Apache Jenkins Server <je...@builds.apache.org> on 2022/02/02 00:37:44 UTC
Build failed in Jenkins: beam_Publish_Beam_SDK_Snapshots #2565
See <https://ci-beam.apache.org/job/beam_Publish_Beam_SDK_Snapshots/2565/display/redirect?page=changes>
Changes:
[career] [BEAM-13734] Support cache directories that use GCS buckets
[noreply] Merge pull request #16586 from [BEAM-13731] FhirIO: Add support for
[noreply] [BEAM-13011] Adds a link to Multi-language Pipelines Tips wiki page
[noreply] [BEAM-12572] Run python examples on multiple runners (#16154)
------------------------------------------
[...truncated 83.72 KB...]
Collecting pytest-xdist==1.34.0
Downloading pytest_xdist-1.34.0-py2.py3-none-any.whl (36 kB)
Collecting python-dateutil==2.8.2
Downloading python_dateutil-2.8.2-py2.py3-none-any.whl (247 kB)
Collecting python-snappy==0.6.0
Downloading python_snappy-0.6.0-cp38-cp38-manylinux2010_x86_64.whl (54 kB)
Collecting pytz==2021.3
Downloading pytz-2021.3-py2.py3-none-any.whl (503 kB)
Collecting PyYAML==6.0
Downloading PyYAML-6.0-cp38-cp38-manylinux_2_5_x86_64.manylinux1_x86_64.manylinux_2_12_x86_64.manylinux2010_x86_64.whl (701 kB)
Collecting regex==2021.11.10
Downloading regex-2021.11.10-cp38-cp38-manylinux_2_17_x86_64.manylinux2014_x86_64.whl (764 kB)
Collecting requests==2.27.0
Downloading requests-2.27.0-py2.py3-none-any.whl (63 kB)
Collecting requests-mock==1.9.3
Downloading requests_mock-1.9.3-py2.py3-none-any.whl (27 kB)
Collecting requests-oauthlib==1.3.0
Downloading requests_oauthlib-1.3.0-py2.py3-none-any.whl (23 kB)
Collecting rsa==4.8
Downloading rsa-4.8-py3-none-any.whl (39 kB)
Collecting scikit-learn==1.0.2
Downloading scikit_learn-1.0.2-cp38-cp38-manylinux_2_17_x86_64.manylinux2014_x86_64.whl (26.7 MB)
Collecting scipy==1.7.3
Downloading scipy-1.7.3-cp38-cp38-manylinux_2_17_x86_64.manylinux2014_x86_64.whl (39.3 MB)
Collecting six==1.16.0
Downloading six-1.16.0-py2.py3-none-any.whl (11 kB)
Collecting soupsieve==2.3.1
Downloading soupsieve-2.3.1-py3-none-any.whl (37 kB)
Collecting SQLAlchemy==1.4.29
Downloading SQLAlchemy-1.4.29-cp38-cp38-manylinux_2_5_x86_64.manylinux1_x86_64.manylinux_2_17_x86_64.manylinux2014_x86_64.whl (1.6 MB)
Collecting tenacity==5.1.5
Downloading tenacity-5.1.5-py2.py3-none-any.whl (34 kB)
Collecting tensorboard==2.7.0
Downloading tensorboard-2.7.0-py3-none-any.whl (5.8 MB)
Collecting tensorboard-data-server==0.6.1
Downloading tensorboard_data_server-0.6.1-py3-none-manylinux2010_x86_64.whl (4.9 MB)
Collecting tensorboard-plugin-wit==1.8.0
Downloading tensorboard_plugin_wit-1.8.0-py3-none-any.whl (781 kB)
Collecting tensorflow==2.7.0
Downloading tensorflow-2.7.0-cp38-cp38-manylinux2010_x86_64.whl (489.6 MB)
> Task :sdks:python:container:py36:docker
Collecting greenlet==1.1.2
Downloading greenlet-1.1.2-cp36-cp36m-manylinux_2_17_x86_64.manylinux2014_x86_64.whl (147 kB)
Collecting grpc-google-iam-v1==0.12.3
Downloading grpc-google-iam-v1-0.12.3.tar.gz (13 kB)
Collecting grpcio==1.43.0
Downloading grpcio-1.43.0-cp36-cp36m-manylinux_2_17_x86_64.manylinux2014_x86_64.whl (4.1 MB)
Collecting grpcio-gcp==0.2.2
Downloading grpcio_gcp-0.2.2-py2.py3-none-any.whl (9.4 kB)
Collecting grpcio-status==1.43.0
Downloading grpcio_status-1.43.0-py3-none-any.whl (10.0 kB)
Collecting guppy3==3.1.2
Downloading guppy3-3.1.2-cp36-cp36m-manylinux_2_5_x86_64.manylinux1_x86_64.manylinux_2_12_x86_64.manylinux2010_x86_64.whl (606 kB)
Collecting h5py==3.1.0
Downloading h5py-3.1.0-cp36-cp36m-manylinux1_x86_64.whl (4.0 MB)
Collecting hdfs==2.6.0
Downloading hdfs-2.6.0-py3-none-any.whl (33 kB)
Collecting httplib2==0.19.1
Downloading httplib2-0.19.1-py3-none-any.whl (95 kB)
Collecting idna==3.3
Downloading idna-3.3-py3-none-any.whl (61 kB)
Collecting importlib-metadata==4.8.3
Downloading importlib_metadata-4.8.3-py3-none-any.whl (17 kB)
Collecting joblib==1.1.0
Downloading joblib-1.1.0-py2.py3-none-any.whl (306 kB)
Collecting keras==2.6.0
Downloading keras-2.6.0-py2.py3-none-any.whl (1.3 MB)
Collecting Keras-Preprocessing==1.1.2
Downloading Keras_Preprocessing-1.1.2-py2.py3-none-any.whl (42 kB)
Collecting libcst==0.3.23
Downloading libcst-0.3.23-py3-none-any.whl (517 kB)
Collecting Markdown==3.3.6
Downloading Markdown-3.3.6-py3-none-any.whl (97 kB)
Collecting mmh3==3.0.0
Downloading mmh3-3.0.0-cp36-cp36m-manylinux2010_x86_64.whl (49 kB)
Collecting mock==2.0.0
Downloading mock-2.0.0-py2.py3-none-any.whl (56 kB)
Collecting more-itertools==8.12.0
Downloading more_itertools-8.12.0-py3-none-any.whl (54 kB)
Collecting mypy-extensions==0.4.3
Downloading mypy_extensions-0.4.3-py2.py3-none-any.whl (4.5 kB)
Collecting nltk==3.6.7
Downloading nltk-3.6.7-py3-none-any.whl (1.5 MB)
Collecting nose==1.3.7
Downloading nose-1.3.7-py3-none-any.whl (154 kB)
Collecting numpy==1.19.5
Downloading numpy-1.19.5-cp36-cp36m-manylinux2010_x86_64.whl (14.8 MB)
Collecting oauth2client==4.1.3
Downloading oauth2client-4.1.3-py2.py3-none-any.whl (98 kB)
Collecting oauthlib==3.1.1
Downloading oauthlib-3.1.1-py2.py3-none-any.whl (146 kB)
Collecting opt-einsum==3.3.0
Downloading opt_einsum-3.3.0-py3-none-any.whl (65 kB)
Collecting orjson==3.6.1
Downloading orjson-3.6.1-cp36-cp36m-manylinux_2_24_x86_64.whl (233 kB)
Collecting overrides==6.1.0
Downloading overrides-6.1.0-py3-none-any.whl (14 kB)
Collecting packaging==21.3
Downloading packaging-21.3-py3-none-any.whl (40 kB)
Collecting pandas==1.1.5
Downloading pandas-1.1.5-cp36-cp36m-manylinux1_x86_64.whl (9.5 MB)
Collecting parameterized==0.7.5
Downloading parameterized-0.7.5-py2.py3-none-any.whl (17 kB)
Collecting pbr==5.8.0
Downloading pbr-5.8.0-py2.py3-none-any.whl (112 kB)
Collecting pluggy==0.13.1
Downloading pluggy-0.13.1-py2.py3-none-any.whl (18 kB)
Collecting proto-plus==1.19.8
Downloading proto_plus-1.19.8-py3-none-any.whl (45 kB)
Collecting protobuf==3.19.1
Downloading protobuf-3.19.1-cp36-cp36m-manylinux_2_17_x86_64.manylinux2014_x86_64.whl (1.1 MB)
Collecting psycopg2-binary==2.9.3
Downloading psycopg2_binary-2.9.3-cp36-cp36m-manylinux_2_17_x86_64.manylinux2014_x86_64.whl (3.0 MB)
Collecting py==1.11.0
Downloading py-1.11.0-py2.py3-none-any.whl (98 kB)
Collecting pyarrow==6.0.1
Downloading pyarrow-6.0.1-cp36-cp36m-manylinux_2_17_x86_64.manylinux2014_x86_64.whl (25.6 MB)
Collecting pyasn1==0.4.8
Downloading pyasn1-0.4.8-py2.py3-none-any.whl (77 kB)
Collecting pyasn1-modules==0.2.8
Downloading pyasn1_modules-0.2.8-py2.py3-none-any.whl (155 kB)
Collecting pydot==1.4.2
Downloading pydot-1.4.2-py2.py3-none-any.whl (21 kB)
Collecting PyHamcrest==1.10.1
Downloading PyHamcrest-1.10.1-py3-none-any.whl (48 kB)
Collecting pymongo==3.12.3
Downloading pymongo-3.12.3-cp36-cp36m-manylinux_2_17_x86_64.manylinux2014_x86_64.whl (506 kB)
Collecting pyparsing==2.4.7
Downloading pyparsing-2.4.7-py2.py3-none-any.whl (67 kB)
Collecting pytest==4.6.11
Downloading pytest-4.6.11-py2.py3-none-any.whl (231 kB)
Collecting pytest-forked==1.4.0
Downloading pytest_forked-1.4.0-py3-none-any.whl (4.9 kB)
Collecting pytest-timeout==1.4.2
Downloading pytest_timeout-1.4.2-py2.py3-none-any.whl (10 kB)
Collecting pytest-xdist==1.34.0
Downloading pytest_xdist-1.34.0-py2.py3-none-any.whl (36 kB)
Collecting python-dateutil==2.8.2
Downloading python_dateutil-2.8.2-py2.py3-none-any.whl (247 kB)
Collecting python-snappy==0.6.0
Downloading python_snappy-0.6.0-cp36-cp36m-manylinux2010_x86_64.whl (54 kB)
Collecting pytz==2021.3
Downloading pytz-2021.3-py2.py3-none-any.whl (503 kB)
Collecting PyYAML==6.0
Downloading PyYAML-6.0-cp36-cp36m-manylinux_2_5_x86_64.manylinux1_x86_64.manylinux_2_12_x86_64.manylinux2010_x86_64.whl (603 kB)
Collecting regex==2021.11.10
Downloading regex-2021.11.10-cp36-cp36m-manylinux_2_17_x86_64.manylinux2014_x86_64.whl (748 kB)
Collecting requests==2.27.0
Downloading requests-2.27.0-py2.py3-none-any.whl (63 kB)
Collecting requests-mock==1.9.3
Downloading requests_mock-1.9.3-py2.py3-none-any.whl (27 kB)
Collecting requests-oauthlib==1.3.0
Downloading requests_oauthlib-1.3.0-py2.py3-none-any.whl (23 kB)
Collecting rsa==4.8
Downloading rsa-4.8-py3-none-any.whl (39 kB)
Collecting scikit-learn==0.24.2
Downloading scikit_learn-0.24.2-cp36-cp36m-manylinux2010_x86_64.whl (22.2 MB)
Collecting scipy==1.5.4
Downloading scipy-1.5.4-cp36-cp36m-manylinux1_x86_64.whl (25.9 MB)
Collecting six==1.15.0
Downloading six-1.15.0-py2.py3-none-any.whl (10 kB)
Collecting soupsieve==2.3.1
Downloading soupsieve-2.3.1-py3-none-any.whl (37 kB)
Collecting SQLAlchemy==1.4.29
Downloading SQLAlchemy-1.4.29-cp36-cp36m-manylinux_2_5_x86_64.manylinux1_x86_64.manylinux_2_17_x86_64.manylinux2014_x86_64.whl (1.6 MB)
Collecting tenacity==5.1.5
Downloading tenacity-5.1.5-py2.py3-none-any.whl (34 kB)
Collecting tensorboard==2.6.0
Downloading tensorboard-2.6.0-py3-none-any.whl (5.6 MB)
Collecting tensorboard-data-server==0.6.1
Downloading tensorboard_data_server-0.6.1-py3-none-manylinux2010_x86_64.whl (4.9 MB)
Collecting tensorboard-plugin-wit==1.8.0
Downloading tensorboard_plugin_wit-1.8.0-py3-none-any.whl (781 kB)
Collecting tensorflow==2.6.2
Downloading tensorflow-2.6.2-cp36-cp36m-manylinux2010_x86_64.whl (458.3 MB)
> Task :sdks:java:container:pullLicenses FAILED
Traceback (most recent call last):
File "<https://ci-beam.apache.org/job/beam_Publish_Beam_SDK_Snapshots/ws/src/sdks/java/container/license_scripts/pull_licenses_java.py",> line 53, in pull_from_url
url_read = urlopen(url)
File "/usr/lib/python3.8/urllib/request.py", line 222, in urlopen
return opener.open(url, data, timeout)
File "/usr/lib/python3.8/urllib/request.py", line 531, in open
response = meth(req, response)
File "/usr/lib/python3.8/urllib/request.py", line 640, in http_response
response = self.parent.error(
File "/usr/lib/python3.8/urllib/request.py", line 569, in error
return self._call_chain(*args)
File "/usr/lib/python3.8/urllib/request.py", line 502, in _call_chain
result = func(*args)
File "/usr/lib/python3.8/urllib/request.py", line 649, in http_error_default
raise HTTPError(req.full_url, code, msg, hdrs, fp)
urllib.error.HTTPError: HTTP Error 500: Internal Server Error
ERROR:root:Invalid url for xz-1.5: https://git.tukaani.org/?p=xz-java.git;a=blob;f=COPYING;h=c1d404dc7a6f06a0437bf1055fedaa4a4c89d728;hb=9f1f97a26f090ffec6568c004a38c6534aa82b94 after 9 retries.
ERROR:root:['xz-1.5']
ERROR:root:**************************************** Licenses were not able to be pulled automatically for some dependencies. Please search source code of the dependencies on the internet and add "license" and "notice" (if available) field to <https://ci-beam.apache.org/job/beam_Publish_Beam_SDK_Snapshots/ws/src/sdks/java/container/license_scripts/dep_urls_java.yaml> for each missing license. Dependency List: [xz-1.5]
INFO:root:pull_licenses_java.py failed. It took 46.964428 seconds with 16 threads.
Traceback (most recent call last):
File "<https://ci-beam.apache.org/job/beam_Publish_Beam_SDK_Snapshots/ws/src/sdks/java/container/license_scripts/pull_licenses_java.py",> line 314, in <module>
raise RuntimeError('{n} error(s) occurred.'.format(n=len(error_msg)),
RuntimeError: ('1 error(s) occurred.', ['**************************************** Licenses were not able to be pulled automatically for some dependencies. Please search source code of the dependencies on the internet and add "license" and "notice" (if available) field to <https://ci-beam.apache.org/job/beam_Publish_Beam_SDK_Snapshots/ws/src/sdks/java/container/license_scripts/dep_urls_java.yaml> for each missing license. Dependency List: [xz-1.5]'])
> Task :sdks:python:container:py38:dockerTagFa7e964b3d2fa2d215772d15f502e3b648ccdb7b
> Task :sdks:python:container:py36:dockerTagFa7e964b3d2fa2d215772d15f502e3b648ccdb7b
> Task :sdks:python:container:py37:dockerTagFa7e964b3d2fa2d215772d15f502e3b648ccdb7b
> Task :sdks:python:container:py38:dockerPushFa7e964b3d2fa2d215772d15f502e3b648ccdb7b
> Task :sdks:python:container:py36:dockerPushFa7e964b3d2fa2d215772d15f502e3b648ccdb7b
> Task :sdks:python:container:py37:dockerPushFa7e964b3d2fa2d215772d15f502e3b648ccdb7b
> Task :sdks:python:container:py36:dockerTagLatest
> Task :sdks:python:container:py38:dockerTagLatest
> Task :sdks:python:container:py36:dockerPushLatest
> Task :sdks:python:container:py36:dockerTagsPush
> Task :sdks:python:container:py38:dockerPushLatest
> Task :sdks:python:container:py38:dockerTagsPush
> Task :sdks:python:container:py37:dockerTagLatest
> Task :sdks:python:container:py37:dockerPushLatest
> Task :sdks:python:container:py37:dockerTagsPush
FAILURE: Build failed with an exception.
* What went wrong:
Execution failed for task ':sdks:java:container:pullLicenses'.
> Process 'command './license_scripts/license_script.sh'' finished with non-zero exit value 1
* Try:
> Run with --stacktrace option to get the stack trace.
> Run with --info or --debug option to get more log output.
> Run with --scan to get full insights.
* Get more help at https://help.gradle.org
Deprecated Gradle features were used in this build, making it incompatible with Gradle 8.0.
You can use '--warning-mode all' to show the individual deprecation warnings and determine if they come from your own scripts or plugins.
See https://docs.gradle.org/7.3.2/userguide/command_line_interface.html#sec:command_line_warnings
Execution optimizations have been disabled for 3 invalid unit(s) of work during this build to ensure correctness.
Please consult deprecation warnings for more details.
BUILD FAILED in 13m 30s
145 actionable tasks: 108 executed, 25 from cache, 12 up-to-date
Publishing build scan...
https://gradle.com/s/oxkx7ajmo6qgk
Build step 'Invoke Gradle script' changed build result to FAILURE
Build step 'Invoke Gradle script' marked build as failure
---------------------------------------------------------------------
To unsubscribe, e-mail: builds-unsubscribe@beam.apache.org
For additional commands, e-mail: builds-help@beam.apache.org
Jenkins build is back to normal : beam_Publish_Beam_SDK_Snapshots #2567
Posted by Apache Jenkins Server <je...@builds.apache.org>.
See <https://ci-beam.apache.org/job/beam_Publish_Beam_SDK_Snapshots/2567/display/redirect?page=changes>
---------------------------------------------------------------------
To unsubscribe, e-mail: builds-unsubscribe@beam.apache.org
For additional commands, e-mail: builds-help@beam.apache.org
Build failed in Jenkins: beam_Publish_Beam_SDK_Snapshots #2566
Posted by Apache Jenkins Server <je...@builds.apache.org>.
See <https://ci-beam.apache.org/job/beam_Publish_Beam_SDK_Snapshots/2566/display/redirect?page=changes>
Changes:
[noreply] [BEAM-13574] Large Wordcount (#16455)
[noreply] [BEAM-13293] Refactor JDBC IO Go Wrapper (#16686)
------------------------------------------
[...truncated 105.46 KB...]
Collecting docopt==0.6.2
Downloading docopt-0.6.2.tar.gz (25 kB)
Collecting execnet==1.9.0
Downloading execnet-1.9.0-py2.py3-none-any.whl (39 kB)
Collecting fastavro==1.4.8
Downloading fastavro-1.4.8-cp38-cp38-manylinux_2_17_x86_64.manylinux2014_x86_64.whl (2.6 MB)
Collecting fasteners==0.16.3
Downloading fasteners-0.16.3-py2.py3-none-any.whl (28 kB)
Collecting flatbuffers==2.0
Downloading flatbuffers-2.0-py2.py3-none-any.whl (26 kB)
Collecting freezegun==1.1.0
Downloading freezegun-1.1.0-py2.py3-none-any.whl (16 kB)
Collecting future==0.18.2
Downloading future-0.18.2.tar.gz (829 kB)
Collecting gast==0.4.0
Downloading gast-0.4.0-py3-none-any.whl (9.8 kB)
Collecting google-api-core==1.31.5
Downloading google_api_core-1.31.5-py2.py3-none-any.whl (93 kB)
Collecting google-api-python-client==2.33.0
Downloading google_api_python_client-2.33.0-py2.py3-none-any.whl (7.9 MB)
Collecting google-apitools==0.5.31
Downloading google-apitools-0.5.31.tar.gz (173 kB)
Collecting google-auth==1.35.0
Downloading google_auth-1.35.0-py2.py3-none-any.whl (152 kB)
Collecting google-auth-httplib2==0.1.0
Downloading google_auth_httplib2-0.1.0-py2.py3-none-any.whl (9.3 kB)
Collecting google-auth-oauthlib==0.4.6
Downloading google_auth_oauthlib-0.4.6-py2.py3-none-any.whl (18 kB)
Collecting google-cloud-bigquery==2.31.0
Downloading google_cloud_bigquery-2.31.0-py2.py3-none-any.whl (205 kB)
Collecting google-cloud-bigquery-storage==2.10.1
Downloading google_cloud_bigquery_storage-2.10.1-py2.py3-none-any.whl (171 kB)
Collecting google-cloud-bigtable==1.7.0
Downloading google_cloud_bigtable-1.7.0-py2.py3-none-any.whl (267 kB)
Collecting google-cloud-core==1.7.2
Downloading google_cloud_core-1.7.2-py2.py3-none-any.whl (28 kB)
Collecting google-cloud-datastore==1.15.3
Downloading google_cloud_datastore-1.15.3-py2.py3-none-any.whl (134 kB)
Collecting google-cloud-dlp==3.4.0
Downloading google_cloud_dlp-3.4.0-py2.py3-none-any.whl (110 kB)
Collecting google-cloud-language==1.3.0
Downloading google_cloud_language-1.3.0-py2.py3-none-any.whl (83 kB)
Collecting google-cloud-profiler==3.0.6
Downloading google-cloud-profiler-3.0.6.tar.gz (33 kB)
Collecting google-cloud-pubsub==2.9.0
Downloading google_cloud_pubsub-2.9.0-py2.py3-none-any.whl (219 kB)
Collecting google-cloud-pubsublite==1.2.0
Downloading google_cloud_pubsublite-1.2.0-py2.py3-none-any.whl (252 kB)
Collecting google-cloud-recommendations-ai==0.2.0
Downloading google_cloud_recommendations_ai-0.2.0-py2.py3-none-any.whl (180 kB)
Collecting google-cloud-spanner==1.19.1
Downloading google_cloud_spanner-1.19.1-py2.py3-none-any.whl (255 kB)
Collecting google-cloud-videointelligence==1.16.1
Downloading google_cloud_videointelligence-1.16.1-py2.py3-none-any.whl (183 kB)
Collecting google-cloud-vision==1.0.0
Downloading google_cloud_vision-1.0.0-py2.py3-none-any.whl (435 kB)
Collecting google-crc32c==1.3.0
Downloading google_crc32c-1.3.0-cp38-cp38-manylinux_2_12_x86_64.manylinux2010_x86_64.whl (37 kB)
Collecting google-pasta==0.2.0
Downloading google_pasta-0.2.0-py3-none-any.whl (57 kB)
Collecting google-python-cloud-debugger==2.18
Downloading google_python_cloud_debugger-2.18-cp38-cp38-manylinux_2_5_x86_64.manylinux1_x86_64.whl (769 kB)
Collecting google-resumable-media==2.1.0
Downloading google_resumable_media-2.1.0-py2.py3-none-any.whl (75 kB)
Collecting googleapis-common-protos==1.54.0
Downloading googleapis_common_protos-1.54.0-py2.py3-none-any.whl (207 kB)
Collecting greenlet==1.1.2
Downloading greenlet-1.1.2-cp38-cp38-manylinux_2_17_x86_64.manylinux2014_x86_64.whl (156 kB)
Collecting grpc-google-iam-v1==0.12.3
Downloading grpc-google-iam-v1-0.12.3.tar.gz (13 kB)
Collecting grpcio==1.43.0
Downloading grpcio-1.43.0-cp38-cp38-manylinux_2_17_x86_64.manylinux2014_x86_64.whl (4.1 MB)
Collecting grpcio-gcp==0.2.2
Downloading grpcio_gcp-0.2.2-py2.py3-none-any.whl (9.4 kB)
Collecting grpcio-status==1.43.0
Downloading grpcio_status-1.43.0-py3-none-any.whl (10.0 kB)
Collecting guppy3==3.1.2
Downloading guppy3-3.1.2-cp38-cp38-manylinux_2_5_x86_64.manylinux1_x86_64.manylinux_2_12_x86_64.manylinux2010_x86_64.whl (649 kB)
Collecting h5py==3.6.0
Downloading h5py-3.6.0-cp38-cp38-manylinux_2_12_x86_64.manylinux2010_x86_64.whl (4.5 MB)
Collecting hdfs==2.6.0
Downloading hdfs-2.6.0-py3-none-any.whl (33 kB)
Collecting httplib2==0.19.1
Downloading httplib2-0.19.1-py3-none-any.whl (95 kB)
Collecting idna==3.3
Downloading idna-3.3-py3-none-any.whl (61 kB)
Collecting importlib-metadata==4.10.0
Downloading importlib_metadata-4.10.0-py3-none-any.whl (17 kB)
Collecting joblib==1.1.0
Downloading joblib-1.1.0-py2.py3-none-any.whl (306 kB)
Collecting keras==2.7.0
Downloading keras-2.7.0-py2.py3-none-any.whl (1.3 MB)
Collecting Keras-Preprocessing==1.1.2
Downloading Keras_Preprocessing-1.1.2-py2.py3-none-any.whl (42 kB)
Collecting libclang==12.0.0
Downloading libclang-12.0.0-2-py2.py3-none-manylinux1_x86_64.whl (13.3 MB)
Collecting libcst==0.3.23
Downloading libcst-0.3.23-py3-none-any.whl (517 kB)
Collecting Markdown==3.3.6
Downloading Markdown-3.3.6-py3-none-any.whl (97 kB)
Collecting mmh3==3.0.0
Downloading mmh3-3.0.0-cp38-cp38-manylinux2010_x86_64.whl (50 kB)
Collecting mock==2.0.0
Downloading mock-2.0.0-py2.py3-none-any.whl (56 kB)
Collecting more-itertools==8.12.0
Downloading more_itertools-8.12.0-py3-none-any.whl (54 kB)
Collecting mypy-extensions==0.4.3
Downloading mypy_extensions-0.4.3-py2.py3-none-any.whl (4.5 kB)
Collecting nltk==3.6.7
Downloading nltk-3.6.7-py3-none-any.whl (1.5 MB)
Collecting nose==1.3.7
Downloading nose-1.3.7-py3-none-any.whl (154 kB)
Collecting numpy==1.21.5
Downloading numpy-1.21.5-cp38-cp38-manylinux_2_12_x86_64.manylinux2010_x86_64.whl (15.7 MB)
Collecting oauth2client==4.1.3
Downloading oauth2client-4.1.3-py2.py3-none-any.whl (98 kB)
Collecting oauthlib==3.1.1
Downloading oauthlib-3.1.1-py2.py3-none-any.whl (146 kB)
Collecting opt-einsum==3.3.0
Downloading opt_einsum-3.3.0-py3-none-any.whl (65 kB)
Collecting orjson==3.6.5
Downloading orjson-3.6.5-cp38-cp38-manylinux_2_24_x86_64.whl (247 kB)
Collecting overrides==6.1.0
Downloading overrides-6.1.0-py3-none-any.whl (14 kB)
Collecting packaging==21.3
Downloading packaging-21.3-py3-none-any.whl (40 kB)
Collecting pandas==1.3.5
Downloading pandas-1.3.5-cp38-cp38-manylinux_2_17_x86_64.manylinux2014_x86_64.whl (11.5 MB)
Collecting parameterized==0.7.5
Downloading parameterized-0.7.5-py2.py3-none-any.whl (17 kB)
Collecting pbr==5.8.0
Downloading pbr-5.8.0-py2.py3-none-any.whl (112 kB)
Collecting pluggy==0.13.1
Downloading pluggy-0.13.1-py2.py3-none-any.whl (18 kB)
Collecting proto-plus==1.19.8
Downloading proto_plus-1.19.8-py3-none-any.whl (45 kB)
Collecting protobuf==3.19.1
Downloading protobuf-3.19.1-cp38-cp38-manylinux_2_17_x86_64.manylinux2014_x86_64.whl (1.1 MB)
Collecting psycopg2-binary==2.9.3
Downloading psycopg2_binary-2.9.3-cp38-cp38-manylinux_2_17_x86_64.manylinux2014_x86_64.whl (3.0 MB)
Collecting py==1.11.0
Downloading py-1.11.0-py2.py3-none-any.whl (98 kB)
Collecting pyarrow==6.0.1
Downloading pyarrow-6.0.1-cp38-cp38-manylinux_2_17_x86_64.manylinux2014_x86_64.whl (25.6 MB)
Collecting pyasn1==0.4.8
Downloading pyasn1-0.4.8-py2.py3-none-any.whl (77 kB)
Collecting pyasn1-modules==0.2.8
Downloading pyasn1_modules-0.2.8-py2.py3-none-any.whl (155 kB)
Collecting pydot==1.4.2
Downloading pydot-1.4.2-py2.py3-none-any.whl (21 kB)
Collecting PyHamcrest==1.10.1
Downloading PyHamcrest-1.10.1-py3-none-any.whl (48 kB)
Collecting pymongo==3.12.3
Downloading pymongo-3.12.3-cp38-cp38-manylinux_2_17_x86_64.manylinux2014_x86_64.whl (527 kB)
Collecting pyparsing==2.4.7
Downloading pyparsing-2.4.7-py2.py3-none-any.whl (67 kB)
Collecting pytest==4.6.11
Downloading pytest-4.6.11-py2.py3-none-any.whl (231 kB)
Collecting pytest-forked==1.4.0
Downloading pytest_forked-1.4.0-py3-none-any.whl (4.9 kB)
Collecting pytest-timeout==1.4.2
Downloading pytest_timeout-1.4.2-py2.py3-none-any.whl (10 kB)
Collecting pytest-xdist==1.34.0
Downloading pytest_xdist-1.34.0-py2.py3-none-any.whl (36 kB)
Collecting python-dateutil==2.8.2
Downloading python_dateutil-2.8.2-py2.py3-none-any.whl (247 kB)
Collecting python-snappy==0.6.0
Downloading python_snappy-0.6.0-cp38-cp38-manylinux2010_x86_64.whl (54 kB)
Collecting pytz==2021.3
Downloading pytz-2021.3-py2.py3-none-any.whl (503 kB)
Collecting PyYAML==6.0
Downloading PyYAML-6.0-cp38-cp38-manylinux_2_5_x86_64.manylinux1_x86_64.manylinux_2_12_x86_64.manylinux2010_x86_64.whl (701 kB)
Collecting regex==2021.11.10
Downloading regex-2021.11.10-cp38-cp38-manylinux_2_17_x86_64.manylinux2014_x86_64.whl (764 kB)
Collecting requests==2.27.0
Downloading requests-2.27.0-py2.py3-none-any.whl (63 kB)
Collecting requests-mock==1.9.3
Downloading requests_mock-1.9.3-py2.py3-none-any.whl (27 kB)
Collecting requests-oauthlib==1.3.0
Downloading requests_oauthlib-1.3.0-py2.py3-none-any.whl (23 kB)
Collecting rsa==4.8
Downloading rsa-4.8-py3-none-any.whl (39 kB)
Collecting scikit-learn==1.0.2
Downloading scikit_learn-1.0.2-cp38-cp38-manylinux_2_17_x86_64.manylinux2014_x86_64.whl (26.7 MB)
Collecting scipy==1.7.3
Downloading scipy-1.7.3-cp38-cp38-manylinux_2_17_x86_64.manylinux2014_x86_64.whl (39.3 MB)
Collecting six==1.16.0
Downloading six-1.16.0-py2.py3-none-any.whl (11 kB)
Collecting soupsieve==2.3.1
Downloading soupsieve-2.3.1-py3-none-any.whl (37 kB)
Collecting SQLAlchemy==1.4.29
Downloading SQLAlchemy-1.4.29-cp38-cp38-manylinux_2_5_x86_64.manylinux1_x86_64.manylinux_2_17_x86_64.manylinux2014_x86_64.whl (1.6 MB)
Collecting tenacity==5.1.5
Downloading tenacity-5.1.5-py2.py3-none-any.whl (34 kB)
Collecting tensorboard==2.7.0
Downloading tensorboard-2.7.0-py3-none-any.whl (5.8 MB)
Collecting tensorboard-data-server==0.6.1
Downloading tensorboard_data_server-0.6.1-py3-none-manylinux2010_x86_64.whl (4.9 MB)
Collecting tensorboard-plugin-wit==1.8.0
Downloading tensorboard_plugin_wit-1.8.0-py3-none-any.whl (781 kB)
Collecting tensorflow==2.7.0
Downloading tensorflow-2.7.0-cp38-cp38-manylinux2010_x86_64.whl (489.6 MB)
> Task :sdks:python:container:py36:dockerTagB4779eb2d1ecb096a5d1804c07bfcd286c0a5edd
> Task :sdks:python:container:py38:dockerTagB4779eb2d1ecb096a5d1804c07bfcd286c0a5edd
> Task :sdks:python:container:py37:dockerTagB4779eb2d1ecb096a5d1804c07bfcd286c0a5edd
> Task :sdks:python:container:py36:dockerPushB4779eb2d1ecb096a5d1804c07bfcd286c0a5edd
> Task :sdks:python:container:py38:dockerPushB4779eb2d1ecb096a5d1804c07bfcd286c0a5edd
> Task :sdks:python:container:py37:dockerPushB4779eb2d1ecb096a5d1804c07bfcd286c0a5edd
> Task :sdks:python:container:py36:dockerTagLatest
> Task :sdks:python:container:py36:dockerPushLatest
> Task :sdks:python:container:py36:dockerTagsPush
> Task :sdks:python:container:py38:dockerTagLatest
> Task :sdks:python:container:py38:dockerPushLatest
> Task :sdks:python:container:py38:dockerTagsPush
> Task :sdks:python:container:py37:dockerTagLatest
> Task :sdks:python:container:py37:dockerPushLatest
> Task :sdks:python:container:py37:dockerTagsPush
FAILURE: Build failed with an exception.
* What went wrong:
Execution failed for task ':sdks:java:container:pullLicenses'.
> Process 'command './license_scripts/license_script.sh'' finished with non-zero exit value 1
* Try:
> Run with --stacktrace option to get the stack trace.
> Run with --info or --debug option to get more log output.
> Run with --scan to get full insights.
* Get more help at https://help.gradle.org
Deprecated Gradle features were used in this build, making it incompatible with Gradle 8.0.
You can use '--warning-mode all' to show the individual deprecation warnings and determine if they come from your own scripts or plugins.
See https://docs.gradle.org/7.3.2/userguide/command_line_interface.html#sec:command_line_warnings
Execution optimizations have been disabled for 3 invalid unit(s) of work during this build to ensure correctness.
Please consult deprecation warnings for more details.
BUILD FAILED in 13m 15s
145 actionable tasks: 108 executed, 25 from cache, 12 up-to-date
Publishing build scan...
https://gradle.com/s/dnvamm6qhdaqo
Build step 'Invoke Gradle script' changed build result to FAILURE
Build step 'Invoke Gradle script' marked build as failure
---------------------------------------------------------------------
To unsubscribe, e-mail: builds-unsubscribe@beam.apache.org
For additional commands, e-mail: builds-help@beam.apache.org