You are viewing a plain text version of this content. The canonical link for it is here.
Posted to builds@beam.apache.org by Apache Jenkins Server <je...@builds.apache.org> on 2023/04/06 14:41:15 UTC
Build failed in Jenkins: beam_PostCommit_Go_VR_Spark #7408
See <https://ci-beam.apache.org/job/beam_PostCommit_Go_VR_Spark/7408/display/redirect>
Changes:
------------------------------------------
[...truncated 72.00 KB...]
#12 [ 8/18] COPY target/jamm.jar target/open-module-agent*.jar /opt/apache/beam/jars/
#12 DONE 0.1s
#13 [ 9/18] COPY target/linux_amd64/boot /opt/apache/beam/
#13 DONE 0.2s
#14 [10/18] COPY target/LICENSE /opt/apache/beam/
#14 DONE 0.1s
#15 [11/18] COPY target/NOTICE /opt/apache/beam/
#15 DONE 0.1s
#16 [12/18] ADD target/third_party_licenses /opt/apache/beam/third_party_licenses/
#16 DONE 0.2s
#17 [13/18] COPY target/LICENSE target/options/* /opt/apache/beam/options/
#17 DONE 0.1s
#18 [14/18] RUN rm /opt/apache/beam/options/LICENSE
#18 DONE 0.3s
#19 [15/18] COPY target/LICENSE target/go-licenses/* /opt/apache/beam/third_party_licenses/golang/
#19 DONE 0.1s
#20 [16/18] RUN rm /opt/apache/beam/third_party_licenses/golang/LICENSE
#20 DONE 0.4s
#21 [17/18] RUN if [ "true" = "false" ] ; then rm -rf /opt/apache/beam/third_party_licenses ; fi
#21 DONE 0.5s
#22 [18/18] COPY target/profiler/* /opt/google_cloud_profiler/
#22 DONE 0.1s
#23 exporting to image
#23 exporting layers
#23 exporting layers 0.3s done
#23 writing image sha256:2e75cba8f892f1883a946631110fa05fd8c9a56ef3e277502f9976ca96d249ad done
#23 naming to docker.io/apache/beam_java8_sdk:2.48.0.dev done
#23 DONE 0.3s
> Task :sdks:go:test:sparkValidatesRunner
$ CURRENT_DIRECTORY=<https://ci-beam.apache.org/job/beam_PostCommit_Go_VR_Spark/ws/src/sdks/go/test>
$ TESTS=./test/integration/... ./test/regression
$ RUNNER=portable
$ TIMEOUT=3h
$ SIMULTANEOUS=3
$ GCS_LOCATION=gs://temp-storage-for-end-to-end-tests
$ GCS_SUBFOLDER=test24858
$ PROJECT=apache-beam-testing
$ DATAFLOW_PROJECT=apache-beam-testing
$ REGION=us-central1
$ trap exit_background_processes SIGINT SIGTERM EXIT
$ key=--runner
$ case --runner in
$ RUNNER=spark
$ key=--spark_job_server_jar
$ case --spark_job_server_jar in
$ SPARK_JOB_SERVER_JAR=<https://ci-beam.apache.org/job/beam_PostCommit_Go_VR_Spark/ws/src/runners/spark/3/job-server/build/libs/beam-runners-spark-3-job-server-2.48.0-SNAPSHOT.jar>
$ key=--pipeline_opts
$ case --pipeline_opts in
$ PIPELINE_OPTS=--expansion_jar=test:<https://ci-beam.apache.org/job/beam_PostCommit_Go_VR_Spark/ws/src/sdks/java/testing/expansion-service/build/libs/beam-sdks-java-testing-expansion-service-testExpansionService-2.48.0-SNAPSHOT.jar>
$ cd <https://ci-beam.apache.org/job/beam_PostCommit_Go_VR_Spark/ws/src>
$ test -d sdks/go/test
$ JOB_PORT=59925
$ ENDPOINT=localhost:33251
No endpoint specified; starting a new spark job server on localhost:33251
$ java -jar <https://ci-beam.apache.org/job/beam_PostCommit_Go_VR_Spark/ws/src/runners/spark/3/job-server/build/libs/beam-runners-spark-3-job-server-2.48.0-SNAPSHOT.jar> --spark-master-url local --job-port 33251 --expansion-port 0 --artifact-port 0
$ JOBSERVER_PID=539337
$ SIMULTANEOUS=1
$ TAG=dev
$ ./gradlew :sdks:go:container:docker -Pdocker-tag=dev
To honour the JVM settings for this build a single-use Daemon process will be forked. See https://docs.gradle.org/7.5.1/userguide/gradle_daemon.html#sec:disabling_the_daemon.
Daemon will be stopped at the end of the build
Configuration on demand is an incubating feature.
23/04/06 14:40:49 WARN software.amazon.awssdk.regions.internal.util.EC2MetadataUtils: Unable to retrieve the requested metadata.
23/04/06 14:40:49 INFO org.apache.beam.runners.jobsubmission.JobServerDriver: ArtifactStagingService started on localhost:38029
23/04/06 14:40:50 INFO org.apache.beam.runners.jobsubmission.JobServerDriver: Java ExpansionService started on localhost:39197
23/04/06 14:40:50 INFO org.apache.beam.runners.jobsubmission.JobServerDriver: JobService started on localhost:33251
23/04/06 14:40:50 INFO org.apache.beam.runners.jobsubmission.JobServerDriver: Job server now running, terminate with Ctrl+C
> Task :buildSrc:compileJava NO-SOURCE
> Task :buildSrc:compileGroovy UP-TO-DATE
> Task :buildSrc:pluginDescriptors UP-TO-DATE
> Task :buildSrc:processResources UP-TO-DATE
> Task :buildSrc:classes UP-TO-DATE
> Task :buildSrc:jar UP-TO-DATE
> Task :buildSrc:assemble UP-TO-DATE
> Task :buildSrc:spotlessGroovy UP-TO-DATE
> Task :buildSrc:spotlessGroovyCheck UP-TO-DATE
> Task :buildSrc:spotlessGroovyGradle UP-TO-DATE
> Task :buildSrc:spotlessGroovyGradleCheck UP-TO-DATE
> Task :buildSrc:spotlessCheck UP-TO-DATE
> Task :buildSrc:pluginUnderTestMetadata UP-TO-DATE
> Task :buildSrc:compileTestJava NO-SOURCE
> Task :buildSrc:compileTestGroovy NO-SOURCE
> Task :buildSrc:processTestResources NO-SOURCE
> Task :buildSrc:testClasses UP-TO-DATE
> Task :buildSrc:test NO-SOURCE
> Task :buildSrc:validatePlugins UP-TO-DATE
> Task :buildSrc:check UP-TO-DATE
> Task :buildSrc:build UP-TO-DATE
System Go installation: /snap/bin/go is go version go1.16.15 linux/amd64; Preparing to use /home/jenkins/go/bin/go1.20.2
go1.20.2: already downloaded in /home/jenkins/sdk/go1.20.2
GOCMD=/home/jenkins/go/bin/go1.20.2
> Task :sdks:go:container:copyLicenses
> Task :sdks:go:container:dockerClean UP-TO-DATE
> Task :sdks:go:container:goPrepare UP-TO-DATE
> Task :sdks:go:container:goBuild
/home/jenkins/go/bin/go1.20.2 build -o ./build/target/linux_amd64/boot boot.go boot_test.go
> Task :sdks:go:container:skipPullLicenses
> Task :sdks:go:container:dockerPrepare
#1 [internal] load build definition from Dockerfile
#1 DONE 0.0s
> Task :sdks:go:container:docker
#1 [internal] load build definition from Dockerfile
#1 transferring dockerfile: 1.94kB done
#1 DONE 0.0s
#2 [internal] load .dockerignore
#2 transferring context: 2B done
#2 DONE 0.0s
#3 [internal] load metadata for docker.io/library/debian:bullseye
#3 DONE 0.3s
#4 [1/8] FROM docker.io/library/debian:bullseye@sha256:7b991788987ad860810df60927e1adbaf8e156520177bd4db82409f81dd3b721
#4 CACHED
#5 [internal] load build context
#5 transferring context: 22.20MB 0.2s done
#5 DONE 0.2s
#6 [2/8] RUN apt-get update && DEBIAN_FRONTEND=noninteractive apt-get install -y ca-certificates && rm -rf /var/lib/apt/lists/*
#6 0.429 Get:1 http://deb.debian.org/debian bullseye InRelease [116 kB]
#6 0.542 Get:2 http://deb.debian.org/debian-security bullseye-security InRelease [48.4 kB]
#6 0.586 Get:3 http://deb.debian.org/debian bullseye-updates InRelease [44.1 kB]
#6 0.697 Get:4 http://deb.debian.org/debian bullseye/main amd64 Packages [8183 kB]
#6 0.983 Get:5 http://deb.debian.org/debian-security bullseye-security/main amd64 Packages [236 kB]
#6 0.984 Get:6 http://deb.debian.org/debian bullseye-updates/main amd64 Packages [14.6 kB]
#6 2.277 Fetched 8642 kB in 2s (4476 kB/s)
#6 2.277 Reading package lists...
#6 2.940 Reading package lists...
#6 3.595 Building dependency tree...
#6 3.759 Reading state information...
#6 3.960 The following additional packages will be installed:
#6 3.961 openssl
#6 3.989 The following NEW packages will be installed:
#6 3.990 ca-certificates openssl
#6 4.086 0 upgraded, 2 newly installed, 0 to remove and 1 not upgraded.
#6 4.086 Need to get 1011 kB of archives.
#6 4.086 After this operation, 1892 kB of additional disk space will be used.
#6 4.086 Get:1 http://deb.debian.org/debian-security bullseye-security/main amd64 openssl amd64 1.1.1n-0+deb11u4 [853 kB]
#6 4.290 Get:2 http://deb.debian.org/debian bullseye/main amd64 ca-certificates all 20210119 [158 kB]
#6 4.450 debconf: delaying package configuration, since apt-utils is not installed
#6 4.485 Fetched 1011 kB in 0s (3408 kB/s)
#6 4.512 Selecting previously unselected package openssl.
#6 4.512 (Reading database ... (Reading database ... 5%(Reading database ... 10%(Reading database ... 15%(Reading database ... 20%(Reading database ... 25%(Reading database ... 30%(Reading database ... 35%(Reading database ... 40%(Reading database ... 45%(Reading database ... 50%(Reading database ... 55%(Reading database ... 60%(Reading database ... 65%(Reading database ... 70%(Reading database ... 75%(Reading database ... 80%(Reading database ... 85%(Reading database ... 90%(Reading database ... 95%(Reading database ... 100%(Reading database ... 6661 files and directories currently installed.)
#6 4.524 Preparing to unpack .../openssl_1.1.1n-0+deb11u4_amd64.deb ...
#6 4.529 Unpacking openssl (1.1.1n-0+deb11u4) ...
#6 4.651 Selecting previously unselected package ca-certificates.
#6 4.652 Preparing to unpack .../ca-certificates_20210119_all.deb ...
#6 4.657 Unpacking ca-certificates (20210119) ...
#6 4.732 Setting up openssl (1.1.1n-0+deb11u4) ...
#6 4.752 Setting up ca-certificates (20210119) ...
#6 5.369 Updating certificates in /etc/ssl/certs...
#6 6.127 129 added, 0 removed; done.
#6 6.173 Processing triggers for ca-certificates (20210119) ...
#6 6.183 Updating certificates in /etc/ssl/certs...
#6 6.811 0 added, 0 removed; done.
#6 6.811 Running hooks in /etc/ca-certificates/update.d...
#6 6.812 done.
#6 DONE 7.4s
#7 [3/8] ADD target/linux_amd64/boot /opt/apache/beam/
#7 DONE 0.2s
#8 [4/8] COPY target/LICENSE /opt/apache/beam/
#8 DONE 0.1s
#9 [5/8] COPY target/NOTICE /opt/apache/beam/
#9 DONE 0.1s
#10 [6/8] COPY target/LICENSE target/go-licenses/* /opt/apache/beam/third_party_licenses/golang/
#10 ERROR: lstat /var/lib/docker/tmp/buildkit-mount3424299474/target/go-licenses: no such file or directory
------
> [6/8] COPY target/LICENSE target/go-licenses/* /opt/apache/beam/third_party_licenses/golang/:
------
ERROR: failed to solve: lstat /var/lib/docker/tmp/buildkit-mount3424299474/target/go-licenses: no such file or directory
> Task :sdks:go:container:docker FAILED
FAILURE: Build failed with an exception.
* What went wrong:
Execution failed for task ':sdks:go:container:docker'.
> Process 'command 'docker'' finished with non-zero exit value 1
* Try:
> Run with --stacktrace option to get the stack trace.
> Run with --info or --debug option to get more log output.
* Get more help at https://help.gradle.org
BUILD FAILED in 24s
16 actionable tasks: 5 executed, 11 up-to-date
Publishing build scan...
https://gradle.com/s/7pqh6qmfxpa66
$ ./gradlew :sdks:go:container:docker -Pdocker-tag=dev
> Task :sdks:go:test:sparkValidatesRunner FAILED
FAILURE: Build failed with an exception.
* Where:
Build file '<https://ci-beam.apache.org/job/beam_PostCommit_Go_VR_Spark/ws/src/sdks/go/test/build.gradle'> line: 116
* What went wrong:
Execution failed for task ':sdks:go:test:sparkValidatesRunner'.
> Process 'command 'sh'' finished with non-zero exit value 1
* Try:
> Run with --stacktrace option to get the stack trace.
> Run with --info or --debug option to get more log output.
* Get more help at https://help.gradle.org
Deprecated Gradle features were used in this build, making it incompatible with Gradle 8.0.
You can use '--warning-mode all' to show the individual deprecation warnings and determine if they come from your own scripts or plugins.
See https://docs.gradle.org/7.5.1/userguide/command_line_interface.html#sec:command_line_warnings
Execution optimizations have been disabled for 1 invalid unit(s) of work during this build to ensure correctness.
Please consult deprecation warnings for more details.
BUILD FAILED in 1m 59s
117 actionable tasks: 74 executed, 39 from cache, 4 up-to-date
Publishing build scan...
https://gradle.com/s/qd7tvzwkweays
Build step 'Invoke Gradle script' changed build result to FAILURE
Build step 'Invoke Gradle script' marked build as failure
---------------------------------------------------------------------
To unsubscribe, e-mail: builds-unsubscribe@beam.apache.org
For additional commands, e-mail: builds-help@beam.apache.org
Jenkins build is back to normal : beam_PostCommit_Go_VR_Spark #7424
Posted by Apache Jenkins Server <je...@builds.apache.org>.
See <https://ci-beam.apache.org/job/beam_PostCommit_Go_VR_Spark/7424/display/redirect?page=changes>
---------------------------------------------------------------------
To unsubscribe, e-mail: builds-unsubscribe@beam.apache.org
For additional commands, e-mail: builds-help@beam.apache.org
Build failed in Jenkins: beam_PostCommit_Go_VR_Spark #7423
Posted by Apache Jenkins Server <je...@builds.apache.org>.
See <https://ci-beam.apache.org/job/beam_PostCommit_Go_VR_Spark/7423/display/redirect>
Changes:
------------------------------------------
[...truncated 56.29 KB...]
#11 [ 7/18] ADD target/beam-sdks-java-harness.jar /opt/apache/beam/jars/
#11 DONE 0.1s
#12 [ 8/18] COPY target/jamm.jar target/open-module-agent*.jar /opt/apache/beam/jars/
#12 DONE 0.1s
#13 [ 9/18] COPY target/linux_amd64/boot /opt/apache/beam/
#13 DONE 0.2s
#14 [10/18] COPY target/LICENSE /opt/apache/beam/
#14 DONE 0.1s
#15 [11/18] COPY target/NOTICE /opt/apache/beam/
#15 DONE 0.0s
#16 [12/18] ADD target/third_party_licenses /opt/apache/beam/third_party_licenses/
#16 DONE 0.2s
#17 [13/18] COPY target/LICENSE target/options/* /opt/apache/beam/options/
#17 DONE 0.1s
#18 [14/18] RUN rm /opt/apache/beam/options/LICENSE
#18 DONE 0.4s
#19 [15/18] COPY target/LICENSE target/go-licenses/* /opt/apache/beam/third_party_licenses/golang/
#19 DONE 0.1s
#20 [16/18] RUN rm /opt/apache/beam/third_party_licenses/golang/LICENSE
#20 DONE 0.4s
#21 [17/18] RUN if [ "true" = "false" ] ; then rm -rf /opt/apache/beam/third_party_licenses ; fi
#21 DONE 0.6s
#22 [18/18] COPY target/profiler/* /opt/google_cloud_profiler/
#22 DONE 0.1s
#23 exporting to image
#23 exporting layers
#23 exporting layers 0.3s done
#23 writing image sha256:e1765d3af63feb4e6db4b2c8366b41005c83bf57e37680de7d7d057dfc8f947d done
#23 naming to docker.io/apache/beam_java8_sdk:2.48.0.dev done
#23 DONE 0.3s
> Task :sdks:go:test:sparkValidatesRunner
$ CURRENT_DIRECTORY=<https://ci-beam.apache.org/job/beam_PostCommit_Go_VR_Spark/ws/src/sdks/go/test>
$ TESTS=./test/integration/... ./test/regression
$ RUNNER=portable
$ TIMEOUT=3h
$ SIMULTANEOUS=3
$ GCS_LOCATION=gs://temp-storage-for-end-to-end-tests
$ GCS_SUBFOLDER=test27509
$ PROJECT=apache-beam-testing
$ DATAFLOW_PROJECT=apache-beam-testing
$ REGION=us-central1
$ trap exit_background_processes SIGINT SIGTERM EXIT
$ key=--runner
$ case --runner in
$ RUNNER=spark
$ key=--spark_job_server_jar
$ case --spark_job_server_jar in
$ SPARK_JOB_SERVER_JAR=<https://ci-beam.apache.org/job/beam_PostCommit_Go_VR_Spark/ws/src/runners/spark/3/job-server/build/libs/beam-runners-spark-3-job-server-2.48.0-SNAPSHOT.jar>
$ key=--pipeline_opts
$ case --pipeline_opts in
$ PIPELINE_OPTS=--expansion_jar=test:<https://ci-beam.apache.org/job/beam_PostCommit_Go_VR_Spark/ws/src/sdks/java/testing/expansion-service/build/libs/beam-sdks-java-testing-expansion-service-testExpansionService-2.48.0-SNAPSHOT.jar>
$ cd <https://ci-beam.apache.org/job/beam_PostCommit_Go_VR_Spark/ws/src>
$ test -d sdks/go/test
$ JOB_PORT=44677
$ ENDPOINT=localhost:43229
No endpoint specified; starting a new spark job server on localhost:43229
$ java -jar <https://ci-beam.apache.org/job/beam_PostCommit_Go_VR_Spark/ws/src/runners/spark/3/job-server/build/libs/beam-runners-spark-3-job-server-2.48.0-SNAPSHOT.jar> --spark-master-url local --job-port 43229 --expansion-port 0 --artifact-port 0
$ JOBSERVER_PID=82447
$ SIMULTANEOUS=1
$ TAG=dev
$ ./gradlew :sdks:go:container:docker -Pdocker-tag=dev
To honour the JVM settings for this build a single-use Daemon process will be forked. See https://docs.gradle.org/7.5.1/userguide/gradle_daemon.html#sec:disabling_the_daemon.
Daemon will be stopped at the end of the build
Configuration on demand is an incubating feature.
23/04/10 08:40:35 WARN software.amazon.awssdk.regions.internal.util.EC2MetadataUtils: Unable to retrieve the requested metadata.
23/04/10 08:40:35 INFO org.apache.beam.runners.jobsubmission.JobServerDriver: ArtifactStagingService started on localhost:42047
23/04/10 08:40:35 INFO org.apache.beam.runners.jobsubmission.JobServerDriver: Java ExpansionService started on localhost:45207
23/04/10 08:40:35 INFO org.apache.beam.runners.jobsubmission.JobServerDriver: JobService started on localhost:43229
23/04/10 08:40:35 INFO org.apache.beam.runners.jobsubmission.JobServerDriver: Job server now running, terminate with Ctrl+C
> Task :buildSrc:compileJava NO-SOURCE
> Task :buildSrc:compileGroovy UP-TO-DATE
> Task :buildSrc:pluginDescriptors UP-TO-DATE
> Task :buildSrc:processResources UP-TO-DATE
> Task :buildSrc:classes UP-TO-DATE
> Task :buildSrc:jar UP-TO-DATE
> Task :buildSrc:assemble UP-TO-DATE
> Task :buildSrc:spotlessGroovy UP-TO-DATE
> Task :buildSrc:spotlessGroovyCheck UP-TO-DATE
> Task :buildSrc:spotlessGroovyGradle UP-TO-DATE
> Task :buildSrc:spotlessGroovyGradleCheck UP-TO-DATE
> Task :buildSrc:spotlessCheck UP-TO-DATE
> Task :buildSrc:pluginUnderTestMetadata UP-TO-DATE
> Task :buildSrc:compileTestJava NO-SOURCE
> Task :buildSrc:compileTestGroovy NO-SOURCE
> Task :buildSrc:processTestResources NO-SOURCE
> Task :buildSrc:testClasses UP-TO-DATE
> Task :buildSrc:test NO-SOURCE
> Task :buildSrc:validatePlugins UP-TO-DATE
> Task :buildSrc:check UP-TO-DATE
> Task :buildSrc:build UP-TO-DATE
System Go installation: /snap/bin/go is go version go1.16.15 linux/amd64; Preparing to use /home/jenkins/go/bin/go1.20.2
go1.20.2: already downloaded in /home/jenkins/sdk/go1.20.2
GOCMD=/home/jenkins/go/bin/go1.20.2
> Task :sdks:go:container:copyLicenses
> Task :sdks:go:container:dockerClean UP-TO-DATE
> Task :sdks:go:container:goPrepare UP-TO-DATE
> Task :sdks:go:container:goBuild
/home/jenkins/go/bin/go1.20.2 build -o ./build/target/linux_amd64/boot boot.go boot_test.go
> Task :sdks:go:container:skipPullLicenses
> Task :sdks:go:container:dockerPrepare
#1 [internal] load build definition from Dockerfile
#1 transferring dockerfile: 1.94kB done
#1 DONE 0.0s> Task :sdks:go:container:docker
#2 [internal] load .dockerignore
#2 transferring context: 2B done
#2 DONE 0.0s
#3 [internal] load metadata for docker.io/library/debian:bullseye
#3 DONE 0.3s
#4 [1/8] FROM docker.io/library/debian:bullseye@sha256:7b991788987ad860810df60927e1adbaf8e156520177bd4db82409f81dd3b721
#4 CACHED
#5 [internal] load build context
#5 transferring context: 22.20MB 0.3s done
#5 DONE 0.3s
#6 [2/8] RUN apt-get update && DEBIAN_FRONTEND=noninteractive apt-get install -y ca-certificates && rm -rf /var/lib/apt/lists/*
#6 0.485 Get:1 http://deb.debian.org/debian bullseye InRelease [116 kB]
#6 0.600 Get:2 http://deb.debian.org/debian-security bullseye-security InRelease [48.4 kB]
#6 0.643 Get:3 http://deb.debian.org/debian bullseye-updates InRelease [44.1 kB]
#6 0.788 Get:4 http://deb.debian.org/debian bullseye/main amd64 Packages [8183 kB]
#6 1.072 Get:5 http://deb.debian.org/debian-security bullseye-security/main amd64 Packages [236 kB]
#6 1.073 Get:6 http://deb.debian.org/debian bullseye-updates/main amd64 Packages [14.6 kB]
#6 2.415 Fetched 8642 kB in 2s (4300 kB/s)
#6 2.415 Reading package lists...
#6 3.119 Reading package lists...
#6 3.853 Building dependency tree...
#6 4.021 Reading state information...
#6 4.187 The following additional packages will be installed:
#6 4.188 openssl
#6 4.215 The following NEW packages will be installed:
#6 4.216 ca-certificates openssl
#6 4.287 0 upgraded, 2 newly installed, 0 to remove and 1 not upgraded.
#6 4.287 Need to get 1011 kB of archives.
#6 4.287 After this operation, 1892 kB of additional disk space will be used.
#6 4.287 Get:1 http://deb.debian.org/debian-security bullseye-security/main amd64 openssl amd64 1.1.1n-0+deb11u4 [853 kB]
#6 4.425 Get:2 http://deb.debian.org/debian bullseye/main amd64 ca-certificates all 20210119 [158 kB]
#6 4.591 debconf: delaying package configuration, since apt-utils is not installed
#6 4.641 Fetched 1011 kB in 0s (4926 kB/s)
#6 4.677 Selecting previously unselected package openssl.
#6 4.677 (Reading database ... (Reading database ... 5%(Reading database ... 10%(Reading database ... 15%(Reading database ... 20%(Reading database ... 25%(Reading database ... 30%(Reading database ... 35%(Reading database ... 40%(Reading database ... 45%(Reading database ... 50%(Reading database ... 55%(Reading database ... 60%(Reading database ... 65%(Reading database ... 70%(Reading database ... 75%(Reading database ... 80%(Reading database ... 85%(Reading database ... 90%(Reading database ... 95%(Reading database ... 100%(Reading database ... 6661 files and directories currently installed.)
#6 4.690 Preparing to unpack .../openssl_1.1.1n-0+deb11u4_amd64.deb ...
#6 4.698 Unpacking openssl (1.1.1n-0+deb11u4) ...
#6 4.830 Selecting previously unselected package ca-certificates.
#6 4.832 Preparing to unpack .../ca-certificates_20210119_all.deb ...
#6 4.837 Unpacking ca-certificates (20210119) ...
#6 4.916 Setting up openssl (1.1.1n-0+deb11u4) ...
#6 4.936 Setting up ca-certificates (20210119) ...
#6 5.547 Updating certificates in /etc/ssl/certs...
#6 6.277 129 added, 0 removed; done.
#6 6.339 Processing triggers for ca-certificates (20210119) ...
#6 6.352 Updating certificates in /etc/ssl/certs...
#6 6.987 0 added, 0 removed; done.
#6 6.987 Running hooks in /etc/ca-certificates/update.d...
#6 6.988 done.
#6 DONE 7.6s
#7 [3/8] ADD target/linux_amd64/boot /opt/apache/beam/
#7 DONE 0.2s
#8 [4/8] COPY target/LICENSE /opt/apache/beam/
#8 DONE 0.1s
#9 [5/8] COPY target/NOTICE /opt/apache/beam/
#9 DONE 0.1s
#10 [6/8] COPY target/LICENSE target/go-licenses/* /opt/apache/beam/third_party_licenses/golang/
#10 ERROR: lstat /var/lib/docker/tmp/buildkit-mount2934358250/target/go-licenses: no such file or directory
------
> [6/8] COPY target/LICENSE target/go-licenses/* /opt/apache/beam/third_party_licenses/golang/:
------
ERROR: failed to solve: lstat /var/lib/docker/tmp/buildkit-mount2934358250/target/go-licenses: no such file or directory
> Task :sdks:go:container:docker FAILED
FAILURE: Build failed with an exception.
* What went wrong:
Execution failed for task ':sdks:go:container:docker'.
> Process 'command 'docker'' finished with non-zero exit value 1
* Try:
> Run with --stacktrace option to get the stack trace.
> Run with --info or --debug option to get more log output.
* Get more help at https://help.gradle.org
BUILD FAILED in 26s
16 actionable tasks: 5 executed, 11 up-to-date
Publishing build scan...
https://gradle.com/s/3bdk5vo7ldxpu
$ ./gradlew :sdks:go:container:docker -Pdocker-tag=dev
> Task :sdks:go:test:sparkValidatesRunner FAILED
FAILURE: Build failed with an exception.
* Where:
Build file '<https://ci-beam.apache.org/job/beam_PostCommit_Go_VR_Spark/ws/src/sdks/go/test/build.gradle'> line: 116
* What went wrong:
Execution failed for task ':sdks:go:test:sparkValidatesRunner'.
> Process 'command 'sh'' finished with non-zero exit value 1
* Try:
> Run with --stacktrace option to get the stack trace.
> Run with --info or --debug option to get more log output.
* Get more help at https://help.gradle.org
Deprecated Gradle features were used in this build, making it incompatible with Gradle 8.0.
You can use '--warning-mode all' to show the individual deprecation warnings and determine if they come from your own scripts or plugins.
See https://docs.gradle.org/7.5.1/userguide/command_line_interface.html#sec:command_line_warnings
Execution optimizations have been disabled for 1 invalid unit(s) of work during this build to ensure correctness.
Please consult deprecation warnings for more details.
BUILD FAILED in 1m 36s
117 actionable tasks: 74 executed, 39 from cache, 4 up-to-date
Publishing build scan...
https://gradle.com/s/p52vuuh7565cs
Build step 'Invoke Gradle script' changed build result to FAILURE
Build step 'Invoke Gradle script' marked build as failure
---------------------------------------------------------------------
To unsubscribe, e-mail: builds-unsubscribe@beam.apache.org
For additional commands, e-mail: builds-help@beam.apache.org
Build failed in Jenkins: beam_PostCommit_Go_VR_Spark #7422
Posted by Apache Jenkins Server <je...@builds.apache.org>.
See <https://ci-beam.apache.org/job/beam_PostCommit_Go_VR_Spark/7422/display/redirect>
Changes:
------------------------------------------
[...truncated 56.34 KB...]
#11 [ 7/18] ADD target/beam-sdks-java-harness.jar /opt/apache/beam/jars/
#11 DONE 0.1s
#12 [ 8/18] COPY target/jamm.jar target/open-module-agent*.jar /opt/apache/beam/jars/
#12 DONE 0.1s
#13 [ 9/18] COPY target/linux_amd64/boot /opt/apache/beam/
#13 DONE 0.2s
#14 [10/18] COPY target/LICENSE /opt/apache/beam/
#14 DONE 0.1s
#15 [11/18] COPY target/NOTICE /opt/apache/beam/
#15 DONE 0.0s
#16 [12/18] ADD target/third_party_licenses /opt/apache/beam/third_party_licenses/
#16 DONE 0.2s
#17 [13/18] COPY target/LICENSE target/options/* /opt/apache/beam/options/
#17 DONE 0.1s
#18 [14/18] RUN rm /opt/apache/beam/options/LICENSE
#18 DONE 0.3s
#19 [15/18] COPY target/LICENSE target/go-licenses/* /opt/apache/beam/third_party_licenses/golang/
#19 DONE 0.0s
#20 [16/18] RUN rm /opt/apache/beam/third_party_licenses/golang/LICENSE
#20 DONE 0.4s
#21 [17/18] RUN if [ "true" = "false" ] ; then rm -rf /opt/apache/beam/third_party_licenses ; fi
#21 DONE 0.4s
#22 [18/18] COPY target/profiler/* /opt/google_cloud_profiler/
#22 DONE 0.1s
#23 exporting to image
#23 exporting layers
#23 exporting layers 0.2s done
#23 writing image sha256:aaba1fddb81e92ea9f6c0cc62b53b32078bebb85d06c967736d7822b7228559b done
#23 naming to docker.io/apache/beam_java8_sdk:2.48.0.dev done
#23 DONE 0.2s
> Task :sdks:go:test:sparkValidatesRunner
$ CURRENT_DIRECTORY=<https://ci-beam.apache.org/job/beam_PostCommit_Go_VR_Spark/ws/src/sdks/go/test>
$ TESTS=./test/integration/... ./test/regression
$ RUNNER=portable
$ TIMEOUT=3h
$ SIMULTANEOUS=3
$ GCS_LOCATION=gs://temp-storage-for-end-to-end-tests
$ GCS_SUBFOLDER=test8200
$ PROJECT=apache-beam-testing
$ DATAFLOW_PROJECT=apache-beam-testing
$ REGION=us-central1
$ trap exit_background_processes SIGINT SIGTERM EXIT
$ key=--runner
$ case --runner in
$ RUNNER=spark
$ key=--spark_job_server_jar
$ case --spark_job_server_jar in
$ SPARK_JOB_SERVER_JAR=<https://ci-beam.apache.org/job/beam_PostCommit_Go_VR_Spark/ws/src/runners/spark/3/job-server/build/libs/beam-runners-spark-3-job-server-2.48.0-SNAPSHOT.jar>
$ key=--pipeline_opts
$ case --pipeline_opts in
$ PIPELINE_OPTS=--expansion_jar=test:<https://ci-beam.apache.org/job/beam_PostCommit_Go_VR_Spark/ws/src/sdks/java/testing/expansion-service/build/libs/beam-sdks-java-testing-expansion-service-testExpansionService-2.48.0-SNAPSHOT.jar>
$ cd <https://ci-beam.apache.org/job/beam_PostCommit_Go_VR_Spark/ws/src>
$ test -d sdks/go/test
$ JOB_PORT=40439
$ ENDPOINT=localhost:50355
No endpoint specified; starting a new spark job server on localhost:50355
$ java -jar <https://ci-beam.apache.org/job/beam_PostCommit_Go_VR_Spark/ws/src/runners/spark/3/job-server/build/libs/beam-runners-spark-3-job-server-2.48.0-SNAPSHOT.jar> --spark-master-url local --job-port 50355 --expansion-port 0 --artifact-port 0
$ JOBSERVER_PID=56841
$ SIMULTANEOUS=1
$ TAG=dev
$ ./gradlew :sdks:go:container:docker -Pdocker-tag=dev
To honour the JVM settings for this build a single-use Daemon process will be forked. See https://docs.gradle.org/7.5.1/userguide/gradle_daemon.html#sec:disabling_the_daemon.
Daemon will be stopped at the end of the build
Configuration on demand is an incubating feature.
23/04/10 02:40:20 WARN software.amazon.awssdk.regions.internal.util.EC2MetadataUtils: Unable to retrieve the requested metadata.
23/04/10 02:40:20 INFO org.apache.beam.runners.jobsubmission.JobServerDriver: ArtifactStagingService started on localhost:46311
23/04/10 02:40:20 INFO org.apache.beam.runners.jobsubmission.JobServerDriver: Java ExpansionService started on localhost:35603
23/04/10 02:40:20 INFO org.apache.beam.runners.jobsubmission.JobServerDriver: JobService started on localhost:50355
23/04/10 02:40:20 INFO org.apache.beam.runners.jobsubmission.JobServerDriver: Job server now running, terminate with Ctrl+C
> Task :buildSrc:compileJava NO-SOURCE
> Task :buildSrc:compileGroovy UP-TO-DATE
> Task :buildSrc:pluginDescriptors UP-TO-DATE
> Task :buildSrc:processResources UP-TO-DATE
> Task :buildSrc:classes UP-TO-DATE
> Task :buildSrc:jar UP-TO-DATE
> Task :buildSrc:assemble UP-TO-DATE
> Task :buildSrc:spotlessGroovy UP-TO-DATE
> Task :buildSrc:spotlessGroovyCheck UP-TO-DATE
> Task :buildSrc:spotlessGroovyGradle UP-TO-DATE
> Task :buildSrc:spotlessGroovyGradleCheck UP-TO-DATE
> Task :buildSrc:spotlessCheck UP-TO-DATE
> Task :buildSrc:pluginUnderTestMetadata UP-TO-DATE
> Task :buildSrc:compileTestJava NO-SOURCE
> Task :buildSrc:compileTestGroovy NO-SOURCE
> Task :buildSrc:processTestResources NO-SOURCE
> Task :buildSrc:testClasses UP-TO-DATE
> Task :buildSrc:test NO-SOURCE
> Task :buildSrc:validatePlugins UP-TO-DATE
> Task :buildSrc:check UP-TO-DATE
> Task :buildSrc:build UP-TO-DATE
System Go installation: /snap/bin/go is go version go1.16.15 linux/amd64; Preparing to use /home/jenkins/go/bin/go1.20.2
go1.20.2: already downloaded in /home/jenkins/sdk/go1.20.2
GOCMD=/home/jenkins/go/bin/go1.20.2
> Task :sdks:go:container:copyLicenses
> Task :sdks:go:container:dockerClean UP-TO-DATE
> Task :sdks:go:container:goPrepare UP-TO-DATE
> Task :sdks:go:container:goBuild
/home/jenkins/go/bin/go1.20.2 build -o ./build/target/linux_amd64/boot boot.go boot_test.go
> Task :sdks:go:container:skipPullLicenses
> Task :sdks:go:container:dockerPrepare
#1 [internal] load build definition from Dockerfile
> Task :sdks:go:container:docker
#1 transferring dockerfile: 1.94kB done
#1 DONE 0.0s
#2 [internal] load .dockerignore
#2 transferring context: 2B done
#2 DONE 0.0s
#3 [internal] load metadata for docker.io/library/debian:bullseye
#3 DONE 0.3s
#4 [1/8] FROM docker.io/library/debian:bullseye@sha256:7b991788987ad860810df60927e1adbaf8e156520177bd4db82409f81dd3b721
#4 CACHED
#5 [internal] load build context
#5 transferring context: 22.20MB 0.2s done
#5 DONE 0.2s
#6 [2/8] RUN apt-get update && DEBIAN_FRONTEND=noninteractive apt-get install -y ca-certificates && rm -rf /var/lib/apt/lists/*
#6 0.310 Get:1 http://deb.debian.org/debian bullseye InRelease [116 kB]
#6 0.342 Get:2 http://deb.debian.org/debian-security bullseye-security InRelease [48.4 kB]
#6 0.356 Get:3 http://deb.debian.org/debian bullseye-updates InRelease [44.1 kB]
#6 0.491 Get:4 http://deb.debian.org/debian bullseye/main amd64 Packages [8183 kB]
#6 0.603 Get:5 http://deb.debian.org/debian-security bullseye-security/main amd64 Packages [236 kB]
#6 0.678 Get:6 http://deb.debian.org/debian bullseye-updates/main amd64 Packages [14.6 kB]
#6 1.880 Fetched 8642 kB in 2s (5417 kB/s)
#6 1.880 Reading package lists...
#6 2.493 Reading package lists...
#6 3.088 Building dependency tree...
#6 3.221 Reading state information...
#6 3.359 The following additional packages will be installed:
#6 3.359 openssl
#6 3.381 The following NEW packages will be installed:
#6 3.382 ca-certificates openssl
#6 3.478 0 upgraded, 2 newly installed, 0 to remove and 1 not upgraded.
#6 3.478 Need to get 1011 kB of archives.
#6 3.478 After this operation, 1892 kB of additional disk space will be used.
#6 3.478 Get:1 http://deb.debian.org/debian-security bullseye-security/main amd64 openssl amd64 1.1.1n-0+deb11u4 [853 kB]
#6 3.682 Get:2 http://deb.debian.org/debian bullseye/main amd64 ca-certificates all 20210119 [158 kB]
#6 3.827 debconf: delaying package configuration, since apt-utils is not installed
#6 3.855 Fetched 1011 kB in 0s (3394 kB/s)
#6 3.875 Selecting previously unselected package openssl.
#6 3.875 (Reading database ... (Reading database ... 5%(Reading database ... 10%(Reading database ... 15%(Reading database ... 20%(Reading database ... 25%(Reading database ... 30%(Reading database ... 35%(Reading database ... 40%(Reading database ... 45%(Reading database ... 50%(Reading database ... 55%(Reading database ... 60%(Reading database ... 65%(Reading database ... 70%(Reading database ... 75%(Reading database ... 80%(Reading database ... 85%(Reading database ... 90%(Reading database ... 95%(Reading database ... 100%(Reading database ... 6661 files and directories currently installed.)
#6 3.883 Preparing to unpack .../openssl_1.1.1n-0+deb11u4_amd64.deb ...
#6 3.886 Unpacking openssl (1.1.1n-0+deb11u4) ...
#6 3.993 Selecting previously unselected package ca-certificates.
#6 3.994 Preparing to unpack .../ca-certificates_20210119_all.deb ...
#6 3.997 Unpacking ca-certificates (20210119) ...
#6 4.055 Setting up openssl (1.1.1n-0+deb11u4) ...
#6 4.069 Setting up ca-certificates (20210119) ...
#6 4.582 Updating certificates in /etc/ssl/certs...
#6 5.188 129 added, 0 removed; done.
#6 5.225 Processing triggers for ca-certificates (20210119) ...
#6 5.233 Updating certificates in /etc/ssl/certs...
#6 5.728 0 added, 0 removed; done.
#6 5.728 Running hooks in /etc/ca-certificates/update.d...
#6 5.729 done.
#6 DONE 6.3s
#7 [3/8] ADD target/linux_amd64/boot /opt/apache/beam/
#7 DONE 0.3s
#8 [4/8] COPY target/LICENSE /opt/apache/beam/
#8 DONE 0.1s
#9 [5/8] COPY target/NOTICE /opt/apache/beam/
#9 DONE 0.1s
#10 [6/8] COPY target/LICENSE target/go-licenses/* /opt/apache/beam/third_party_licenses/golang/
#10 ERROR: lstat /var/lib/docker/tmp/buildkit-mount2905412650/target/go-licenses: no such file or directory
------
> [6/8] COPY target/LICENSE target/go-licenses/* /opt/apache/beam/third_party_licenses/golang/:
------
ERROR: failed to solve: lstat /var/lib/docker/tmp/buildkit-mount2905412650/target/go-licenses: no such file or directory
> Task :sdks:go:container:docker FAILED
FAILURE: Build failed with an exception.
* What went wrong:
Execution failed for task ':sdks:go:container:docker'.
> Process 'command 'docker'' finished with non-zero exit value 1
* Try:
> Run with --stacktrace option to get the stack trace.
> Run with --info or --debug option to get more log output.
* Get more help at https://help.gradle.org
BUILD FAILED in 19s
16 actionable tasks: 5 executed, 11 up-to-date
Publishing build scan...
https://gradle.com/s/ar4m6a4ubywgq
$ ./gradlew :sdks:go:container:docker -Pdocker-tag=dev
> Task :sdks:go:test:sparkValidatesRunner FAILED
FAILURE: Build failed with an exception.
* Where:
Build file '<https://ci-beam.apache.org/job/beam_PostCommit_Go_VR_Spark/ws/src/sdks/go/test/build.gradle'> line: 116
* What went wrong:
Execution failed for task ':sdks:go:test:sparkValidatesRunner'.
> Process 'command 'sh'' finished with non-zero exit value 1
* Try:
> Run with --stacktrace option to get the stack trace.
> Run with --info or --debug option to get more log output.
* Get more help at https://help.gradle.org
Deprecated Gradle features were used in this build, making it incompatible with Gradle 8.0.
You can use '--warning-mode all' to show the individual deprecation warnings and determine if they come from your own scripts or plugins.
See https://docs.gradle.org/7.5.1/userguide/command_line_interface.html#sec:command_line_warnings
Execution optimizations have been disabled for 1 invalid unit(s) of work during this build to ensure correctness.
Please consult deprecation warnings for more details.
BUILD FAILED in 1m 16s
117 actionable tasks: 74 executed, 39 from cache, 4 up-to-date
Publishing build scan...
https://gradle.com/s/fbsayk6den6by
Build step 'Invoke Gradle script' changed build result to FAILURE
Build step 'Invoke Gradle script' marked build as failure
---------------------------------------------------------------------
To unsubscribe, e-mail: builds-unsubscribe@beam.apache.org
For additional commands, e-mail: builds-help@beam.apache.org
Build failed in Jenkins: beam_PostCommit_Go_VR_Spark #7421
Posted by Apache Jenkins Server <je...@builds.apache.org>.
See <https://ci-beam.apache.org/job/beam_PostCommit_Go_VR_Spark/7421/display/redirect>
Changes:
------------------------------------------
[...truncated 56.64 KB...]
#11 [ 7/18] ADD target/beam-sdks-java-harness.jar /opt/apache/beam/jars/
#11 DONE 0.1s
#12 [ 8/18] COPY target/jamm.jar target/open-module-agent*.jar /opt/apache/beam/jars/
#12 DONE 0.1s
#13 [ 9/18] COPY target/linux_amd64/boot /opt/apache/beam/
#13 DONE 0.2s
#14 [10/18] COPY target/LICENSE /opt/apache/beam/
#14 DONE 0.1s
#15 [11/18] COPY target/NOTICE /opt/apache/beam/
#15 DONE 0.1s
#16 [12/18] ADD target/third_party_licenses /opt/apache/beam/third_party_licenses/
#16 DONE 0.2s
#17 [13/18] COPY target/LICENSE target/options/* /opt/apache/beam/options/
#17 DONE 0.1s
#18 [14/18] RUN rm /opt/apache/beam/options/LICENSE
#18 DONE 0.3s
#19 [15/18] COPY target/LICENSE target/go-licenses/* /opt/apache/beam/third_party_licenses/golang/
#19 DONE 0.0s
#20 [16/18] RUN rm /opt/apache/beam/third_party_licenses/golang/LICENSE
#20 DONE 0.4s
#21 [17/18] RUN if [ "true" = "false" ] ; then rm -rf /opt/apache/beam/third_party_licenses ; fi
#21 DONE 0.4s
#22 [18/18] COPY target/profiler/* /opt/google_cloud_profiler/
#22 DONE 0.1s
#23 exporting to image
#23 exporting layers
#23 exporting layers 0.2s done
#23 writing image sha256:d7527ed637337bf18ead4f17de84dade0b58a4451e60e0b281e912fb4d072056 done
#23 naming to docker.io/apache/beam_java8_sdk:2.48.0.dev done
#23 DONE 0.2s
> Task :sdks:go:test:sparkValidatesRunner
$ CURRENT_DIRECTORY=<https://ci-beam.apache.org/job/beam_PostCommit_Go_VR_Spark/ws/src/sdks/go/test>
$ TESTS=./test/integration/... ./test/regression
$ RUNNER=portable
$ TIMEOUT=3h
$ SIMULTANEOUS=3
$ GCS_LOCATION=gs://temp-storage-for-end-to-end-tests
$ GCS_SUBFOLDER=test730
$ PROJECT=apache-beam-testing
$ DATAFLOW_PROJECT=apache-beam-testing
$ REGION=us-central1
$ trap exit_background_processes SIGINT SIGTERM EXIT
$ key=--runner
$ case --runner in
$ RUNNER=spark
$ key=--spark_job_server_jar
$ case --spark_job_server_jar in
$ SPARK_JOB_SERVER_JAR=<https://ci-beam.apache.org/job/beam_PostCommit_Go_VR_Spark/ws/src/runners/spark/3/job-server/build/libs/beam-runners-spark-3-job-server-2.48.0-SNAPSHOT.jar>
$ key=--pipeline_opts
$ case --pipeline_opts in
$ PIPELINE_OPTS=--expansion_jar=test:<https://ci-beam.apache.org/job/beam_PostCommit_Go_VR_Spark/ws/src/sdks/java/testing/expansion-service/build/libs/beam-sdks-java-testing-expansion-service-testExpansionService-2.48.0-SNAPSHOT.jar>
$ cd <https://ci-beam.apache.org/job/beam_PostCommit_Go_VR_Spark/ws/src>
$ test -d sdks/go/test
$ JOB_PORT=41169
$ ENDPOINT=localhost:44155
No endpoint specified; starting a new spark job server on localhost:44155
$ java -jar <https://ci-beam.apache.org/job/beam_PostCommit_Go_VR_Spark/ws/src/runners/spark/3/job-server/build/libs/beam-runners-spark-3-job-server-2.48.0-SNAPSHOT.jar> --spark-master-url local --job-port 44155 --expansion-port 0 --artifact-port 0
$ JOBSERVER_PID=20910
$ SIMULTANEOUS=1
$ TAG=dev
$ ./gradlew :sdks:go:container:docker -Pdocker-tag=dev
To honour the JVM settings for this build a single-use Daemon process will be forked. See https://docs.gradle.org/7.5.1/userguide/gradle_daemon.html#sec:disabling_the_daemon.
Daemon will be stopped at the end of the build
Configuration on demand is an incubating feature.
23/04/09 20:40:27 WARN software.amazon.awssdk.regions.internal.util.EC2MetadataUtils: Unable to retrieve the requested metadata.
23/04/09 20:40:27 INFO org.apache.beam.runners.jobsubmission.JobServerDriver: ArtifactStagingService started on localhost:37311
23/04/09 20:40:27 INFO org.apache.beam.runners.jobsubmission.JobServerDriver: Java ExpansionService started on localhost:39497
23/04/09 20:40:27 INFO org.apache.beam.runners.jobsubmission.JobServerDriver: JobService started on localhost:44155
23/04/09 20:40:27 INFO org.apache.beam.runners.jobsubmission.JobServerDriver: Job server now running, terminate with Ctrl+C
> Task :buildSrc:compileJava NO-SOURCE
> Task :buildSrc:compileGroovy UP-TO-DATE
> Task :buildSrc:pluginDescriptors UP-TO-DATE
> Task :buildSrc:processResources UP-TO-DATE
> Task :buildSrc:classes UP-TO-DATE
> Task :buildSrc:jar UP-TO-DATE
> Task :buildSrc:assemble UP-TO-DATE
> Task :buildSrc:spotlessGroovy UP-TO-DATE
> Task :buildSrc:spotlessGroovyCheck UP-TO-DATE
> Task :buildSrc:spotlessGroovyGradle UP-TO-DATE
> Task :buildSrc:spotlessGroovyGradleCheck UP-TO-DATE
> Task :buildSrc:spotlessCheck UP-TO-DATE
> Task :buildSrc:pluginUnderTestMetadata UP-TO-DATE
> Task :buildSrc:compileTestJava NO-SOURCE
> Task :buildSrc:compileTestGroovy NO-SOURCE
> Task :buildSrc:processTestResources NO-SOURCE
> Task :buildSrc:testClasses UP-TO-DATE
> Task :buildSrc:test NO-SOURCE
> Task :buildSrc:validatePlugins UP-TO-DATE
> Task :buildSrc:check UP-TO-DATE
> Task :buildSrc:build UP-TO-DATE
System Go installation: /snap/bin/go is go version go1.16.15 linux/amd64; Preparing to use /home/jenkins/go/bin/go1.20.2
go1.20.2: already downloaded in /home/jenkins/sdk/go1.20.2
GOCMD=/home/jenkins/go/bin/go1.20.2
> Task :sdks:go:container:copyLicenses
> Task :sdks:go:container:dockerClean UP-TO-DATE
> Task :sdks:go:container:goPrepare UP-TO-DATE
> Task :sdks:go:container:goBuild
/home/jenkins/go/bin/go1.20.2 build -o ./build/target/linux_amd64/boot boot.go boot_test.go
> Task :sdks:go:container:skipPullLicenses
> Task :sdks:go:container:dockerPrepare
#1 [internal] load build definition from Dockerfile
> Task :sdks:go:container:docker
#1 transferring dockerfile: 1.94kB done
#1 DONE 0.0s
#2 [internal] load .dockerignore
#2 transferring context: 2B done
#2 DONE 0.0s
#3 [internal] load metadata for docker.io/library/debian:bullseye
#3 DONE 0.5s
#4 [1/8] FROM docker.io/library/debian:bullseye@sha256:7b991788987ad860810df60927e1adbaf8e156520177bd4db82409f81dd3b721
#4 CACHED
#5 [internal] load build context
#5 transferring context: 22.20MB 0.2s done
#5 DONE 0.2s
#6 [2/8] RUN apt-get update && DEBIAN_FRONTEND=noninteractive apt-get install -y ca-certificates && rm -rf /var/lib/apt/lists/*
#6 0.428 Get:1 http://deb.debian.org/debian bullseye InRelease [116 kB]
#6 0.505 Get:2 http://deb.debian.org/debian-security bullseye-security InRelease [48.4 kB]
#6 0.535 Get:3 http://deb.debian.org/debian bullseye-updates InRelease [44.1 kB]
#6 0.627 Get:4 http://deb.debian.org/debian bullseye/main amd64 Packages [8183 kB]
#6 0.824 Get:5 http://deb.debian.org/debian-security bullseye-security/main amd64 Packages [236 kB]
#6 0.853 Get:6 http://deb.debian.org/debian bullseye-updates/main amd64 Packages [14.6 kB]
#6 2.101 Fetched 8642 kB in 2s (4962 kB/s)
#6 2.101 Reading package lists...
#6 2.771 Reading package lists...
#6 3.380 Building dependency tree...
#6 3.522 Reading state information...
#6 3.730 The following additional packages will be installed:
#6 3.730 openssl
#6 3.753 The following NEW packages will be installed:
#6 3.754 ca-certificates openssl
#6 3.824 0 upgraded, 2 newly installed, 0 to remove and 1 not upgraded.
#6 3.824 Need to get 1011 kB of archives.
#6 3.824 After this operation, 1892 kB of additional disk space will be used.
#6 3.824 Get:1 http://deb.debian.org/debian-security bullseye-security/main amd64 openssl amd64 1.1.1n-0+deb11u4 [853 kB]
#6 3.966 Get:2 http://deb.debian.org/debian bullseye/main amd64 ca-certificates all 20210119 [158 kB]
#6 4.232 debconf: delaying package configuration, since apt-utils is not installed
#6 4.261 Fetched 1011 kB in 0s (4873 kB/s)
#6 4.283 Selecting previously unselected package openssl.
#6 4.283 (Reading database ... (Reading database ... 5%(Reading database ... 10%(Reading database ... 15%(Reading database ... 20%(Reading database ... 25%(Reading database ... 30%(Reading database ... 35%(Reading database ... 40%(Reading database ... 45%(Reading database ... 50%(Reading database ... 55%(Reading database ... 60%(Reading database ... 65%(Reading database ... 70%(Reading database ... 75%(Reading database ... 80%(Reading database ... 85%(Reading database ... 90%(Reading database ... 95%(Reading database ... 100%(Reading database ... 6661 files and directories currently installed.)
#6 4.290 Preparing to unpack .../openssl_1.1.1n-0+deb11u4_amd64.deb ...
#6 4.294 Unpacking openssl (1.1.1n-0+deb11u4) ...
#6 4.412 Selecting previously unselected package ca-certificates.
#6 4.414 Preparing to unpack .../ca-certificates_20210119_all.deb ...
#6 4.417 Unpacking ca-certificates (20210119) ...
#6 4.476 Setting up openssl (1.1.1n-0+deb11u4) ...
#6 4.491 Setting up ca-certificates (20210119) ...
#6 5.354 Updating certificates in /etc/ssl/certs...
#6 6.024 129 added, 0 removed; done.
#6 6.098 Processing triggers for ca-certificates (20210119) ...
#6 6.106 Updating certificates in /etc/ssl/certs...
#6 6.606 0 added, 0 removed; done.
#6 6.606 Running hooks in /etc/ca-certificates/update.d...
#6 6.646 done.
#6 DONE 7.3s
#7 [3/8] ADD target/linux_amd64/boot /opt/apache/beam/
#7 DONE 0.3s
#8 [4/8] COPY target/LICENSE /opt/apache/beam/
#8 DONE 0.1s
#9 [5/8] COPY target/NOTICE /opt/apache/beam/
#9 DONE 0.1s
#10 [6/8] COPY target/LICENSE target/go-licenses/* /opt/apache/beam/third_party_licenses/golang/
#10 ERROR: lstat /var/lib/docker/tmp/buildkit-mount308858170/target/go-licenses: no such file or directory
------
> [6/8] COPY target/LICENSE target/go-licenses/* /opt/apache/beam/third_party_licenses/golang/:
------
ERROR: failed to solve: lstat /var/lib/docker/tmp/buildkit-mount308858170/target/go-licenses: no such file or directory
> Task :sdks:go:container:docker
FAILURE: FAILED
Build failed with an exception.
* What went wrong:
Execution failed for task ':sdks:go:container:docker'.
> Process 'command 'docker'' finished with non-zero exit value 1
* Try:
> Run with --stacktrace option to get the stack trace.
> Run with --info or --debug option to get more log output.
* Get more help at https://help.gradle.org
BUILD FAILED in 21s
16 actionable tasks: 5 executed, 11 up-to-date
Publishing build scan...
https://gradle.com/s/q2jlk4tgqfemi
$ ./gradlew :sdks:go:container:docker -Pdocker-tag=dev
> Task :sdks:go:test:sparkValidatesRunner FAILED
FAILURE: Build failed with an exception.
* Where:
Build file '<https://ci-beam.apache.org/job/beam_PostCommit_Go_VR_Spark/ws/src/sdks/go/test/build.gradle'> line: 116
* What went wrong:
Execution failed for task ':sdks:go:test:sparkValidatesRunner'.
> Process 'command 'sh'' finished with non-zero exit value 1
* Try:
> Run with --stacktrace option to get the stack trace.
> Run with --info or --debug option to get more log output.
* Get more help at https://help.gradle.org
Deprecated Gradle features were used in this build, making it incompatible with Gradle 8.0.
You can use '--warning-mode all' to show the individual deprecation warnings and determine if they come from your own scripts or plugins.
See https://docs.gradle.org/7.5.1/userguide/command_line_interface.html#sec:command_line_warnings
Execution optimizations have been disabled for 1 invalid unit(s) of work during this build to ensure correctness.
Please consult deprecation warnings for more details.
BUILD FAILED in 1m 25s
117 actionable tasks: 74 executed, 39 from cache, 4 up-to-date
Publishing build scan...
https://gradle.com/s/477u2b62jrdre
Build step 'Invoke Gradle script' changed build result to FAILURE
Build step 'Invoke Gradle script' marked build as failure
---------------------------------------------------------------------
To unsubscribe, e-mail: builds-unsubscribe@beam.apache.org
For additional commands, e-mail: builds-help@beam.apache.org
Build failed in Jenkins: beam_PostCommit_Go_VR_Spark #7420
Posted by Apache Jenkins Server <je...@builds.apache.org>.
See <https://ci-beam.apache.org/job/beam_PostCommit_Go_VR_Spark/7420/display/redirect>
Changes:
------------------------------------------
[...truncated 56.57 KB...]
#11 [ 7/18] ADD target/beam-sdks-java-harness.jar /opt/apache/beam/jars/
#11 DONE 0.1s
#12 [ 8/18] COPY target/jamm.jar target/open-module-agent*.jar /opt/apache/beam/jars/
#12 DONE 0.1s
#13 [ 9/18] COPY target/linux_amd64/boot /opt/apache/beam/
#13 DONE 0.2s
#14 [10/18] COPY target/LICENSE /opt/apache/beam/
#14 DONE 0.1s
#15 [11/18] COPY target/NOTICE /opt/apache/beam/
#15 DONE 0.1s
#16 [12/18] ADD target/third_party_licenses /opt/apache/beam/third_party_licenses/
#16 DONE 0.2s
#17 [13/18] COPY target/LICENSE target/options/* /opt/apache/beam/options/
#17 DONE 0.1s
#18 [14/18] RUN rm /opt/apache/beam/options/LICENSE
#18 DONE 0.3s
#19 [15/18] COPY target/LICENSE target/go-licenses/* /opt/apache/beam/third_party_licenses/golang/
#19 DONE 0.0s
#20 [16/18] RUN rm /opt/apache/beam/third_party_licenses/golang/LICENSE
#20 DONE 0.4s
#21 [17/18] RUN if [ "true" = "false" ] ; then rm -rf /opt/apache/beam/third_party_licenses ; fi
#21 DONE 0.4s
#22 [18/18] COPY target/profiler/* /opt/google_cloud_profiler/
#22 DONE 0.1s
#23 exporting to image
#23 exporting layers
#23 exporting layers 0.3s done
#23 writing image sha256:22e4e9ae346de94fe317a53d6686abcb7ce5efe4a3d5511741c8f43990ec13ce done
#23 naming to docker.io/apache/beam_java8_sdk:2.48.0.dev done
#23 DONE 0.3s
> Task :sdks:go:test:sparkValidatesRunner
$ CURRENT_DIRECTORY=<https://ci-beam.apache.org/job/beam_PostCommit_Go_VR_Spark/ws/src/sdks/go/test>
$ TESTS=./test/integration/... ./test/regression
$ RUNNER=portable
$ TIMEOUT=3h
$ SIMULTANEOUS=3
$ GCS_LOCATION=gs://temp-storage-for-end-to-end-tests
$ GCS_SUBFOLDER=test15440
$ PROJECT=apache-beam-testing
$ DATAFLOW_PROJECT=apache-beam-testing
$ REGION=us-central1
$ trap exit_background_processes SIGINT SIGTERM EXIT
$ key=--runner
$ case --runner in
$ RUNNER=spark
$ key=--spark_job_server_jar
$ case --spark_job_server_jar in
$ SPARK_JOB_SERVER_JAR=<https://ci-beam.apache.org/job/beam_PostCommit_Go_VR_Spark/ws/src/runners/spark/3/job-server/build/libs/beam-runners-spark-3-job-server-2.48.0-SNAPSHOT.jar>
$ key=--pipeline_opts
$ case --pipeline_opts in
$ PIPELINE_OPTS=--expansion_jar=test:<https://ci-beam.apache.org/job/beam_PostCommit_Go_VR_Spark/ws/src/sdks/java/testing/expansion-service/build/libs/beam-sdks-java-testing-expansion-service-testExpansionService-2.48.0-SNAPSHOT.jar>
$ cd <https://ci-beam.apache.org/job/beam_PostCommit_Go_VR_Spark/ws/src>
$ test -d sdks/go/test
$ JOB_PORT=41105
$ ENDPOINT=localhost:56163
No endpoint specified; starting a new spark job server on localhost:56163
$ java -jar <https://ci-beam.apache.org/job/beam_PostCommit_Go_VR_Spark/ws/src/runners/spark/3/job-server/build/libs/beam-runners-spark-3-job-server-2.48.0-SNAPSHOT.jar> --spark-master-url local --job-port 56163 --expansion-port 0 --artifact-port 0
$ JOBSERVER_PID=733269
$ SIMULTANEOUS=1
$ TAG=dev
$ ./gradlew :sdks:go:container:docker -Pdocker-tag=dev
To honour the JVM settings for this build a single-use Daemon process will be forked. See https://docs.gradle.org/7.5.1/userguide/gradle_daemon.html#sec:disabling_the_daemon.
Daemon will be stopped at the end of the build
Configuration on demand is an incubating feature.
23/04/09 14:40:34 WARN software.amazon.awssdk.regions.internal.util.EC2MetadataUtils: Unable to retrieve the requested metadata.
23/04/09 14:40:34 INFO org.apache.beam.runners.jobsubmission.JobServerDriver: ArtifactStagingService started on localhost:43865
23/04/09 14:40:34 INFO org.apache.beam.runners.jobsubmission.JobServerDriver: Java ExpansionService started on localhost:40757
23/04/09 14:40:34 INFO org.apache.beam.runners.jobsubmission.JobServerDriver: JobService started on localhost:56163
23/04/09 14:40:34 INFO org.apache.beam.runners.jobsubmission.JobServerDriver: Job server now running, terminate with Ctrl+C
> Task :buildSrc:compileJava NO-SOURCE
> Task :buildSrc:compileGroovy UP-TO-DATE
> Task :buildSrc:pluginDescriptors UP-TO-DATE
> Task :buildSrc:processResources UP-TO-DATE
> Task :buildSrc:classes UP-TO-DATE
> Task :buildSrc:jar UP-TO-DATE
> Task :buildSrc:assemble UP-TO-DATE
> Task :buildSrc:spotlessGroovy UP-TO-DATE
> Task :buildSrc:spotlessGroovyCheck UP-TO-DATE
> Task :buildSrc:spotlessGroovyGradle UP-TO-DATE
> Task :buildSrc:spotlessGroovyGradleCheck UP-TO-DATE
> Task :buildSrc:spotlessCheck UP-TO-DATE
> Task :buildSrc:pluginUnderTestMetadata UP-TO-DATE
> Task :buildSrc:compileTestJava NO-SOURCE
> Task :buildSrc:compileTestGroovy NO-SOURCE
> Task :buildSrc:processTestResources NO-SOURCE
> Task :buildSrc:testClasses UP-TO-DATE
> Task :buildSrc:test NO-SOURCE
> Task :buildSrc:validatePlugins UP-TO-DATE
> Task :buildSrc:check UP-TO-DATE
> Task :buildSrc:build UP-TO-DATE
System Go installation: /snap/bin/go is go version go1.16.15 linux/amd64; Preparing to use /home/jenkins/go/bin/go1.20.2
go1.20.2: already downloaded in /home/jenkins/sdk/go1.20.2
GOCMD=/home/jenkins/go/bin/go1.20.2
> Task :sdks:go:container:copyLicenses
> Task :sdks:go:container:dockerClean UP-TO-DATE
> Task :sdks:go:container:goPrepare UP-TO-DATE
> Task :sdks:go:container:goBuild
/home/jenkins/go/bin/go1.20.2 build -o ./build/target/linux_amd64/boot boot.go boot_test.go
> Task :sdks:go:container:skipPullLicenses
> Task :sdks:go:container:dockerPrepare
#1 [internal] load build definition from Dockerfile
> Task :sdks:go:container:docker
#1 transferring dockerfile: 1.94kB done
#1 DONE 0.0s
#2 [internal] load .dockerignore
#2 transferring context: 2B done
#2 DONE 0.0s
#3 [internal] load metadata for docker.io/library/debian:bullseye
#3 DONE 0.3s
#4 [1/8] FROM docker.io/library/debian:bullseye@sha256:7b991788987ad860810df60927e1adbaf8e156520177bd4db82409f81dd3b721
#4 CACHED
#5 [internal] load build context
#5 transferring context: 22.20MB 0.2s done
#5 DONE 0.2s
#6 [2/8] RUN apt-get update && DEBIAN_FRONTEND=noninteractive apt-get install -y ca-certificates && rm -rf /var/lib/apt/lists/*
#6 0.462 Get:1 http://deb.debian.org/debian bullseye InRelease [116 kB]
#6 0.614 Get:2 http://deb.debian.org/debian-security bullseye-security InRelease [48.4 kB]
#6 0.674 Get:3 http://deb.debian.org/debian bullseye-updates InRelease [44.1 kB]
#6 0.766 Get:4 http://deb.debian.org/debian bullseye/main amd64 Packages [8183 kB]
#6 1.251 Get:5 http://deb.debian.org/debian-security bullseye-security/main amd64 Packages [236 kB]
#6 1.256 Get:6 http://deb.debian.org/debian bullseye-updates/main amd64 Packages [14.6 kB]
#6 2.516 Fetched 8642 kB in 2s (3970 kB/s)
#6 2.516 Reading package lists...
#6 3.185 Reading package lists...
#6 3.821 Building dependency tree...
#6 3.979 Reading state information...
#6 4.149 The following additional packages will be installed:
#6 4.150 openssl
#6 4.177 The following NEW packages will be installed:
#6 4.178 ca-certificates openssl
#6 4.274 0 upgraded, 2 newly installed, 0 to remove and 1 not upgraded.
#6 4.274 Need to get 1011 kB of archives.
#6 4.274 After this operation, 1892 kB of additional disk space will be used.
#6 4.274 Get:1 http://deb.debian.org/debian-security bullseye-security/main amd64 openssl amd64 1.1.1n-0+deb11u4 [853 kB]
#6 4.479 Get:2 http://deb.debian.org/debian bullseye/main amd64 ca-certificates all 20210119 [158 kB]
#6 4.721 debconf: delaying package configuration, since apt-utils is not installed
#6 4.754 Fetched 1011 kB in 0s (3391 kB/s)
#6 4.777 Selecting previously unselected package openssl.
#6 4.777 (Reading database ... (Reading database ... 5%(Reading database ... 10%(Reading database ... 15%(Reading database ... 20%(Reading database ... 25%(Reading database ... 30%(Reading database ... 35%(Reading database ... 40%(Reading database ... 45%(Reading database ... 50%(Reading database ... 55%(Reading database ... 60%(Reading database ... 65%(Reading database ... 70%(Reading database ... 75%(Reading database ... 80%(Reading database ... 85%(Reading database ... 90%(Reading database ... 95%(Reading database ... 100%(Reading database ... 6661 files and directories currently installed.)
#6 4.787 Preparing to unpack .../openssl_1.1.1n-0+deb11u4_amd64.deb ...
#6 4.791 Unpacking openssl (1.1.1n-0+deb11u4) ...
#6 4.909 Selecting previously unselected package ca-certificates.
#6 4.911 Preparing to unpack .../ca-certificates_20210119_all.deb ...
#6 4.915 Unpacking ca-certificates (20210119) ...
#6 4.985 Setting up openssl (1.1.1n-0+deb11u4) ...
#6 5.003 Setting up ca-certificates (20210119) ...
#6 5.931 Updating certificates in /etc/ssl/certs...
#6 6.774 129 added, 0 removed; done.
#6 6.832 Processing triggers for ca-certificates (20210119) ...
#6 6.842 Updating certificates in /etc/ssl/certs...
#6 7.456 0 added, 0 removed; done.
#6 7.456 Running hooks in /etc/ca-certificates/update.d...
#6 7.477 done.
#6 DONE 8.1s
#7 [3/8] ADD target/linux_amd64/boot /opt/apache/beam/
#7 DONE 0.3s
#8 [4/8] COPY target/LICENSE /opt/apache/beam/
#8 DONE 0.1s
#9 [5/8] COPY target/NOTICE /opt/apache/beam/
#9 DONE 0.1s
#10 [6/8] COPY target/LICENSE target/go-licenses/* /opt/apache/beam/third_party_licenses/golang/
#10 ERROR: lstat /var/lib/docker/tmp/buildkit-mount2846199005/target/go-licenses: no such file or directory
------
> [6/8] COPY target/LICENSE target/go-licenses/* /opt/apache/beam/third_party_licenses/golang/:
------
ERROR: failed to solve: lstat /var/lib/docker/tmp/buildkit-mount2846199005/target/go-licenses: no such file or directory
> Task :sdks:go:container:docker FAILED
FAILURE: Build failed with an exception.
* What went wrong:
Execution failed for task ':sdks:go:container:docker'.
> Process 'command 'docker'' finished with non-zero exit value 1
* Try:
> Run with --stacktrace option to get the stack trace.
> Run with --info or --debug option to get more log output.
* Get more help at https://help.gradle.org
16 actionable tasks: 5 executed, 11 up-to-date
Publishing build scan...
BUILD FAILED in 23s
https://gradle.com/s/2k77w2y267a56
$ ./gradlew :sdks:go:container:docker -Pdocker-tag=dev
> Task :sdks:go:test:sparkValidatesRunner FAILED
FAILURE: Build failed with an exception.
* Where:
Build file '<https://ci-beam.apache.org/job/beam_PostCommit_Go_VR_Spark/ws/src/sdks/go/test/build.gradle'> line: 116
* What went wrong:
Execution failed for task ':sdks:go:test:sparkValidatesRunner'.
> Process 'command 'sh'' finished with non-zero exit value 1
* Try:
> Run with --stacktrace option to get the stack trace.
> Run with --info or --debug option to get more log output.
* Get more help at https://help.gradle.org
Deprecated Gradle features were used in this build, making it incompatible with Gradle 8.0.
You can use '--warning-mode all' to show the individual deprecation warnings and determine if they come from your own scripts or plugins.
See https://docs.gradle.org/7.5.1/userguide/command_line_interface.html#sec:command_line_warnings
Execution optimizations have been disabled for 1 invalid unit(s) of work during this build to ensure correctness.
Please consult deprecation warnings for more details.
BUILD FAILED in 1m 32s
117 actionable tasks: 74 executed, 39 from cache, 4 up-to-date
Publishing build scan...
https://gradle.com/s/s2rt43epah34w
Build step 'Invoke Gradle script' changed build result to FAILURE
Build step 'Invoke Gradle script' marked build as failure
---------------------------------------------------------------------
To unsubscribe, e-mail: builds-unsubscribe@beam.apache.org
For additional commands, e-mail: builds-help@beam.apache.org
Build failed in Jenkins: beam_PostCommit_Go_VR_Spark #7419
Posted by Apache Jenkins Server <je...@builds.apache.org>.
See <https://ci-beam.apache.org/job/beam_PostCommit_Go_VR_Spark/7419/display/redirect>
Changes:
------------------------------------------
[...truncated 56.40 KB...]
#11 [ 7/18] ADD target/beam-sdks-java-harness.jar /opt/apache/beam/jars/
#11 DONE 0.1s
#12 [ 8/18] COPY target/jamm.jar target/open-module-agent*.jar /opt/apache/beam/jars/
#12 DONE 0.1s
#13 [ 9/18] COPY target/linux_amd64/boot /opt/apache/beam/
#13 DONE 0.2s
#14 [10/18] COPY target/LICENSE /opt/apache/beam/
#14 DONE 0.1s
#15 [11/18] COPY target/NOTICE /opt/apache/beam/
#15 DONE 0.1s
#16 [12/18] ADD target/third_party_licenses /opt/apache/beam/third_party_licenses/
#16 DONE 0.2s
#17 [13/18] COPY target/LICENSE target/options/* /opt/apache/beam/options/
#17 DONE 0.1s
#18 [14/18] RUN rm /opt/apache/beam/options/LICENSE
#18 DONE 0.3s
#19 [15/18] COPY target/LICENSE target/go-licenses/* /opt/apache/beam/third_party_licenses/golang/
#19 DONE 0.1s
#20 [16/18] RUN rm /opt/apache/beam/third_party_licenses/golang/LICENSE
#20 DONE 0.4s
#21 [17/18] RUN if [ "true" = "false" ] ; then rm -rf /opt/apache/beam/third_party_licenses ; fi
#21 DONE 0.4s
#22 [18/18] COPY target/profiler/* /opt/google_cloud_profiler/
#22 DONE 0.1s
#23 exporting to image
#23 exporting layers
#23 exporting layers 0.3s done
#23 writing image sha256:aef910e5f7f2a1e270780a5ab1be5c8e0007be10ddf7d01d67d572fb0c6e5f3b done
#23 naming to docker.io/apache/beam_java8_sdk:2.48.0.dev done
#23 DONE 0.3s
> Task :sdks:go:test:sparkValidatesRunner
$ CURRENT_DIRECTORY=<https://ci-beam.apache.org/job/beam_PostCommit_Go_VR_Spark/ws/src/sdks/go/test>
$ TESTS=./test/integration/... ./test/regression
$ RUNNER=portable
$ TIMEOUT=3h
$ SIMULTANEOUS=3
$ GCS_LOCATION=gs://temp-storage-for-end-to-end-tests
$ GCS_SUBFOLDER=test6781
$ PROJECT=apache-beam-testing
$ DATAFLOW_PROJECT=apache-beam-testing
$ REGION=us-central1
$ trap exit_background_processes SIGINT SIGTERM EXIT
$ key=--runner
$ case --runner in
$ RUNNER=spark
$ key=--spark_job_server_jar
$ case --spark_job_server_jar in
$ SPARK_JOB_SERVER_JAR=<https://ci-beam.apache.org/job/beam_PostCommit_Go_VR_Spark/ws/src/runners/spark/3/job-server/build/libs/beam-runners-spark-3-job-server-2.48.0-SNAPSHOT.jar>
$ key=--pipeline_opts
$ case --pipeline_opts in
$ PIPELINE_OPTS=--expansion_jar=test:<https://ci-beam.apache.org/job/beam_PostCommit_Go_VR_Spark/ws/src/sdks/java/testing/expansion-service/build/libs/beam-sdks-java-testing-expansion-service-testExpansionService-2.48.0-SNAPSHOT.jar>
$ cd <https://ci-beam.apache.org/job/beam_PostCommit_Go_VR_Spark/ws/src>
$ test -d sdks/go/test
$ JOB_PORT=51447
$ ENDPOINT=localhost:39643
No endpoint specified; starting a new spark job server on localhost:39643
$ java -jar <https://ci-beam.apache.org/job/beam_PostCommit_Go_VR_Spark/ws/src/runners/spark/3/job-server/build/libs/beam-runners-spark-3-job-server-2.48.0-SNAPSHOT.jar> --spark-master-url local --job-port 39643 --expansion-port 0 --artifact-port 0
$ JOBSERVER_PID=1936427
$ SIMULTANEOUS=1
$ TAG=dev
$ ./gradlew :sdks:go:container:docker -Pdocker-tag=dev
To honour the JVM settings for this build a single-use Daemon process will be forked. See https://docs.gradle.org/7.5.1/userguide/gradle_daemon.html#sec:disabling_the_daemon.
Daemon will be stopped at the end of the build
Configuration on demand is an incubating feature.
23/04/09 08:40:35 WARN software.amazon.awssdk.regions.internal.util.EC2MetadataUtils: Unable to retrieve the requested metadata.
23/04/09 08:40:36 INFO org.apache.beam.runners.jobsubmission.JobServerDriver: ArtifactStagingService started on localhost:33987
23/04/09 08:40:36 INFO org.apache.beam.runners.jobsubmission.JobServerDriver: Java ExpansionService started on localhost:33191
23/04/09 08:40:36 INFO org.apache.beam.runners.jobsubmission.JobServerDriver: JobService started on localhost:39643
23/04/09 08:40:36 INFO org.apache.beam.runners.jobsubmission.JobServerDriver: Job server now running, terminate with Ctrl+C
> Task :buildSrc:compileJava NO-SOURCE
> Task :buildSrc:compileGroovy UP-TO-DATE
> Task :buildSrc:pluginDescriptors UP-TO-DATE
> Task :buildSrc:processResources UP-TO-DATE
> Task :buildSrc:classes UP-TO-DATE
> Task :buildSrc:jar UP-TO-DATE
> Task :buildSrc:assemble UP-TO-DATE
> Task :buildSrc:spotlessGroovy UP-TO-DATE
> Task :buildSrc:spotlessGroovyCheck UP-TO-DATE
> Task :buildSrc:spotlessGroovyGradle UP-TO-DATE
> Task :buildSrc:spotlessGroovyGradleCheck UP-TO-DATE
> Task :buildSrc:spotlessCheck UP-TO-DATE
> Task :buildSrc:pluginUnderTestMetadata UP-TO-DATE
> Task :buildSrc:compileTestJava NO-SOURCE
> Task :buildSrc:compileTestGroovy NO-SOURCE
> Task :buildSrc:processTestResources NO-SOURCE
> Task :buildSrc:testClasses UP-TO-DATE
> Task :buildSrc:test NO-SOURCE
> Task :buildSrc:validatePlugins UP-TO-DATE
> Task :buildSrc:check UP-TO-DATE
> Task :buildSrc:build UP-TO-DATE
System Go installation: /snap/bin/go is go version go1.16.15 linux/amd64; Preparing to use /home/jenkins/go/bin/go1.20.2
go1.20.2: already downloaded in /home/jenkins/sdk/go1.20.2
GOCMD=/home/jenkins/go/bin/go1.20.2
> Task :sdks:go:container:copyLicenses
> Task :sdks:go:container:dockerClean UP-TO-DATE
> Task :sdks:go:container:goPrepare UP-TO-DATE
> Task :sdks:go:container:goBuild
/home/jenkins/go/bin/go1.20.2 build -o ./build/target/linux_amd64/boot boot.go boot_test.go
> Task :sdks:go:container:skipPullLicenses
> Task :sdks:go:container:dockerPrepare
#1 [internal] load build definition from Dockerfile
#1 transferring dockerfile:
> Task :sdks:go:container:docker
#1 transferring dockerfile: 1.94kB done
#1 DONE 0.0s
#2 [internal] load .dockerignore
#2 transferring context: 2B done
#2 DONE 0.0s
#3 [internal] load metadata for docker.io/library/debian:bullseye
#3 DONE 0.3s
#4 [1/8] FROM docker.io/library/debian:bullseye@sha256:7b991788987ad860810df60927e1adbaf8e156520177bd4db82409f81dd3b721
#4 CACHED
#5 [internal] load build context
#5 transferring context: 22.20MB 0.2s done
#5 DONE 0.2s
#6 [2/8] RUN apt-get update && DEBIAN_FRONTEND=noninteractive apt-get install -y ca-certificates && rm -rf /var/lib/apt/lists/*
#6 0.462 Get:1 http://deb.debian.org/debian bullseye InRelease [116 kB]
#6 0.530 Get:2 http://deb.debian.org/debian-security bullseye-security InRelease [48.4 kB]
#6 0.556 Get:3 http://deb.debian.org/debian bullseye-updates InRelease [44.1 kB]
#6 0.670 Get:4 http://deb.debian.org/debian bullseye/main amd64 Packages [8183 kB]
#6 0.872 Get:5 http://deb.debian.org/debian-security bullseye-security/main amd64 Packages [236 kB]
#6 0.914 Get:6 http://deb.debian.org/debian bullseye-updates/main amd64 Packages [14.6 kB]
#6 2.192 Fetched 8642 kB in 2s (4818 kB/s)
#6 2.192 Reading package lists...
#6 2.844 Reading package lists...
#6 3.475 Building dependency tree...
#6 3.628 Reading state information...
#6 3.791 The following additional packages will be installed:
#6 3.791 openssl
#6 3.818 The following NEW packages will be installed:
#6 3.819 ca-certificates openssl
#6 3.873 0 upgraded, 2 newly installed, 0 to remove and 1 not upgraded.
#6 3.873 Need to get 1011 kB of archives.
#6 3.873 After this operation, 1892 kB of additional disk space will be used.
#6 3.873 Get:1 http://deb.debian.org/debian-security bullseye-security/main amd64 openssl amd64 1.1.1n-0+deb11u4 [853 kB]
#6 3.930 Get:2 http://deb.debian.org/debian bullseye/main amd64 ca-certificates all 20210119 [158 kB]
#6 4.353 debconf: delaying package configuration, since apt-utils is not installed
#6 4.385 Fetched 1011 kB in 0s (9512 kB/s)
#6 4.462 Selecting previously unselected package openssl.
#6 4.462 (Reading database ... (Reading database ... 5%(Reading database ... 10%(Reading database ... 15%(Reading database ... 20%(Reading database ... 25%(Reading database ... 30%(Reading database ... 35%(Reading database ... 40%(Reading database ... 45%(Reading database ... 50%(Reading database ... 55%(Reading database ... 60%(Reading database ... 65%(Reading database ... 70%(Reading database ... 75%(Reading database ... 80%(Reading database ... 85%(Reading database ... 90%(Reading database ... 95%(Reading database ... 100%(Reading database ... 6661 files and directories currently installed.)
#6 4.472 Preparing to unpack .../openssl_1.1.1n-0+deb11u4_amd64.deb ...
#6 4.476 Unpacking openssl (1.1.1n-0+deb11u4) ...
#6 4.592 Selecting previously unselected package ca-certificates.
#6 4.594 Preparing to unpack .../ca-certificates_20210119_all.deb ...
#6 4.599 Unpacking ca-certificates (20210119) ...
#6 4.663 Setting up openssl (1.1.1n-0+deb11u4) ...
#6 4.679 Setting up ca-certificates (20210119) ...
#6 5.437 Updating certificates in /etc/ssl/certs...
#6 6.254 129 added, 0 removed; done.
#6 6.319 Processing triggers for ca-certificates (20210119) ...
#6 6.329 Updating certificates in /etc/ssl/certs...
#6 6.914 0 added, 0 removed; done.
#6 6.914 Running hooks in /etc/ca-certificates/update.d...
#6 6.933 done.
#6 DONE 7.6s
#7 [3/8] ADD target/linux_amd64/boot /opt/apache/beam/
#7 DONE 0.3s
#8 [4/8] COPY target/LICENSE /opt/apache/beam/
#8 DONE 0.1s
#9 [5/8] COPY target/NOTICE /opt/apache/beam/
#9 DONE 0.1s
> Task :sdks:go:container:docker FAILED#10 [6/8] COPY target/LICENSE target/go-licenses/* /opt/apache/beam/third_party_licenses/golang/
#10 ERROR: lstat /var/lib/docker/tmp/buildkit-mount2576552201/target/go-licenses: no such file or directory
------
> [6/8] COPY target/LICENSE target/go-licenses/* /opt/apache/beam/third_party_licenses/golang/:
------
ERROR: failed to solve: lstat /var/lib/docker/tmp/buildkit-mount2576552201/target/go-licenses: no such file or directory
FAILURE: Build failed with an exception.
* What went wrong:
Execution failed for task ':sdks:go:container:docker'.
> Process 'command 'docker'' finished with non-zero exit value 1
* Try:
> Run with --stacktrace option to get the stack trace.
> Run with --info or --debug option to get more log output.
* Get more help at https://help.gradle.org
16 actionable tasks: 5 executed, 11 up-to-date
Publishing build scan...
BUILD FAILED in 23s
https://gradle.com/s/6f63karbexjxm
$ ./gradlew :sdks:go:container:docker -Pdocker-tag=dev
> Task :sdks:go:test:sparkValidatesRunner FAILED
FAILURE: Build failed with an exception.
* Where:
Build file '<https://ci-beam.apache.org/job/beam_PostCommit_Go_VR_Spark/ws/src/sdks/go/test/build.gradle'> line: 116
* What went wrong:
Execution failed for task ':sdks:go:test:sparkValidatesRunner'.
> Process 'command 'sh'' finished with non-zero exit value 1
* Try:
> Run with --stacktrace option to get the stack trace.
> Run with --info or --debug option to get more log output.
* Get more help at https://help.gradle.org
Deprecated Gradle features were used in this build, making it incompatible with Gradle 8.0.
You can use '--warning-mode all' to show the individual deprecation warnings and determine if they come from your own scripts or plugins.
See https://docs.gradle.org/7.5.1/userguide/command_line_interface.html#sec:command_line_warnings
Execution optimizations have been disabled for 1 invalid unit(s) of work during this build to ensure correctness.
Please consult deprecation warnings for more details.
BUILD FAILED in 1m 35s
117 actionable tasks: 74 executed, 39 from cache, 4 up-to-date
Publishing build scan...
https://gradle.com/s/cwhpxom4jxhjw
Build step 'Invoke Gradle script' changed build result to FAILURE
Build step 'Invoke Gradle script' marked build as failure
---------------------------------------------------------------------
To unsubscribe, e-mail: builds-unsubscribe@beam.apache.org
For additional commands, e-mail: builds-help@beam.apache.org
Build failed in Jenkins: beam_PostCommit_Go_VR_Spark #7418
Posted by Apache Jenkins Server <je...@builds.apache.org>.
See <https://ci-beam.apache.org/job/beam_PostCommit_Go_VR_Spark/7418/display/redirect>
Changes:
------------------------------------------
[...truncated 56.80 KB...]
#11 [ 7/18] ADD target/beam-sdks-java-harness.jar /opt/apache/beam/jars/
#11 DONE 0.1s
#12 [ 8/18] COPY target/jamm.jar target/open-module-agent*.jar /opt/apache/beam/jars/
#12 DONE 0.1s
#13 [ 9/18] COPY target/linux_amd64/boot /opt/apache/beam/
#13 DONE 0.3s
#14 [10/18] COPY target/LICENSE /opt/apache/beam/
#14 DONE 0.1s
#15 [11/18] COPY target/NOTICE /opt/apache/beam/
#15 DONE 0.1s
#16 [12/18] ADD target/third_party_licenses /opt/apache/beam/third_party_licenses/
#16 DONE 0.2s
#17 [13/18] COPY target/LICENSE target/options/* /opt/apache/beam/options/
#17 DONE 0.2s
#18 [14/18] RUN rm /opt/apache/beam/options/LICENSE
#18 DONE 0.4s
#19 [15/18] COPY target/LICENSE target/go-licenses/* /opt/apache/beam/third_party_licenses/golang/
#19 DONE 0.1s
#20 [16/18] RUN rm /opt/apache/beam/third_party_licenses/golang/LICENSE
#20 DONE 1.0s
#21 [17/18] RUN if [ "true" = "false" ] ; then rm -rf /opt/apache/beam/third_party_licenses ; fi
#21 DONE 0.5s
#22 [18/18] COPY target/profiler/* /opt/google_cloud_profiler/
#22 DONE 0.1s
#23 exporting to image
#23 exporting layers
#23 exporting layers 0.3s done
#23 writing image sha256:b0b6fe6e24c7f593c05239da604cca74ecd41ebc55f89dcd6f2c905fb7d949d3 done
#23 naming to docker.io/apache/beam_java8_sdk:2.48.0.dev done
#23 DONE 0.3s
> Task :sdks:go:test:sparkValidatesRunner
$ CURRENT_DIRECTORY=<https://ci-beam.apache.org/job/beam_PostCommit_Go_VR_Spark/ws/src/sdks/go/test>
$ TESTS=./test/integration/... ./test/regression
$ RUNNER=portable
$ TIMEOUT=3h
$ SIMULTANEOUS=3
$ GCS_LOCATION=gs://temp-storage-for-end-to-end-tests
$ GCS_SUBFOLDER=test10560
$ PROJECT=apache-beam-testing
$ DATAFLOW_PROJECT=apache-beam-testing
$ REGION=us-central1
$ trap exit_background_processes SIGINT SIGTERM EXIT
$ key=--runner
$ case --runner in
$ RUNNER=spark
$ key=--spark_job_server_jar
$ case --spark_job_server_jar in
$ SPARK_JOB_SERVER_JAR=<https://ci-beam.apache.org/job/beam_PostCommit_Go_VR_Spark/ws/src/runners/spark/3/job-server/build/libs/beam-runners-spark-3-job-server-2.48.0-SNAPSHOT.jar>
$ key=--pipeline_opts
$ case --pipeline_opts in
$ PIPELINE_OPTS=--expansion_jar=test:<https://ci-beam.apache.org/job/beam_PostCommit_Go_VR_Spark/ws/src/sdks/java/testing/expansion-service/build/libs/beam-sdks-java-testing-expansion-service-testExpansionService-2.48.0-SNAPSHOT.jar>
$ cd <https://ci-beam.apache.org/job/beam_PostCommit_Go_VR_Spark/ws/src>
$ test -d sdks/go/test
$ JOB_PORT=47809
$ ENDPOINT=localhost:59183
No endpoint specified; starting a new spark job server on localhost:59183
$ java -jar <https://ci-beam.apache.org/job/beam_PostCommit_Go_VR_Spark/ws/src/runners/spark/3/job-server/build/libs/beam-runners-spark-3-job-server-2.48.0-SNAPSHOT.jar> --spark-master-url local --job-port 59183 --expansion-port 0 --artifact-port 0
$ JOBSERVER_PID=1898049
$ SIMULTANEOUS=1
$ TAG=dev
$ ./gradlew :sdks:go:container:docker -Pdocker-tag=dev
To honour the JVM settings for this build a single-use Daemon process will be forked. See https://docs.gradle.org/7.5.1/userguide/gradle_daemon.html#sec:disabling_the_daemon.
Daemon will be stopped at the end of the build
Configuration on demand is an incubating feature.
23/04/09 02:40:28 WARN software.amazon.awssdk.regions.internal.util.EC2MetadataUtils: Unable to retrieve the requested metadata.
23/04/09 02:40:28 INFO org.apache.beam.runners.jobsubmission.JobServerDriver: ArtifactStagingService started on localhost:41871
23/04/09 02:40:28 INFO org.apache.beam.runners.jobsubmission.JobServerDriver: Java ExpansionService started on localhost:39367
23/04/09 02:40:28 INFO org.apache.beam.runners.jobsubmission.JobServerDriver: JobService started on localhost:59183
23/04/09 02:40:28 INFO org.apache.beam.runners.jobsubmission.JobServerDriver: Job server now running, terminate with Ctrl+C
> Task :buildSrc:compileJava NO-SOURCE
> Task :buildSrc:compileGroovy UP-TO-DATE
> Task :buildSrc:pluginDescriptors UP-TO-DATE
> Task :buildSrc:processResources UP-TO-DATE
> Task :buildSrc:classes UP-TO-DATE
> Task :buildSrc:jar UP-TO-DATE
> Task :buildSrc:assemble UP-TO-DATE
> Task :buildSrc:spotlessGroovy UP-TO-DATE
> Task :buildSrc:spotlessGroovyCheck UP-TO-DATE
> Task :buildSrc:spotlessGroovyGradle UP-TO-DATE
> Task :buildSrc:spotlessGroovyGradleCheck UP-TO-DATE
> Task :buildSrc:spotlessCheck UP-TO-DATE
> Task :buildSrc:pluginUnderTestMetadata UP-TO-DATE
> Task :buildSrc:compileTestJava NO-SOURCE
> Task :buildSrc:compileTestGroovy NO-SOURCE
> Task :buildSrc:processTestResources NO-SOURCE
> Task :buildSrc:testClasses UP-TO-DATE
> Task :buildSrc:test NO-SOURCE
> Task :buildSrc:validatePlugins UP-TO-DATE
> Task :buildSrc:check UP-TO-DATE
> Task :buildSrc:build UP-TO-DATE
System Go installation: /snap/bin/go is go version go1.16.15 linux/amd64; Preparing to use /home/jenkins/go/bin/go1.20.2
go1.20.2: already downloaded in /home/jenkins/sdk/go1.20.2
GOCMD=/home/jenkins/go/bin/go1.20.2
> Task :sdks:go:container:copyLicenses
> Task :sdks:go:container:dockerClean UP-TO-DATE
> Task :sdks:go:container:goPrepare UP-TO-DATE
> Task :sdks:go:container:goBuild
/home/jenkins/go/bin/go1.20.2 build -o ./build/target/linux_amd64/boot boot.go boot_test.go
> Task :sdks:go:container:skipPullLicenses
> Task :sdks:go:container:dockerPrepare
#1 [internal] load build definition from Dockerfile
> Task :sdks:go:container:docker
#1 transferring dockerfile: 1.94kB done
#1 DONE 0.0s
#2 [internal] load .dockerignore
#2 transferring context: 2B done
#2 DONE 0.0s
#3 [internal] load metadata for docker.io/library/debian:bullseye
#3 DONE 0.3s
#4 [1/8] FROM docker.io/library/debian:bullseye@sha256:7b991788987ad860810df60927e1adbaf8e156520177bd4db82409f81dd3b721
#4 CACHED
#5 [internal] load build context
#5 transferring context: 22.20MB 0.4s done
#5 DONE 0.4s
#6 [2/8] RUN apt-get update && DEBIAN_FRONTEND=noninteractive apt-get install -y ca-certificates && rm -rf /var/lib/apt/lists/*
#6 1.589 Get:1 http://deb.debian.org/debian bullseye InRelease [116 kB]
#6 1.656 Get:2 http://deb.debian.org/debian-security bullseye-security InRelease [48.4 kB]
#6 1.682 Get:3 http://deb.debian.org/debian bullseye-updates InRelease [44.1 kB]
#6 2.077 Get:4 http://deb.debian.org/debian bullseye/main amd64 Packages [8183 kB]
#6 2.303 Get:5 http://deb.debian.org/debian-security bullseye-security/main amd64 Packages [236 kB]
#6 2.342 Get:6 http://deb.debian.org/debian bullseye-updates/main amd64 Packages [14.6 kB]
#6 3.939 Fetched 8642 kB in 2s (3478 kB/s)
#6 3.939 Reading package lists...
#6 4.873 Reading package lists...
#6 5.774 Building dependency tree...
#6 6.005 Reading state information...
#6 6.319 The following additional packages will be installed:
#6 6.320 openssl
#6 6.356 The following NEW packages will be installed:
#6 6.358 ca-certificates openssl
#6 6.437 0 upgraded, 2 newly installed, 0 to remove and 1 not upgraded.
#6 6.437 Need to get 1011 kB of archives.
#6 6.437 After this operation, 1892 kB of additional disk space will be used.
#6 6.437 Get:1 http://deb.debian.org/debian-security bullseye-security/main amd64 openssl amd64 1.1.1n-0+deb11u4 [853 kB]
#6 6.574 Get:2 http://deb.debian.org/debian bullseye/main amd64 ca-certificates all 20210119 [158 kB]
#6 7.176 debconf: delaying package configuration, since apt-utils is not installed
#6 7.219 Fetched 1011 kB in 0s (4863 kB/s)
#6 7.278 Selecting previously unselected package openssl.
#6 7.278 (Reading database ... (Reading database ... 5%(Reading database ... 10%(Reading database ... 15%(Reading database ... 20%(Reading database ... 25%(Reading database ... 30%(Reading database ... 35%(Reading database ... 40%(Reading database ... 45%(Reading database ... 50%(Reading database ... 55%(Reading database ... 60%(Reading database ... 65%(Reading database ... 70%(Reading database ... 75%(Reading database ... 80%(Reading database ... 85%(Reading database ... 90%(Reading database ... 95%(Reading database ... 100%(Reading database ... 6661 files and directories currently installed.)
#6 7.367 Preparing to unpack .../openssl_1.1.1n-0+deb11u4_amd64.deb ...
#6 7.372 Unpacking openssl (1.1.1n-0+deb11u4) ...
#6 7.503 Selecting previously unselected package ca-certificates.
#6 7.505 Preparing to unpack .../ca-certificates_20210119_all.deb ...
#6 7.509 Unpacking ca-certificates (20210119) ...
#6 7.608 Setting up openssl (1.1.1n-0+deb11u4) ...
#6 7.626 Setting up ca-certificates (20210119) ...
#6 8.577 Updating certificates in /etc/ssl/certs...
#6 9.465 129 added, 0 removed; done.
#6 9.517 Processing triggers for ca-certificates (20210119) ...
#6 9.528 Updating certificates in /etc/ssl/certs...
#6 10.19 0 added, 0 removed; done.
#6 10.19 Running hooks in /etc/ca-certificates/update.d...
#6 10.19 done.
#6 DONE 10.8s
#7 [3/8] ADD target/linux_amd64/boot /opt/apache/beam/
#7 DONE 0.3s
#8 [4/8] COPY target/LICENSE /opt/apache/beam/
#8 DONE 0.1s
#9 [5/8] COPY target/NOTICE /opt/apache/beam/
#9 DONE 0.1s
#10 [6/8] COPY target/LICENSE target/go-licenses/* /opt/apache/beam/third_party_licenses/golang/
#10 ERROR: lstat /var/lib/docker/tmp/buildkit-mount317725317/target/go-licenses: no such file or directory
------
> [6/8] COPY target/LICENSE target/go-licenses/* /opt/apache/beam/third_party_licenses/golang/:
------
ERROR: failed to solve: lstat /var/lib/docker/tmp/buildkit-mount317725317/target/go-licenses: no such file or directory
> Task :sdks:go:container:docker FAILED
FAILURE: Build failed with an exception.
* What went wrong:
Execution failed for task ':sdks:go:container:docker'.
> Process 'command 'docker'' finished with non-zero exit value 1
* Try:
> Run with --stacktrace option to get the stack trace.
> Run with --info or --debug option to get more log output.
* Get more help at https://help.gradle.org
BUILD FAILED in 26s
16 actionable tasks: 5 executed, 11 up-to-date
Publishing build scan...
https://gradle.com/s/pionda2exqd44
$ ./gradlew :sdks:go:container:docker -Pdocker-tag=dev
> Task :sdks:go:test:sparkValidatesRunner FAILED
FAILURE: Build failed with an exception.
* Where:
Build file '<https://ci-beam.apache.org/job/beam_PostCommit_Go_VR_Spark/ws/src/sdks/go/test/build.gradle'> line: 116
* What went wrong:
Execution failed for task ':sdks:go:test:sparkValidatesRunner'.
> Process 'command 'sh'' finished with non-zero exit value 1
* Try:
> Run with --stacktrace option to get the stack trace.
> Run with --info or --debug option to get more log output.
* Get more help at https://help.gradle.org
Deprecated Gradle features were used in this build, making it incompatible with Gradle 8.0.
You can use '--warning-mode all' to show the individual deprecation warnings and determine if they come from your own scripts or plugins.
See https://docs.gradle.org/7.5.1/userguide/command_line_interface.html#sec:command_line_warnings
Execution optimizations have been disabled for 1 invalid unit(s) of work during this build to ensure correctness.
Please consult deprecation warnings for more details.
BUILD FAILED in 1m 29s
117 actionable tasks: 74 executed, 39 from cache, 4 up-to-date
Publishing build scan...
https://gradle.com/s/plib72hc3paqm
Build step 'Invoke Gradle script' changed build result to FAILURE
Build step 'Invoke Gradle script' marked build as failure
---------------------------------------------------------------------
To unsubscribe, e-mail: builds-unsubscribe@beam.apache.org
For additional commands, e-mail: builds-help@beam.apache.org
Build failed in Jenkins: beam_PostCommit_Go_VR_Spark #7417
Posted by Apache Jenkins Server <je...@builds.apache.org>.
See <https://ci-beam.apache.org/job/beam_PostCommit_Go_VR_Spark/7417/display/redirect>
Changes:
------------------------------------------
[...truncated 56.87 KB...]
#11 [ 7/18] ADD target/beam-sdks-java-harness.jar /opt/apache/beam/jars/
#11 DONE 0.1s
#12 [ 8/18] COPY target/jamm.jar target/open-module-agent*.jar /opt/apache/beam/jars/
#12 DONE 0.1s
#13 [ 9/18] COPY target/linux_amd64/boot /opt/apache/beam/
#13 DONE 0.2s
#14 [10/18] COPY target/LICENSE /opt/apache/beam/
#14 DONE 0.1s
#15 [11/18] COPY target/NOTICE /opt/apache/beam/
#15 DONE 0.1s
#16 [12/18] ADD target/third_party_licenses /opt/apache/beam/third_party_licenses/
#16 DONE 0.2s
#17 [13/18] COPY target/LICENSE target/options/* /opt/apache/beam/options/
#17 DONE 0.1s
#18 [14/18] RUN rm /opt/apache/beam/options/LICENSE
#18 DONE 0.7s
#19 [15/18] COPY target/LICENSE target/go-licenses/* /opt/apache/beam/third_party_licenses/golang/
#19 DONE 0.0s
#20 [16/18] RUN rm /opt/apache/beam/third_party_licenses/golang/LICENSE
#20 DONE 0.3s
#21 [17/18] RUN if [ "true" = "false" ] ; then rm -rf /opt/apache/beam/third_party_licenses ; fi
#21 DONE 0.4s
#22 [18/18] COPY target/profiler/* /opt/google_cloud_profiler/
#22 DONE 0.1s
#23 exporting to image
#23 exporting layers
#23 exporting layers 0.3s done
#23 writing image sha256:be575973bf8e262533f6bd0f84bf09963114e1103bd1682d3528d3b380c4c03f done
#23 naming to docker.io/apache/beam_java8_sdk:2.48.0.dev done
#23 DONE 0.3s
> Task :sdks:go:test:sparkValidatesRunner
$ CURRENT_DIRECTORY=<https://ci-beam.apache.org/job/beam_PostCommit_Go_VR_Spark/ws/src/sdks/go/test>
$ TESTS=./test/integration/... ./test/regression
$ RUNNER=portable
$ TIMEOUT=3h
$ SIMULTANEOUS=3
$ GCS_LOCATION=gs://temp-storage-for-end-to-end-tests
$ GCS_SUBFOLDER=test4151
$ PROJECT=apache-beam-testing
$ DATAFLOW_PROJECT=apache-beam-testing
$ REGION=us-central1
$ trap exit_background_processes SIGINT SIGTERM EXIT
$ key=--runner
$ case --runner in
$ RUNNER=spark
$ key=--spark_job_server_jar
$ case --spark_job_server_jar in
$ SPARK_JOB_SERVER_JAR=<https://ci-beam.apache.org/job/beam_PostCommit_Go_VR_Spark/ws/src/runners/spark/3/job-server/build/libs/beam-runners-spark-3-job-server-2.48.0-SNAPSHOT.jar>
$ key=--pipeline_opts
$ case --pipeline_opts in
$ PIPELINE_OPTS=--expansion_jar=test:<https://ci-beam.apache.org/job/beam_PostCommit_Go_VR_Spark/ws/src/sdks/java/testing/expansion-service/build/libs/beam-sdks-java-testing-expansion-service-testExpansionService-2.48.0-SNAPSHOT.jar>
$ cd <https://ci-beam.apache.org/job/beam_PostCommit_Go_VR_Spark/ws/src>
$ test -d sdks/go/test
$ JOB_PORT=60171
$ ENDPOINT=localhost:36169
No endpoint specified; starting a new spark job server on localhost:36169
$ java -jar <https://ci-beam.apache.org/job/beam_PostCommit_Go_VR_Spark/ws/src/runners/spark/3/job-server/build/libs/beam-runners-spark-3-job-server-2.48.0-SNAPSHOT.jar> --spark-master-url local --job-port 36169 --expansion-port 0 --artifact-port 0
$ JOBSERVER_PID=1839536
$ SIMULTANEOUS=1
$ TAG=dev
$ ./gradlew :sdks:go:container:docker -Pdocker-tag=dev
To honour the JVM settings for this build a single-use Daemon process will be forked. See https://docs.gradle.org/7.5.1/userguide/gradle_daemon.html#sec:disabling_the_daemon.
Daemon will be stopped at the end of the build
Configuration on demand is an incubating feature.
23/04/08 20:40:28 WARN software.amazon.awssdk.regions.internal.util.EC2MetadataUtils: Unable to retrieve the requested metadata.
23/04/08 20:40:29 INFO org.apache.beam.runners.jobsubmission.JobServerDriver: ArtifactStagingService started on localhost:35931
23/04/08 20:40:29 INFO org.apache.beam.runners.jobsubmission.JobServerDriver: Java ExpansionService started on localhost:43001
23/04/08 20:40:29 INFO org.apache.beam.runners.jobsubmission.JobServerDriver: JobService started on localhost:36169
23/04/08 20:40:29 INFO org.apache.beam.runners.jobsubmission.JobServerDriver: Job server now running, terminate with Ctrl+C
> Task :buildSrc:compileJava NO-SOURCE
> Task :buildSrc:compileGroovy UP-TO-DATE
> Task :buildSrc:pluginDescriptors UP-TO-DATE
> Task :buildSrc:processResources UP-TO-DATE
> Task :buildSrc:classes UP-TO-DATE
> Task :buildSrc:jar UP-TO-DATE
> Task :buildSrc:assemble UP-TO-DATE
> Task :buildSrc:spotlessGroovy UP-TO-DATE
> Task :buildSrc:spotlessGroovyCheck UP-TO-DATE
> Task :buildSrc:spotlessGroovyGradle UP-TO-DATE
> Task :buildSrc:spotlessGroovyGradleCheck UP-TO-DATE
> Task :buildSrc:spotlessCheck UP-TO-DATE
> Task :buildSrc:pluginUnderTestMetadata UP-TO-DATE
> Task :buildSrc:compileTestJava NO-SOURCE
> Task :buildSrc:compileTestGroovy NO-SOURCE
> Task :buildSrc:processTestResources NO-SOURCE
> Task :buildSrc:testClasses UP-TO-DATE
> Task :buildSrc:test NO-SOURCE
> Task :buildSrc:validatePlugins UP-TO-DATE
> Task :buildSrc:check UP-TO-DATE
> Task :buildSrc:build UP-TO-DATE
System Go installation: /snap/bin/go is go version go1.16.15 linux/amd64; Preparing to use /home/jenkins/go/bin/go1.20.2
go1.20.2: already downloaded in /home/jenkins/sdk/go1.20.2
GOCMD=/home/jenkins/go/bin/go1.20.2
> Task :sdks:go:container:copyLicenses
> Task :sdks:go:container:dockerClean UP-TO-DATE
> Task :sdks:go:container:goPrepare UP-TO-DATE
> Task :sdks:go:container:goBuild
/home/jenkins/go/bin/go1.20.2 build -o ./build/target/linux_amd64/boot boot.go boot_test.go
> Task :sdks:go:container:skipPullLicenses
> Task :sdks:go:container:dockerPrepare
#1 [internal] load build definition from Dockerfile
#1 transferring dockerfile: 1.94kB done
#1 DONE 0.0s
> Task :sdks:go:container:docker
#2 [internal] load .dockerignore
#2 transferring context: 2B done
#2 DONE 0.0s
#3 [internal] load metadata for docker.io/library/debian:bullseye
#3 DONE 0.3s
#4 [1/8] FROM docker.io/library/debian:bullseye@sha256:7b991788987ad860810df60927e1adbaf8e156520177bd4db82409f81dd3b721
#4 CACHED
#5 [internal] load build context
#5 transferring context: 22.20MB 0.2s done
#5 DONE 0.2s
#6 [2/8] RUN apt-get update && DEBIAN_FRONTEND=noninteractive apt-get install -y ca-certificates && rm -rf /var/lib/apt/lists/*
#6 0.690 Get:1 http://deb.debian.org/debian bullseye InRelease [116 kB]
#6 0.866 Get:2 http://deb.debian.org/debian-security bullseye-security InRelease [48.4 kB]
#6 0.896 Get:3 http://deb.debian.org/debian bullseye-updates InRelease [44.1 kB]
#6 1.115 Get:4 http://deb.debian.org/debian bullseye/main amd64 Packages [8183 kB]
#6 1.352 Get:5 http://deb.debian.org/debian-security bullseye-security/main amd64 Packages [236 kB]
#6 1.380 Get:6 http://deb.debian.org/debian bullseye-updates/main amd64 Packages [14.6 kB]
#6 2.650 Fetched 8642 kB in 2s (4258 kB/s)
#6 2.650 Reading package lists...
#6 3.310 Reading package lists...
#6 3.953 Building dependency tree...
#6 4.101 Reading state information...
#6 4.276 The following additional packages will be installed:
#6 4.276 openssl
#6 4.302 The following NEW packages will be installed:
#6 4.303 ca-certificates openssl
#6 4.374 0 upgraded, 2 newly installed, 0 to remove and 1 not upgraded.
#6 4.374 Need to get 1011 kB of archives.
#6 4.374 After this operation, 1892 kB of additional disk space will be used.
#6 4.374 Get:1 http://deb.debian.org/debian-security bullseye-security/main amd64 openssl amd64 1.1.1n-0+deb11u4 [853 kB]
#6 4.511 Get:2 http://deb.debian.org/debian bullseye/main amd64 ca-certificates all 20210119 [158 kB]
#6 5.022 debconf: delaying package configuration, since apt-utils is not installed
#6 5.053 Fetched 1011 kB in 0s (4977 kB/s)
#6 5.145 Selecting previously unselected package openssl.
#6 5.145 (Reading database ... (Reading database ... 5%(Reading database ... 10%(Reading database ... 15%(Reading database ... 20%(Reading database ... 25%(Reading database ... 30%(Reading database ... 35%(Reading database ... 40%(Reading database ... 45%(Reading database ... 50%(Reading database ... 55%(Reading database ... 60%(Reading database ... 65%(Reading database ... 70%(Reading database ... 75%(Reading database ... 80%(Reading database ... 85%(Reading database ... 90%(Reading database ... 95%(Reading database ... 100%(Reading database ... 6661 files and directories currently installed.)
#6 5.236 Preparing to unpack .../openssl_1.1.1n-0+deb11u4_amd64.deb ...
#6 5.241 Unpacking openssl (1.1.1n-0+deb11u4) ...
#6 5.364 Selecting previously unselected package ca-certificates.
#6 5.365 Preparing to unpack .../ca-certificates_20210119_all.deb ...
#6 5.370 Unpacking ca-certificates (20210119) ...
#6 5.441 Setting up openssl (1.1.1n-0+deb11u4) ...
#6 5.460 Setting up ca-certificates (20210119) ...
#6 6.265 Updating certificates in /etc/ssl/certs...
#6 7.133 129 added, 0 removed; done.
#6 7.252 Processing triggers for ca-certificates (20210119) ...
#6 7.261 Updating certificates in /etc/ssl/certs...
#6 7.840 0 added, 0 removed; done.
#6 7.840 Running hooks in /etc/ca-certificates/update.d...
#6 7.855 done.
#6 DONE 8.5s
#7 [3/8] ADD target/linux_amd64/boot /opt/apache/beam/
#7 DONE 0.3s
#8 [4/8] COPY target/LICENSE /opt/apache/beam/
#8 DONE 0.1s
#9 [5/8] COPY target/NOTICE /opt/apache/beam/
#9 DONE 0.1s
#10 [6/8] COPY target/LICENSE target/go-licenses/* /opt/apache/beam/third_party_licenses/golang/
#10 ERROR: lstat /var/lib/docker/tmp/buildkit-mount1359411808/target/go-licenses: no such file or directory
------
> [6/8] COPY target/LICENSE target/go-licenses/* /opt/apache/beam/third_party_licenses/golang/:
------
ERROR: failed to solve: lstat /var/lib/docker/tmp/buildkit-mount1359411808/target/go-licenses: no such file or directory
FAILURE: Build failed with an exception.> Task :sdks:go:container:docker FAILED
* What went wrong:
Execution failed for task ':sdks:go:container:docker'.
> Process 'command 'docker'' finished with non-zero exit value 1
* Try:
> Run with --stacktrace option to get the stack trace.
16 actionable tasks: 5 executed, 11 up-to-date
> Run with --info or --debug option to get more log output.
* Get more help at https://help.gradle.org
BUILD FAILED in 24s
Publishing build scan...
https://gradle.com/s/fr5deb3dmmw6e
$ ./gradlew :sdks:go:container:docker -Pdocker-tag=dev
> Task :sdks:go:test:sparkValidatesRunner FAILED
FAILURE: Build failed with an exception.
* Where:
Build file '<https://ci-beam.apache.org/job/beam_PostCommit_Go_VR_Spark/ws/src/sdks/go/test/build.gradle'> line: 116
* What went wrong:
Execution failed for task ':sdks:go:test:sparkValidatesRunner'.
> Process 'command 'sh'' finished with non-zero exit value 1
* Try:
> Run with --stacktrace option to get the stack trace.
> Run with --info or --debug option to get more log output.
* Get more help at https://help.gradle.org
Deprecated Gradle features were used in this build, making it incompatible with Gradle 8.0.
You can use '--warning-mode all' to show the individual deprecation warnings and determine if they come from your own scripts or plugins.
See https://docs.gradle.org/7.5.1/userguide/command_line_interface.html#sec:command_line_warnings
Execution optimizations have been disabled for 1 invalid unit(s) of work during this build to ensure correctness.
Please consult deprecation warnings for more details.
BUILD FAILED in 1m 28s
117 actionable tasks: 74 executed, 39 from cache, 4 up-to-date
Publishing build scan...
https://gradle.com/s/aupkgcrhpfgp2
Build step 'Invoke Gradle script' changed build result to FAILURE
Build step 'Invoke Gradle script' marked build as failure
---------------------------------------------------------------------
To unsubscribe, e-mail: builds-unsubscribe@beam.apache.org
For additional commands, e-mail: builds-help@beam.apache.org
Build failed in Jenkins: beam_PostCommit_Go_VR_Spark #7416
Posted by Apache Jenkins Server <je...@builds.apache.org>.
See <https://ci-beam.apache.org/job/beam_PostCommit_Go_VR_Spark/7416/display/redirect?page=changes>
Changes:
[noreply] Merge pull request #26096: Allow to set operator chaining for flink
------------------------------------------
[...truncated 57.54 KB...]
#12 [ 8/18] COPY target/jamm.jar target/open-module-agent*.jar /opt/apache/beam/jars/
#12 DONE 0.1s
#13 [ 9/18] COPY target/linux_amd64/boot /opt/apache/beam/
#13 DONE 0.2s
#14 [10/18] COPY target/LICENSE /opt/apache/beam/
#14 DONE 0.1s
#15 [11/18] COPY target/NOTICE /opt/apache/beam/
#15 DONE 0.1s
#16 [12/18] ADD target/third_party_licenses /opt/apache/beam/third_party_licenses/
#16 DONE 0.2s
#17 [13/18] COPY target/LICENSE target/options/* /opt/apache/beam/options/
#17 DONE 0.1s
#18 [14/18] RUN rm /opt/apache/beam/options/LICENSE
#18 DONE 0.3s
#19 [15/18] COPY target/LICENSE target/go-licenses/* /opt/apache/beam/third_party_licenses/golang/
#19 DONE 0.0s
#20 [16/18] RUN rm /opt/apache/beam/third_party_licenses/golang/LICENSE
#20 DONE 0.4s
#21 [17/18] RUN if [ "true" = "false" ] ; then rm -rf /opt/apache/beam/third_party_licenses ; fi
#21 DONE 0.4s
#22 [18/18] COPY target/profiler/* /opt/google_cloud_profiler/
#22 DONE 0.1s
#23 exporting to image
#23 exporting layers
#23 exporting layers 0.3s done
#23 writing image sha256:4391b71031e593e117ed23c6335438bfd33bead3cbbc0a5e3d0bbf9f88345b62 done
#23 naming to docker.io/apache/beam_java8_sdk:2.48.0.dev done
#23 DONE 0.3s
> Task :sdks:go:test:sparkValidatesRunner
$ CURRENT_DIRECTORY=<https://ci-beam.apache.org/job/beam_PostCommit_Go_VR_Spark/ws/src/sdks/go/test>
$ TESTS=./test/integration/... ./test/regression
$ RUNNER=portable
$ TIMEOUT=3h
$ SIMULTANEOUS=3
$ GCS_LOCATION=gs://temp-storage-for-end-to-end-tests
$ GCS_SUBFOLDER=test5285
$ PROJECT=apache-beam-testing
$ DATAFLOW_PROJECT=apache-beam-testing
$ REGION=us-central1
$ trap exit_background_processes SIGINT SIGTERM EXIT
$ key=--runner
$ case --runner in
$ RUNNER=spark
$ key=--spark_job_server_jar
$ case --spark_job_server_jar in
$ SPARK_JOB_SERVER_JAR=<https://ci-beam.apache.org/job/beam_PostCommit_Go_VR_Spark/ws/src/runners/spark/3/job-server/build/libs/beam-runners-spark-3-job-server-2.48.0-SNAPSHOT.jar>
$ key=--pipeline_opts
$ case --pipeline_opts in
$ PIPELINE_OPTS=--expansion_jar=test:<https://ci-beam.apache.org/job/beam_PostCommit_Go_VR_Spark/ws/src/sdks/java/testing/expansion-service/build/libs/beam-sdks-java-testing-expansion-service-testExpansionService-2.48.0-SNAPSHOT.jar>
$ cd <https://ci-beam.apache.org/job/beam_PostCommit_Go_VR_Spark/ws/src>
$ test -d sdks/go/test
$ JOB_PORT=57589
$ ENDPOINT=localhost:48447
No endpoint specified; starting a new spark job server on localhost:48447
$ java -jar <https://ci-beam.apache.org/job/beam_PostCommit_Go_VR_Spark/ws/src/runners/spark/3/job-server/build/libs/beam-runners-spark-3-job-server-2.48.0-SNAPSHOT.jar> --spark-master-url local --job-port 48447 --expansion-port 0 --artifact-port 0
$ JOBSERVER_PID=3048184
$ SIMULTANEOUS=1
$ TAG=dev
$ ./gradlew :sdks:go:container:docker -Pdocker-tag=dev
To honour the JVM settings for this build a single-use Daemon process will be forked. See https://docs.gradle.org/7.5.1/userguide/gradle_daemon.html#sec:disabling_the_daemon.
Daemon will be stopped at the end of the build
Configuration on demand is an incubating feature.
23/04/08 14:40:38 WARN software.amazon.awssdk.regions.internal.util.EC2MetadataUtils: Unable to retrieve the requested metadata.
23/04/08 14:40:38 INFO org.apache.beam.runners.jobsubmission.JobServerDriver: ArtifactStagingService started on localhost:33479
23/04/08 14:40:38 INFO org.apache.beam.runners.jobsubmission.JobServerDriver: Java ExpansionService started on localhost:38711
23/04/08 14:40:38 INFO org.apache.beam.runners.jobsubmission.JobServerDriver: JobService started on localhost:48447
23/04/08 14:40:38 INFO org.apache.beam.runners.jobsubmission.JobServerDriver: Job server now running, terminate with Ctrl+C
> Task :buildSrc:compileJava NO-SOURCE
> Task :buildSrc:compileGroovy UP-TO-DATE
> Task :buildSrc:pluginDescriptors UP-TO-DATE
> Task :buildSrc:processResources UP-TO-DATE
> Task :buildSrc:classes UP-TO-DATE
> Task :buildSrc:jar UP-TO-DATE
> Task :buildSrc:assemble UP-TO-DATE
> Task :buildSrc:spotlessGroovy UP-TO-DATE
> Task :buildSrc:spotlessGroovyCheck UP-TO-DATE
> Task :buildSrc:spotlessGroovyGradle UP-TO-DATE
> Task :buildSrc:spotlessGroovyGradleCheck UP-TO-DATE
> Task :buildSrc:spotlessCheck UP-TO-DATE
> Task :buildSrc:pluginUnderTestMetadata UP-TO-DATE
> Task :buildSrc:compileTestJava NO-SOURCE
> Task :buildSrc:compileTestGroovy NO-SOURCE
> Task :buildSrc:processTestResources NO-SOURCE
> Task :buildSrc:testClasses UP-TO-DATE
> Task :buildSrc:test NO-SOURCE
> Task :buildSrc:validatePlugins UP-TO-DATE
> Task :buildSrc:check UP-TO-DATE
> Task :buildSrc:build UP-TO-DATE
System Go installation: /snap/bin/go is go version go1.16.15 linux/amd64; Preparing to use /home/jenkins/go/bin/go1.20.2
go1.20.2: already downloaded in /home/jenkins/sdk/go1.20.2
GOCMD=/home/jenkins/go/bin/go1.20.2
> Task :sdks:go:container:copyLicenses
> Task :sdks:go:container:dockerClean UP-TO-DATE
> Task :sdks:go:container:goPrepare UP-TO-DATE
> Task :sdks:go:container:goBuild
/home/jenkins/go/bin/go1.20.2 build -o ./build/target/linux_amd64/boot boot.go boot_test.go
> Task :sdks:go:container:skipPullLicenses
> Task :sdks:go:container:dockerPrepare
#1 [internal] load build definition from Dockerfile
#1 DONE 0.0s
> Task :sdks:go:container:docker
#1 [internal] load build definition from Dockerfile
#1 transferring dockerfile: 1.94kB done
#1 DONE 0.0s
#2 [internal] load .dockerignore
#2 transferring context: 2B done
#2 DONE 0.0s
#3 [internal] load metadata for docker.io/library/debian:bullseye
#3 DONE 0.6s
#4 [1/8] FROM docker.io/library/debian:bullseye@sha256:7b991788987ad860810df60927e1adbaf8e156520177bd4db82409f81dd3b721
#4 CACHED
#5 [internal] load build context
#5 transferring context: 22.20MB 0.2s done
#5 DONE 0.2s
#6 [2/8] RUN apt-get update && DEBIAN_FRONTEND=noninteractive apt-get install -y ca-certificates && rm -rf /var/lib/apt/lists/*
#6 0.573 Get:1 http://deb.debian.org/debian bullseye InRelease [116 kB]
#6 0.605 Get:2 http://deb.debian.org/debian-security bullseye-security InRelease [48.4 kB]
#6 0.617 Get:3 http://deb.debian.org/debian bullseye-updates InRelease [44.1 kB]
#6 0.777 Get:4 http://deb.debian.org/debian bullseye/main amd64 Packages [8183 kB]
#6 0.889 Get:5 http://deb.debian.org/debian-security bullseye-security/main amd64 Packages [236 kB]
#6 1.009 Get:6 http://deb.debian.org/debian bullseye-updates/main amd64 Packages [14.6 kB]
#6 2.202 Fetched 8642 kB in 2s (5221 kB/s)
#6 2.202 Reading package lists...
#6 2.862 Reading package lists...
#6 3.492 Building dependency tree...
#6 3.648 Reading state information...
#6 3.823 The following additional packages will be installed:
#6 3.823 openssl
#6 3.849 The following NEW packages will be installed:
#6 3.849 ca-certificates openssl
#6 3.946 0 upgraded, 2 newly installed, 0 to remove and 1 not upgraded.
#6 3.946 Need to get 1011 kB of archives.
#6 3.946 After this operation, 1892 kB of additional disk space will be used.
#6 3.946 Get:1 http://deb.debian.org/debian-security bullseye-security/main amd64 openssl amd64 1.1.1n-0+deb11u4 [853 kB]
#6 4.147 Get:2 http://deb.debian.org/debian bullseye/main amd64 ca-certificates all 20210119 [158 kB]
#6 4.503 debconf: delaying package configuration, since apt-utils is not installed
#6 4.537 Fetched 1011 kB in 0s (3431 kB/s)
#6 4.563 Selecting previously unselected package openssl.
#6 4.563 (Reading database ... (Reading database ... 5%(Reading database ... 10%(Reading database ... 15%(Reading database ... 20%(Reading database ... 25%(Reading database ... 30%(Reading database ... 35%(Reading database ... 40%(Reading database ... 45%(Reading database ... 50%(Reading database ... 55%(Reading database ... 60%(Reading database ... 65%(Reading database ... 70%(Reading database ... 75%(Reading database ... 80%(Reading database ... 85%(Reading database ... 90%(Reading database ... 95%(Reading database ... 100%(Reading database ... 6661 files and directories currently installed.)
#6 4.576 Preparing to unpack .../openssl_1.1.1n-0+deb11u4_amd64.deb ...
#6 4.580 Unpacking openssl (1.1.1n-0+deb11u4) ...
#6 4.695 Selecting previously unselected package ca-certificates.
#6 4.696 Preparing to unpack .../ca-certificates_20210119_all.deb ...
#6 4.700 Unpacking ca-certificates (20210119) ...
#6 4.772 Setting up openssl (1.1.1n-0+deb11u4) ...
#6 4.789 Setting up ca-certificates (20210119) ...
#6 5.677 Updating certificates in /etc/ssl/certs...
#6 6.499 129 added, 0 removed; done.
#6 6.630 Processing triggers for ca-certificates (20210119) ...
#6 6.639 Updating certificates in /etc/ssl/certs...
#6 7.226 0 added, 0 removed; done.
#6 7.226 Running hooks in /etc/ca-certificates/update.d...
#6 7.234 done.
#6 DONE 7.9s
#7 [3/8] ADD target/linux_amd64/boot /opt/apache/beam/
#7 DONE 0.3s
#8 [4/8] COPY target/LICENSE /opt/apache/beam/
#8 DONE 0.1s
#9 [5/8] COPY target/NOTICE /opt/apache/beam/
#9 DONE 0.1s
#10 [6/8] COPY target/LICENSE target/go-licenses/* /opt/apache/beam/third_party_licenses/golang/
#10 ERROR: lstat /var/lib/docker/tmp/buildkit-mount3885208500/target/go-licenses: no such file or directory
------
> [6/8] COPY target/LICENSE target/go-licenses/* /opt/apache/beam/third_party_licenses/golang/:
------
ERROR: failed to solve: lstat /var/lib/docker/tmp/buildkit-mount3885208500/target/go-licenses: no such file or directory
> Task :sdks:go:container:docker FAILED
FAILURE: Build failed with an exception.
* What went wrong:
Execution failed for task ':sdks:go:container:docker'.
> Process 'command 'docker'' finished with non-zero exit value 1
* Try:
> Run with --stacktrace option to get the stack trace.
> Run with --info or --debug option to get more log output.
* Get more help at https://help.gradle.org
BUILD FAILED in 23s
16 actionable tasks: 5 executed, 11 up-to-date
Publishing build scan...
https://gradle.com/s/vcoijxffvabho
$ ./gradlew :sdks:go:container:docker -Pdocker-tag=dev
> Task :sdks:go:test:sparkValidatesRunner FAILED
FAILURE: Build failed with an exception.
* Where:
Build file '<https://ci-beam.apache.org/job/beam_PostCommit_Go_VR_Spark/ws/src/sdks/go/test/build.gradle'> line: 116
* What went wrong:
Execution failed for task ':sdks:go:test:sparkValidatesRunner'.
> Process 'command 'sh'' finished with non-zero exit value 1
* Try:
> Run with --stacktrace option to get the stack trace.
> Run with --info or --debug option to get more log output.
* Get more help at https://help.gradle.org
Deprecated Gradle features were used in this build, making it incompatible with Gradle 8.0.
You can use '--warning-mode all' to show the individual deprecation warnings and determine if they come from your own scripts or plugins.
See https://docs.gradle.org/7.5.1/userguide/command_line_interface.html#sec:command_line_warnings
Execution optimizations have been disabled for 1 invalid unit(s) of work during this build to ensure correctness.
Please consult deprecation warnings for more details.
BUILD FAILED in 1m 37s
117 actionable tasks: 74 executed, 39 from cache, 4 up-to-date
Publishing build scan...
https://gradle.com/s/7kebeplsniejs
Build step 'Invoke Gradle script' changed build result to FAILURE
Build step 'Invoke Gradle script' marked build as failure
---------------------------------------------------------------------
To unsubscribe, e-mail: builds-unsubscribe@beam.apache.org
For additional commands, e-mail: builds-help@beam.apache.org
Build failed in Jenkins: beam_PostCommit_Go_VR_Spark #7415
Posted by Apache Jenkins Server <je...@builds.apache.org>.
See <https://ci-beam.apache.org/job/beam_PostCommit_Go_VR_Spark/7415/display/redirect>
Changes:
------------------------------------------
[...truncated 56.84 KB...]
#11 [ 5/18] ADD target/log4j-over-slf4j.jar /opt/apache/beam/jars/
#11 CACHED
#12 [ 6/18] ADD target/log4j-to-slf4j.jar /opt/apache/beam/jars/
#12 CACHED
#13 [ 9/18] COPY target/linux_amd64/boot /opt/apache/beam/
#13 DONE 1.2s
#14 [10/18] COPY target/LICENSE /opt/apache/beam/
#14 DONE 0.8s
#15 [11/18] COPY target/NOTICE /opt/apache/beam/
#15 DONE 0.2s
#16 [12/18] ADD target/third_party_licenses /opt/apache/beam/third_party_licenses/
#16 DONE 0.3s
#17 [13/18] COPY target/LICENSE target/options/* /opt/apache/beam/options/
#17 DONE 0.1s
#18 [14/18] RUN rm /opt/apache/beam/options/LICENSE
#18 DONE 0.3s
#19 [15/18] COPY target/LICENSE target/go-licenses/* /opt/apache/beam/third_party_licenses/golang/
#19 DONE 0.1s
#20 [16/18] RUN rm /opt/apache/beam/third_party_licenses/golang/LICENSE
#20 DONE 0.4s
#21 [17/18] RUN if [ "true" = "false" ] ; then rm -rf /opt/apache/beam/third_party_licenses ; fi
#21 DONE 0.5s
#22 [18/18] COPY target/profiler/* /opt/google_cloud_profiler/
#22 DONE 0.1s
#23 exporting to image
#23 exporting layers
#23 exporting layers 0.2s done
#23 writing image sha256:0cfd22684e3affd1670b396c4d68bce55409e27b9c94981c3c078f00a76d1ce5
#23 writing image sha256:0cfd22684e3affd1670b396c4d68bce55409e27b9c94981c3c078f00a76d1ce5 done
#23 naming to docker.io/apache/beam_java8_sdk:2.48.0.dev done
#23 DONE 0.3s
> Task :sdks:go:test:sparkValidatesRunner
$ CURRENT_DIRECTORY=<https://ci-beam.apache.org/job/beam_PostCommit_Go_VR_Spark/ws/src/sdks/go/test>
$ TESTS=./test/integration/... ./test/regression
$ RUNNER=portable
$ TIMEOUT=3h
$ SIMULTANEOUS=3
$ GCS_LOCATION=gs://temp-storage-for-end-to-end-tests
$ GCS_SUBFOLDER=test10472
$ PROJECT=apache-beam-testing
$ DATAFLOW_PROJECT=apache-beam-testing
$ REGION=us-central1
$ trap exit_background_processes SIGINT SIGTERM EXIT
$ key=--runner
$ case --runner in
$ RUNNER=spark
$ key=--spark_job_server_jar
$ case --spark_job_server_jar in
$ SPARK_JOB_SERVER_JAR=<https://ci-beam.apache.org/job/beam_PostCommit_Go_VR_Spark/ws/src/runners/spark/3/job-server/build/libs/beam-runners-spark-3-job-server-2.48.0-SNAPSHOT.jar>
$ key=--pipeline_opts
$ case --pipeline_opts in
$ PIPELINE_OPTS=--expansion_jar=test:<https://ci-beam.apache.org/job/beam_PostCommit_Go_VR_Spark/ws/src/sdks/java/testing/expansion-service/build/libs/beam-sdks-java-testing-expansion-service-testExpansionService-2.48.0-SNAPSHOT.jar>
$ cd <https://ci-beam.apache.org/job/beam_PostCommit_Go_VR_Spark/ws/src>
$ test -d sdks/go/test
$ JOB_PORT=56281
$ ENDPOINT=localhost:60403
No endpoint specified; starting a new spark job server on localhost:60403
$ java -jar <https://ci-beam.apache.org/job/beam_PostCommit_Go_VR_Spark/ws/src/runners/spark/3/job-server/build/libs/beam-runners-spark-3-job-server-2.48.0-SNAPSHOT.jar> --spark-master-url local --job-port 60403 --expansion-port 0 --artifact-port 0
$ JOBSERVER_PID=1771863
$ SIMULTANEOUS=1
$ TAG=dev
$ ./gradlew :sdks:go:container:docker -Pdocker-tag=dev
To honour the JVM settings for this build a single-use Daemon process will be forked. See https://docs.gradle.org/7.5.1/userguide/gradle_daemon.html#sec:disabling_the_daemon.
Daemon will be stopped at the end of the build
Configuration on demand is an incubating feature.
23/04/08 08:40:30 WARN software.amazon.awssdk.regions.internal.util.EC2MetadataUtils: Unable to retrieve the requested metadata.
23/04/08 08:40:30 INFO org.apache.beam.runners.jobsubmission.JobServerDriver: ArtifactStagingService started on localhost:42161
23/04/08 08:40:30 INFO org.apache.beam.runners.jobsubmission.JobServerDriver: Java ExpansionService started on localhost:33717
23/04/08 08:40:30 INFO org.apache.beam.runners.jobsubmission.JobServerDriver: JobService started on localhost:60403
23/04/08 08:40:30 INFO org.apache.beam.runners.jobsubmission.JobServerDriver: Job server now running, terminate with Ctrl+C
> Task :buildSrc:compileJava NO-SOURCE
> Task :buildSrc:compileGroovy UP-TO-DATE
> Task :buildSrc:pluginDescriptors UP-TO-DATE
> Task :buildSrc:processResources UP-TO-DATE
> Task :buildSrc:classes UP-TO-DATE
> Task :buildSrc:jar UP-TO-DATE
> Task :buildSrc:assemble UP-TO-DATE
> Task :buildSrc:spotlessGroovy UP-TO-DATE
> Task :buildSrc:spotlessGroovyCheck UP-TO-DATE
> Task :buildSrc:spotlessGroovyGradle UP-TO-DATE
> Task :buildSrc:spotlessGroovyGradleCheck UP-TO-DATE
> Task :buildSrc:spotlessCheck UP-TO-DATE
> Task :buildSrc:pluginUnderTestMetadata UP-TO-DATE
> Task :buildSrc:compileTestJava NO-SOURCE
> Task :buildSrc:compileTestGroovy NO-SOURCE
> Task :buildSrc:processTestResources NO-SOURCE
> Task :buildSrc:testClasses UP-TO-DATE
> Task :buildSrc:test NO-SOURCE
> Task :buildSrc:validatePlugins UP-TO-DATE
> Task :buildSrc:check UP-TO-DATE
> Task :buildSrc:build UP-TO-DATE
System Go installation: /snap/bin/go is go version go1.16.15 linux/amd64; Preparing to use /home/jenkins/go/bin/go1.20.2
go1.20.2: already downloaded in /home/jenkins/sdk/go1.20.2
GOCMD=/home/jenkins/go/bin/go1.20.2
> Task :sdks:go:container:copyLicenses
> Task :sdks:go:container:dockerClean UP-TO-DATE
> Task :sdks:go:container:goPrepare UP-TO-DATE
> Task :sdks:go:container:goBuild
/home/jenkins/go/bin/go1.20.2 build -o ./build/target/linux_amd64/boot boot.go boot_test.go
> Task :sdks:go:container:skipPullLicenses
> Task :sdks:go:container:dockerPrepare
> Task :sdks:go:container:docker
#1 [internal] load build definition from Dockerfile
#1 transferring dockerfile: 1.94kB done
#1 DONE 0.0s
#2 [internal] load .dockerignore
#2 transferring context: 2B done
#2 DONE 0.0s
#3 [internal] load metadata for docker.io/library/debian:bullseye
#3 DONE 0.3s
#4 [1/8] FROM docker.io/library/debian:bullseye@sha256:7b991788987ad860810df60927e1adbaf8e156520177bd4db82409f81dd3b721
#4 CACHED
#5 [internal] load build context
#5 transferring context: 22.20MB 0.3s done
#5 DONE 0.3s
#6 [2/8] RUN apt-get update && DEBIAN_FRONTEND=noninteractive apt-get install -y ca-certificates && rm -rf /var/lib/apt/lists/*
#6 1.534 Get:1 http://deb.debian.org/debian bullseye InRelease [116 kB]
#6 1.621 Get:2 http://deb.debian.org/debian-security bullseye-security InRelease [48.4 kB]
#6 1.663 Get:3 http://deb.debian.org/debian bullseye-updates InRelease [44.1 kB]
#6 2.184 Get:4 http://deb.debian.org/debian bullseye/main amd64 Packages [8183 kB]
#6 2.484 Get:5 http://deb.debian.org/debian-security bullseye-security/main amd64 Packages [236 kB]
#6 2.486 Get:6 http://deb.debian.org/debian bullseye-updates/main amd64 Packages [14.6 kB]
#6 3.805 Fetched 8642 kB in 2s (3516 kB/s)
#6 3.805 Reading package lists...
#6 4.663 Reading package lists...
#6 5.537 Building dependency tree...
#6 5.757 Reading state information...
#6 5.904 The following additional packages will be installed:
#6 5.904 openssl
#6 5.927 The following NEW packages will be installed:
#6 5.928 ca-certificates openssl
#6 6.019 0 upgraded, 2 newly installed, 0 to remove and 1 not upgraded.
#6 6.019 Need to get 1011 kB of archives.
#6 6.019 After this operation, 1892 kB of additional disk space will be used.
#6 6.019 Get:1 http://deb.debian.org/debian-security bullseye-security/main amd64 openssl amd64 1.1.1n-0+deb11u4 [853 kB]
#6 6.222 Get:2 http://deb.debian.org/debian bullseye/main amd64 ca-certificates all 20210119 [158 kB]
#6 6.640 debconf: delaying package configuration, since apt-utils is not installed
#6 6.671 Fetched 1011 kB in 0s (3466 kB/s)
#6 6.767 Selecting previously unselected package openssl.
#6 6.767 (Reading database ... (Reading database ... 5%(Reading database ... 10%(Reading database ... 15%(Reading database ... 20%(Reading database ... 25%(Reading database ... 30%(Reading database ... 35%(Reading database ... 40%(Reading database ... 45%(Reading database ... 50%(Reading database ... 55%(Reading database ... 60%(Reading database ... 65%(Reading database ... 70%(Reading database ... 75%(Reading database ... 80%(Reading database ... 85%(Reading database ... 90%(Reading database ... 95%(Reading database ... 100%(Reading database ... 6661 files and directories currently installed.)
#6 6.780 Preparing to unpack .../openssl_1.1.1n-0+deb11u4_amd64.deb ...
#6 6.785 Unpacking openssl (1.1.1n-0+deb11u4) ...
#6 6.900 Selecting previously unselected package ca-certificates.
#6 6.902 Preparing to unpack .../ca-certificates_20210119_all.deb ...
#6 6.905 Unpacking ca-certificates (20210119) ...
#6 6.975 Setting up openssl (1.1.1n-0+deb11u4) ...
#6 6.992 Setting up ca-certificates (20210119) ...
#6 7.730 Updating certificates in /etc/ssl/certs...
#6 8.582 129 added, 0 removed; done.
#6 8.652 Processing triggers for ca-certificates (20210119) ...
#6 8.661 Updating certificates in /etc/ssl/certs...
#6 9.236 0 added, 0 removed; done.
#6 9.236 Running hooks in /etc/ca-certificates/update.d...
#6 9.239 done.
#6 DONE 9.9s
#7 [3/8] ADD target/linux_amd64/boot /opt/apache/beam/
#7 DONE 0.3s
#8 [4/8] COPY target/LICENSE /opt/apache/beam/
#8 DONE 0.1s
#9 [5/8] COPY target/NOTICE /opt/apache/beam/
#9 DONE 0.1s
#10 [6/8] COPY target/LICENSE target/go-licenses/* /opt/apache/beam/third_party_licenses/golang/
#10 ERROR: lstat /var/lib/docker/tmp/buildkit-mount1731915645/target/go-licenses: no such file or directory
------
> [6/8] COPY target/LICENSE target/go-licenses/* /opt/apache/beam/third_party_licenses/golang/:
------
ERROR: failed to solve: lstat /var/lib/docker/tmp/buildkit-mount1731915645/target/go-licenses: no such file or directory
> Task :sdks:go:container:docker FAILED
FAILURE: Build failed with an exception.
* What went wrong:
Execution failed for task ':sdks:go:container:docker'.
> Process 'command 'docker'' finished with non-zero exit value 1
* Try:
> Run with --stacktrace option to get the stack trace.
> Run with --info or --debug option to get more log output.
* Get more help at https://help.gradle.org
BUILD FAILED in 27s
16 actionable tasks: 5 executed, 11 up-to-date
Publishing build scan...
https://gradle.com/s/k6zfumzf5ga5e
$ ./gradlew :sdks:go:container:docker -Pdocker-tag=dev
> Task :sdks:go:test:sparkValidatesRunner FAILED
FAILURE: Build failed with an exception.
* Where:
Build file '<https://ci-beam.apache.org/job/beam_PostCommit_Go_VR_Spark/ws/src/sdks/go/test/build.gradle'> line: 116
* What went wrong:
Execution failed for task ':sdks:go:test:sparkValidatesRunner'.
> Process 'command 'sh'' finished with non-zero exit value 1
* Try:
> Run with --stacktrace option to get the stack trace.
> Run with --info or --debug option to get more log output.
* Get more help at https://help.gradle.org
Deprecated Gradle features were used in this build, making it incompatible with Gradle 8.0.
You can use '--warning-mode all' to show the individual deprecation warnings and determine if they come from your own scripts or plugins.
See https://docs.gradle.org/7.5.1/userguide/command_line_interface.html#sec:command_line_warnings
Execution optimizations have been disabled for 1 invalid unit(s) of work during this build to ensure correctness.
Please consult deprecation warnings for more details.
BUILD FAILED in 1m 33s
117 actionable tasks: 74 executed, 39 from cache, 4 up-to-date
Publishing build scan...
https://gradle.com/s/vidckkharg47i
Build step 'Invoke Gradle script' changed build result to FAILURE
Build step 'Invoke Gradle script' marked build as failure
---------------------------------------------------------------------
To unsubscribe, e-mail: builds-unsubscribe@beam.apache.org
For additional commands, e-mail: builds-help@beam.apache.org
Build failed in Jenkins: beam_PostCommit_Go_VR_Spark #7414
Posted by Apache Jenkins Server <je...@builds.apache.org>.
See <https://ci-beam.apache.org/job/beam_PostCommit_Go_VR_Spark/7414/display/redirect>
Changes:
------------------------------------------
[...truncated 56.58 KB...]
#12 [ 8/18] COPY target/jamm.jar target/open-module-agent*.jar /opt/apache/beam/jars/
#12 DONE 0.1s
#13 [ 9/18] COPY target/linux_amd64/boot /opt/apache/beam/
#13 DONE 0.2s
#14 [10/18] COPY target/LICENSE /opt/apache/beam/
#14 DONE 0.1s
#15 [11/18] COPY target/NOTICE /opt/apache/beam/
#15 DONE 0.1s
#16 [12/18] ADD target/third_party_licenses /opt/apache/beam/third_party_licenses/
#16 DONE 0.2s
#17 [13/18] COPY target/LICENSE target/options/* /opt/apache/beam/options/
#17 DONE 0.1s
#18 [14/18] RUN rm /opt/apache/beam/options/LICENSE
#18 DONE 0.3s
#19 [15/18] COPY target/LICENSE target/go-licenses/* /opt/apache/beam/third_party_licenses/golang/
#19 DONE 0.0s
#20 [16/18] RUN rm /opt/apache/beam/third_party_licenses/golang/LICENSE
#20 DONE 0.3s
#21 [17/18] RUN if [ "true" = "false" ] ; then rm -rf /opt/apache/beam/third_party_licenses ; fi
#21 DONE 0.4s
#22 [18/18] COPY target/profiler/* /opt/google_cloud_profiler/
#22 DONE 0.1s
#23 exporting to image
#23 exporting layers
#23 exporting layers 0.2s done
#23 writing image sha256:05f3a1b62e99c879d219aae426fb05e1b0179539aaf1069fed5a8f28253d37e8 done
#23 naming to docker.io/apache/beam_java8_sdk:2.48.0.dev done
#23 DONE 0.2s
> Task :sdks:go:test:sparkValidatesRunner
$ CURRENT_DIRECTORY=<https://ci-beam.apache.org/job/beam_PostCommit_Go_VR_Spark/ws/src/sdks/go/test>
$ TESTS=./test/integration/... ./test/regression
$ RUNNER=portable
$ TIMEOUT=3h
$ SIMULTANEOUS=3
$ GCS_LOCATION=gs://temp-storage-for-end-to-end-tests
$ GCS_SUBFOLDER=test10687
$ PROJECT=apache-beam-testing
$ DATAFLOW_PROJECT=apache-beam-testing
$ REGION=us-central1
$ trap exit_background_processes SIGINT SIGTERM EXIT
$ key=--runner
$ case --runner in
$ RUNNER=spark
$ key=--spark_job_server_jar
$ case --spark_job_server_jar in
$ SPARK_JOB_SERVER_JAR=<https://ci-beam.apache.org/job/beam_PostCommit_Go_VR_Spark/ws/src/runners/spark/3/job-server/build/libs/beam-runners-spark-3-job-server-2.48.0-SNAPSHOT.jar>
$ key=--pipeline_opts
$ case --pipeline_opts in
$ PIPELINE_OPTS=--expansion_jar=test:<https://ci-beam.apache.org/job/beam_PostCommit_Go_VR_Spark/ws/src/sdks/java/testing/expansion-service/build/libs/beam-sdks-java-testing-expansion-service-testExpansionService-2.48.0-SNAPSHOT.jar>
$ cd <https://ci-beam.apache.org/job/beam_PostCommit_Go_VR_Spark/ws/src>
$ test -d sdks/go/test
$ JOB_PORT=56211
$ ENDPOINT=localhost:33421
No endpoint specified; starting a new spark job server on localhost:33421
$ java -jar <https://ci-beam.apache.org/job/beam_PostCommit_Go_VR_Spark/ws/src/runners/spark/3/job-server/build/libs/beam-runners-spark-3-job-server-2.48.0-SNAPSHOT.jar> --spark-master-url local --job-port 33421 --expansion-port 0 --artifact-port 0
$ JOBSERVER_PID=1721064
$ SIMULTANEOUS=1
$ TAG=dev
$ ./gradlew :sdks:go:container:docker -Pdocker-tag=dev
To honour the JVM settings for this build a single-use Daemon process will be forked. See https://docs.gradle.org/7.5.1/userguide/gradle_daemon.html#sec:disabling_the_daemon.
Daemon will be stopped at the end of the build
23/04/08 02:40:30 WARN software.amazon.awssdk.regions.internal.util.EC2MetadataUtils: Unable to retrieve the requested metadata.
Configuration on demand is an incubating feature.
23/04/08 02:40:30 INFO org.apache.beam.runners.jobsubmission.JobServerDriver: ArtifactStagingService started on localhost:33247
23/04/08 02:40:30 INFO org.apache.beam.runners.jobsubmission.JobServerDriver: Java ExpansionService started on localhost:45505
23/04/08 02:40:30 INFO org.apache.beam.runners.jobsubmission.JobServerDriver: JobService started on localhost:33421
23/04/08 02:40:30 INFO org.apache.beam.runners.jobsubmission.JobServerDriver: Job server now running, terminate with Ctrl+C
> Task :buildSrc:compileJava NO-SOURCE
> Task :buildSrc:compileGroovy UP-TO-DATE
> Task :buildSrc:pluginDescriptors UP-TO-DATE
> Task :buildSrc:processResources UP-TO-DATE
> Task :buildSrc:classes UP-TO-DATE
> Task :buildSrc:jar UP-TO-DATE
> Task :buildSrc:assemble UP-TO-DATE
> Task :buildSrc:spotlessGroovy UP-TO-DATE
> Task :buildSrc:spotlessGroovyCheck UP-TO-DATE
> Task :buildSrc:spotlessGroovyGradle UP-TO-DATE
> Task :buildSrc:spotlessGroovyGradleCheck UP-TO-DATE
> Task :buildSrc:spotlessCheck UP-TO-DATE
> Task :buildSrc:pluginUnderTestMetadata UP-TO-DATE
> Task :buildSrc:compileTestJava NO-SOURCE
> Task :buildSrc:compileTestGroovy NO-SOURCE
> Task :buildSrc:processTestResources NO-SOURCE
> Task :buildSrc:testClasses UP-TO-DATE
> Task :buildSrc:test NO-SOURCE
> Task :buildSrc:validatePlugins UP-TO-DATE
> Task :buildSrc:check UP-TO-DATE
> Task :buildSrc:build UP-TO-DATE
System Go installation: /snap/bin/go is go version go1.16.15 linux/amd64; Preparing to use /home/jenkins/go/bin/go1.20.2
go1.20.2: already downloaded in /home/jenkins/sdk/go1.20.2
GOCMD=/home/jenkins/go/bin/go1.20.2
> Task :sdks:go:container:copyLicenses
> Task :sdks:go:container:dockerClean UP-TO-DATE
> Task :sdks:go:container:goPrepare UP-TO-DATE
> Task :sdks:go:container:goBuild
/home/jenkins/go/bin/go1.20.2 build -o ./build/target/linux_amd64/boot boot.go boot_test.go
> Task :sdks:go:container:skipPullLicenses
> Task :sdks:go:container:dockerPrepare
#1 [internal] load build definition from Dockerfile
#1 transferring dockerfile: 1.94kB done
> Task :sdks:go:container:docker
#1 DONE 0.0s
#2 [internal] load .dockerignore
#2 DONE 0.0s
#2 [internal] load .dockerignore
#2 transferring context: 2B done
#2 DONE 0.0s
#3 [internal] load metadata for docker.io/library/debian:bullseye
#3 DONE 0.3s
#4 [1/8] FROM docker.io/library/debian:bullseye@sha256:7b991788987ad860810df60927e1adbaf8e156520177bd4db82409f81dd3b721
#4 CACHED
#5 [internal] load build context
#5 transferring context: 22.20MB 0.2s done
#5 DONE 0.2s
#6 [2/8] RUN apt-get update && DEBIAN_FRONTEND=noninteractive apt-get install -y ca-certificates && rm -rf /var/lib/apt/lists/*
#6 1.728 Get:1 http://deb.debian.org/debian bullseye InRelease [116 kB]
#6 1.783 Get:2 http://deb.debian.org/debian-security bullseye-security InRelease [48.4 kB]
#6 1.783 Get:3 http://deb.debian.org/debian bullseye-updates InRelease [44.1 kB]
#6 2.363 Get:4 http://deb.debian.org/debian bullseye/main amd64 Packages [8183 kB]
#6 2.533 Get:5 http://deb.debian.org/debian-security bullseye-security/main amd64 Packages [236 kB]
#6 2.616 Get:6 http://deb.debian.org/debian bullseye-updates/main amd64 Packages [14.6 kB]
#6 3.836 Fetched 8642 kB in 2s (3888 kB/s)
#6 3.836 Reading package lists...
#6 4.509 Reading package lists...
#6 5.122 Building dependency tree...
#6 5.268 Reading state information...
#6 5.468 The following additional packages will be installed:
#6 5.468 openssl
#6 5.491 The following NEW packages will be installed:
#6 5.492 ca-certificates openssl
#6 5.532 0 upgraded, 2 newly installed, 0 to remove and 1 not upgraded.
#6 5.532 Need to get 1011 kB of archives.
#6 5.532 After this operation, 1892 kB of additional disk space will be used.
#6 5.532 Get:1 http://deb.debian.org/debian-security bullseye-security/main amd64 openssl amd64 1.1.1n-0+deb11u4 [853 kB]
#6 5.595 Get:2 http://deb.debian.org/debian bullseye/main amd64 ca-certificates all 20210119 [158 kB]
#6 6.434 debconf: delaying package configuration, since apt-utils is not installed
#6 6.464 Fetched 1011 kB in 0s (10.2 MB/s)
#6 6.652 Selecting previously unselected package openssl.
#6 6.652 (Reading database ... (Reading database ... 5%(Reading database ... 10%(Reading database ... 15%(Reading database ... 20%(Reading database ... 25%(Reading database ... 30%(Reading database ... 35%(Reading database ... 40%(Reading database ... 45%(Reading database ... 50%(Reading database ... 55%(Reading database ... 60%(Reading database ... 65%(Reading database ... 70%(Reading database ... 75%(Reading database ... 80%(Reading database ... 85%(Reading database ... 90%(Reading database ... 95%(Reading database ... 100%(Reading database ... 6661 files and directories currently installed.)
#6 6.809 Preparing to unpack .../openssl_1.1.1n-0+deb11u4_amd64.deb ...
#6 6.814 Unpacking openssl (1.1.1n-0+deb11u4) ...
#6 6.930 Selecting previously unselected package ca-certificates.
#6 6.932 Preparing to unpack .../ca-certificates_20210119_all.deb ...
#6 6.935 Unpacking ca-certificates (20210119) ...
#6 7.005 Setting up openssl (1.1.1n-0+deb11u4) ...
#6 7.021 Setting up ca-certificates (20210119) ...
#6 7.815 Updating certificates in /etc/ssl/certs...
#6 8.677 129 added, 0 removed; done.
#6 8.757 Processing triggers for ca-certificates (20210119) ...
#6 8.765 Updating certificates in /etc/ssl/certs...
#6 9.357 0 added, 0 removed; done.
#6 9.357 Running hooks in /etc/ca-certificates/update.d...
#6 9.360 done.
#6 DONE 10.0s
#7 [3/8] ADD target/linux_amd64/boot /opt/apache/beam/
#7 DONE 0.3s
#8 [4/8] COPY target/LICENSE /opt/apache/beam/
#8 DONE 0.1s
#9 [5/8] COPY target/NOTICE /opt/apache/beam/
#9 DONE 0.1s
#10 [6/8] COPY target/LICENSE target/go-licenses/* /opt/apache/beam/third_party_licenses/golang/
#10 ERROR: lstat /var/lib/docker/tmp/buildkit-mount2282632487/target/go-licenses: no such file or directory
------
> [6/8] COPY target/LICENSE target/go-licenses/* /opt/apache/beam/third_party_licenses/golang/:
------
ERROR: failed to solve: lstat /var/lib/docker/tmp/buildkit-mount2282632487/target/go-licenses: no such file or directory
> Task :sdks:go:container:docker FAILED
FAILURE: Build failed with an exception.
* What went wrong:
Execution failed for task ':sdks:go:container:docker'.
> Process 'command 'docker'' finished with non-zero exit value 1
* Try:
> Run with --stacktrace option to get the stack trace.
> Run with --info or --debug option to get more log output.
* Get more help at https://help.gradle.org
BUILD FAILED in 24s
16 actionable tasks: 5 executed, 11 up-to-date
Publishing build scan...
https://gradle.com/s/mytw564ryvuak
$ ./gradlew :sdks:go:container:docker -Pdocker-tag=dev
> Task :sdks:go:test:sparkValidatesRunner FAILED
FAILURE: Build failed with an exception.
* Where:
Build file '<https://ci-beam.apache.org/job/beam_PostCommit_Go_VR_Spark/ws/src/sdks/go/test/build.gradle'> line: 116
* What went wrong:
Execution failed for task ':sdks:go:test:sparkValidatesRunner'.
> Process 'command 'sh'' finished with non-zero exit value 1
* Try:
> Run with --stacktrace option to get the stack trace.
> Run with --info or --debug option to get more log output.
* Get more help at https://help.gradle.org
Deprecated Gradle features were used in this build, making it incompatible with Gradle 8.0.
You can use '--warning-mode all' to show the individual deprecation warnings and determine if they come from your own scripts or plugins.
See https://docs.gradle.org/7.5.1/userguide/command_line_interface.html#sec:command_line_warnings
Execution optimizations have been disabled for 1 invalid unit(s) of work during this build to ensure correctness.
Please consult deprecation warnings for more details.
BUILD FAILED in 1m 29s
117 actionable tasks: 74 executed, 39 from cache, 4 up-to-date
Publishing build scan...
https://gradle.com/s/egtng2afwfqma
Build step 'Invoke Gradle script' changed build result to FAILURE
Build step 'Invoke Gradle script' marked build as failure
---------------------------------------------------------------------
To unsubscribe, e-mail: builds-unsubscribe@beam.apache.org
For additional commands, e-mail: builds-help@beam.apache.org
Build failed in Jenkins: beam_PostCommit_Go_VR_Spark #7413
Posted by Apache Jenkins Server <je...@builds.apache.org>.
See <https://ci-beam.apache.org/job/beam_PostCommit_Go_VR_Spark/7413/display/redirect>
Changes:
------------------------------------------
[...truncated 56.28 KB...]
#11 DONE 0.1s
#12 [ 8/18] COPY target/jamm.jar target/open-module-agent*.jar /opt/apache/beam/jars/
#12 DONE 0.1s
#13 [ 9/18] COPY target/linux_amd64/boot /opt/apache/beam/
#13 DONE 0.2s
#14 [10/18] COPY target/LICENSE /opt/apache/beam/
#14 DONE 0.1s
#15 [11/18] COPY target/NOTICE /opt/apache/beam/
#15 DONE 0.1s
#16 [12/18] ADD target/third_party_licenses /opt/apache/beam/third_party_licenses/
#16 DONE 0.2s
#17 [13/18] COPY target/LICENSE target/options/* /opt/apache/beam/options/
#17 DONE 0.1s
#18 [14/18] RUN rm /opt/apache/beam/options/LICENSE
#18 DONE 0.4s
#19 [15/18] COPY target/LICENSE target/go-licenses/* /opt/apache/beam/third_party_licenses/golang/
#19 DONE 0.1s
#20 [16/18] RUN rm /opt/apache/beam/third_party_licenses/golang/LICENSE
#20 DONE 0.4s
#21 [17/18] RUN if [ "true" = "false" ] ; then rm -rf /opt/apache/beam/third_party_licenses ; fi
#21 DONE 0.4s
#22 [18/18] COPY target/profiler/* /opt/google_cloud_profiler/
#22 DONE 0.1s
#23 exporting to image
#23 exporting layers
#23 exporting layers 0.3s done
#23 writing image sha256:7c90d8ba0454151c8255b0d20a682aa2f2b82c9e038df8e733de7c64b9820fa6 done
#23 naming to docker.io/apache/beam_java8_sdk:2.48.0.dev done
#23 DONE 0.3s
> Task :runners:spark:3:job-server:shadowJar
> Task :sdks:go:test:sparkValidatesRunner
$ CURRENT_DIRECTORY=<https://ci-beam.apache.org/job/beam_PostCommit_Go_VR_Spark/ws/src/sdks/go/test>
$ TESTS=./test/integration/... ./test/regression
$ RUNNER=portable
$ TIMEOUT=3h
$ SIMULTANEOUS=3
$ GCS_LOCATION=gs://temp-storage-for-end-to-end-tests
$ GCS_SUBFOLDER=test25522
$ PROJECT=apache-beam-testing
$ DATAFLOW_PROJECT=apache-beam-testing
$ REGION=us-central1
$ trap exit_background_processes SIGINT SIGTERM EXIT
$ key=--runner
$ case --runner in
$ RUNNER=spark
$ key=--spark_job_server_jar
$ case --spark_job_server_jar in
$ SPARK_JOB_SERVER_JAR=<https://ci-beam.apache.org/job/beam_PostCommit_Go_VR_Spark/ws/src/runners/spark/3/job-server/build/libs/beam-runners-spark-3-job-server-2.48.0-SNAPSHOT.jar>
$ key=--pipeline_opts
$ case --pipeline_opts in
$ PIPELINE_OPTS=--expansion_jar=test:<https://ci-beam.apache.org/job/beam_PostCommit_Go_VR_Spark/ws/src/sdks/java/testing/expansion-service/build/libs/beam-sdks-java-testing-expansion-service-testExpansionService-2.48.0-SNAPSHOT.jar>
$ cd <https://ci-beam.apache.org/job/beam_PostCommit_Go_VR_Spark/ws/src>
$ test -d sdks/go/test
$ JOB_PORT=54571
$ ENDPOINT=localhost:38473
No endpoint specified; starting a new spark job server on localhost:38473
$ java -jar <https://ci-beam.apache.org/job/beam_PostCommit_Go_VR_Spark/ws/src/runners/spark/3/job-server/build/libs/beam-runners-spark-3-job-server-2.48.0-SNAPSHOT.jar> --spark-master-url local --job-port 38473 --expansion-port 0 --artifact-port 0
$ JOBSERVER_PID=1511826
$ SIMULTANEOUS=1
$ TAG=dev
$ ./gradlew :sdks:go:container:docker -Pdocker-tag=dev
To honour the JVM settings for this build a single-use Daemon process will be forked. See https://docs.gradle.org/7.5.1/userguide/gradle_daemon.html#sec:disabling_the_daemon.
Daemon will be stopped at the end of the build
Configuration on demand is an incubating feature.
23/04/07 20:41:11 WARN software.amazon.awssdk.regions.internal.util.EC2MetadataUtils: Unable to retrieve the requested metadata.
23/04/07 20:41:11 INFO org.apache.beam.runners.jobsubmission.JobServerDriver: ArtifactStagingService started on localhost:43779
23/04/07 20:41:11 INFO org.apache.beam.runners.jobsubmission.JobServerDriver: Java ExpansionService started on localhost:33633
23/04/07 20:41:11 INFO org.apache.beam.runners.jobsubmission.JobServerDriver: JobService started on localhost:38473
23/04/07 20:41:11 INFO org.apache.beam.runners.jobsubmission.JobServerDriver: Job server now running, terminate with Ctrl+C
> Task :buildSrc:compileJava NO-SOURCE
> Task :buildSrc:compileGroovy UP-TO-DATE
> Task :buildSrc:pluginDescriptors UP-TO-DATE
> Task :buildSrc:processResources UP-TO-DATE
> Task :buildSrc:classes UP-TO-DATE
> Task :buildSrc:jar UP-TO-DATE
> Task :buildSrc:assemble UP-TO-DATE
> Task :buildSrc:spotlessGroovy UP-TO-DATE
> Task :buildSrc:spotlessGroovyCheck UP-TO-DATE
> Task :buildSrc:spotlessGroovyGradle UP-TO-DATE
> Task :buildSrc:spotlessGroovyGradleCheck UP-TO-DATE
> Task :buildSrc:spotlessCheck UP-TO-DATE
> Task :buildSrc:pluginUnderTestMetadata UP-TO-DATE
> Task :buildSrc:compileTestJava NO-SOURCE
> Task :buildSrc:compileTestGroovy NO-SOURCE
> Task :buildSrc:processTestResources NO-SOURCE
> Task :buildSrc:testClasses UP-TO-DATE
> Task :buildSrc:test NO-SOURCE
> Task :buildSrc:validatePlugins UP-TO-DATE
> Task :buildSrc:check UP-TO-DATE
> Task :buildSrc:build UP-TO-DATE
System Go installation: /snap/bin/go is go version go1.16.15 linux/amd64; Preparing to use /home/jenkins/go/bin/go1.20.2
go1.20.2: already downloaded in /home/jenkins/sdk/go1.20.2
GOCMD=/home/jenkins/go/bin/go1.20.2
> Task :sdks:go:container:copyLicenses
> Task :sdks:go:container:dockerClean UP-TO-DATE
> Task :sdks:go:container:goPrepare UP-TO-DATE
> Task :sdks:go:container:goBuild
/home/jenkins/go/bin/go1.20.2 build -o ./build/target/linux_amd64/boot boot.go boot_test.go
> Task :sdks:go:container:skipPullLicenses
> Task :sdks:go:container:dockerPrepare
#1 [internal] load build definition from Dockerfile
#1 transferring dockerfile: 1.94kB done
#1 DONE 0.0s
#2 [internal] load .dockerignore
#2 transferring context: 2B done
#2 DONE 0.0s
> Task :sdks:go:container:docker
#3 [internal] load metadata for docker.io/library/debian:bullseye
#3 DONE 0.3s
#4 [1/8] FROM docker.io/library/debian:bullseye@sha256:7b991788987ad860810df60927e1adbaf8e156520177bd4db82409f81dd3b721
#4 CACHED
#5 [internal] load build context
#5 transferring context: 22.20MB 0.2s done
#5 DONE 0.2s
#6 [2/8] RUN apt-get update && DEBIAN_FRONTEND=noninteractive apt-get install -y ca-certificates && rm -rf /var/lib/apt/lists/*
#6 1.192 Get:1 http://deb.debian.org/debian bullseye InRelease [116 kB]
#6 1.290 Get:2 http://deb.debian.org/debian-security bullseye-security InRelease [48.4 kB]
#6 1.301 Get:3 http://deb.debian.org/debian bullseye-updates InRelease [44.1 kB]
#6 1.726 Get:4 http://deb.debian.org/debian bullseye/main amd64 Packages [8183 kB]
#6 1.993 Get:5 http://deb.debian.org/debian-security bullseye-security/main amd64 Packages [236 kB]
#6 2.027 Get:6 http://deb.debian.org/debian bullseye-updates/main amd64 Packages [14.6 kB]
#6 3.276 Fetched 8642 kB in 2s (3944 kB/s)
#6 3.276 Reading package lists...
#6 4.061 Reading package lists...
#6 4.693 Building dependency tree...
#6 4.840 Reading state information...
#6 5.019 The following additional packages will be installed:
#6 5.020 openssl
#6 5.045 The following NEW packages will be installed:
#6 5.046 ca-certificates openssl
#6 5.131 0 upgraded, 2 newly installed, 0 to remove and 1 not upgraded.
#6 5.131 Need to get 1011 kB of archives.
#6 5.131 After this operation, 1892 kB of additional disk space will be used.
#6 5.131 Get:1 http://deb.debian.org/debian-security bullseye-security/main amd64 openssl amd64 1.1.1n-0+deb11u4 [853 kB]
#6 5.306 Get:2 http://deb.debian.org/debian bullseye/main amd64 ca-certificates all 20210119 [158 kB]
#6 5.929 debconf: delaying package configuration, since apt-utils is not installed
#6 5.960 Fetched 1011 kB in 0s (3938 kB/s)
#6 6.032 Selecting previously unselected package openssl.
#6 6.032 (Reading database ... (Reading database ... 5%(Reading database ... 10%(Reading database ... 15%(Reading database ... 20%(Reading database ... 25%(Reading database ... 30%(Reading database ... 35%(Reading database ... 40%(Reading database ... 45%(Reading database ... 50%(Reading database ... 55%(Reading database ... 60%(Reading database ... 65%(Reading database ... 70%(Reading database ... 75%(Reading database ... 80%(Reading database ... 85%(Reading database ... 90%(Reading database ... 95%(Reading database ... 100%(Reading database ... 6661 files and directories currently installed.)
#6 6.042 Preparing to unpack .../openssl_1.1.1n-0+deb11u4_amd64.deb ...
#6 6.046 Unpacking openssl (1.1.1n-0+deb11u4) ...
#6 6.163 Selecting previously unselected package ca-certificates.
#6 6.164 Preparing to unpack .../ca-certificates_20210119_all.deb ...
#6 6.168 Unpacking ca-certificates (20210119) ...
#6 6.237 Setting up openssl (1.1.1n-0+deb11u4) ...
#6 6.254 Setting up ca-certificates (20210119) ...
#6 7.157 Updating certificates in /etc/ssl/certs...
#6 7.925 129 added, 0 removed; done.
#6 7.985 Processing triggers for ca-certificates (20210119) ...
#6 7.994 Updating certificates in /etc/ssl/certs...
#6 8.575 0 added, 0 removed; done.
#6 8.575 Running hooks in /etc/ca-certificates/update.d...
#6 8.609 done.
#6 DONE 9.2s
#7 [3/8] ADD target/linux_amd64/boot /opt/apache/beam/
#7 DONE 0.3s
#8 [4/8] COPY target/LICENSE /opt/apache/beam/
#8 DONE 0.1s
#9 [5/8] COPY target/NOTICE /opt/apache/beam/
#9 DONE 0.1s
#10 [6/8] COPY target/LICENSE target/go-licenses/* /opt/apache/beam/third_party_licenses/golang/
#10 ERROR: lstat /var/lib/docker/tmp/buildkit-mount323827969/target/go-licenses: no such file or directory
------
> [6/8] COPY target/LICENSE target/go-licenses/* /opt/apache/beam/third_party_licenses/golang/:
------
ERROR: failed to solve: lstat /var/lib/docker/tmp/buildkit-mount323827969/target/go-licenses: no such file or directory
> Task :sdks:go:container:docker FAILED
FAILURE: Build failed with an exception.
* What went wrong:
Execution failed for task ':sdks:go:container:docker'.
> Process 'command 'docker'' finished with non-zero exit value 1
* Try:
> Run with --stacktrace option to get the stack trace.
> Run with --info or --debug option to get more log output.
16 actionable tasks: 5 executed, 11 up-to-date
* Get more help at https://help.gradle.org
BUILD FAILED in 23s
Publishing build scan...
https://gradle.com/s/l46ezpwdhlstk
$ ./gradlew :sdks:go:container:docker -Pdocker-tag=dev
> Task :sdks:go:test:sparkValidatesRunner FAILED
FAILURE: Build failed with an exception.
* Where:
Build file '<https://ci-beam.apache.org/job/beam_PostCommit_Go_VR_Spark/ws/src/sdks/go/test/build.gradle'> line: 116
* What went wrong:
Execution failed for task ':sdks:go:test:sparkValidatesRunner'.
> Process 'command 'sh'' finished with non-zero exit value 1
* Try:
> Run with --stacktrace option to get the stack trace.
> Run with --info or --debug option to get more log output.
* Get more help at https://help.gradle.org
Deprecated Gradle features were used in this build, making it incompatible with Gradle 8.0.
You can use '--warning-mode all' to show the individual deprecation warnings and determine if they come from your own scripts or plugins.
See https://docs.gradle.org/7.5.1/userguide/command_line_interface.html#sec:command_line_warnings
Execution optimizations have been disabled for 1 invalid unit(s) of work during this build to ensure correctness.
Please consult deprecation warnings for more details.
BUILD FAILED in 2m 9s
117 actionable tasks: 75 executed, 38 from cache, 4 up-to-date
Publishing build scan...
https://gradle.com/s/wbcei4khriwr6
Build step 'Invoke Gradle script' changed build result to FAILURE
Build step 'Invoke Gradle script' marked build as failure
---------------------------------------------------------------------
To unsubscribe, e-mail: builds-unsubscribe@beam.apache.org
For additional commands, e-mail: builds-help@beam.apache.org
Build failed in Jenkins: beam_PostCommit_Go_VR_Spark #7412
Posted by Apache Jenkins Server <je...@builds.apache.org>.
See <https://ci-beam.apache.org/job/beam_PostCommit_Go_VR_Spark/7412/display/redirect?page=changes>
Changes:
[noreply] Fix Jacoco not working for a few modules (#26125)
------------------------------------------
[...truncated 57.15 KB...]
#12 [ 8/18] COPY target/jamm.jar target/open-module-agent*.jar /opt/apache/beam/jars/
#12 DONE 0.1s
#13 [ 9/18] COPY target/linux_amd64/boot /opt/apache/beam/
#13 DONE 0.2s
#14 [10/18] COPY target/LICENSE /opt/apache/beam/
#14 DONE 0.1s
#15 [11/18] COPY target/NOTICE /opt/apache/beam/
#15 DONE 0.1s
#16 [12/18] ADD target/third_party_licenses /opt/apache/beam/third_party_licenses/
#16 DONE 0.2s
#17 [13/18] COPY target/LICENSE target/options/* /opt/apache/beam/options/
#17 DONE 0.1s
#18 [14/18] RUN rm /opt/apache/beam/options/LICENSE
#18 DONE 0.3s
#19 [15/18] COPY target/LICENSE target/go-licenses/* /opt/apache/beam/third_party_licenses/golang/
#19 DONE 0.0s
#20 [16/18] RUN rm /opt/apache/beam/third_party_licenses/golang/LICENSE
#20 DONE 0.5s
#21 [17/18] RUN if [ "true" = "false" ] ; then rm -rf /opt/apache/beam/third_party_licenses ; fi
#21 DONE 0.4s
#22 [18/18] COPY target/profiler/* /opt/google_cloud_profiler/
#22 DONE 0.1s
#23 exporting to image
#23 exporting layers
#23 exporting layers 0.3s done
#23 writing image sha256:e22f57ef047c5ef2c71fd837e3f97482a473524ad7a630c5cd4f1217e689ce1a done
#23 naming to docker.io/apache/beam_java8_sdk:2.48.0.dev done
#23 DONE 0.3s
> Task :sdks:go:test:sparkValidatesRunner
$ CURRENT_DIRECTORY=<https://ci-beam.apache.org/job/beam_PostCommit_Go_VR_Spark/ws/src/sdks/go/test>
$ TESTS=./test/integration/... ./test/regression
$ RUNNER=portable
$ TIMEOUT=3h
$ SIMULTANEOUS=3
$ GCS_LOCATION=gs://temp-storage-for-end-to-end-tests
$ GCS_SUBFOLDER=test14685
$ PROJECT=apache-beam-testing
$ DATAFLOW_PROJECT=apache-beam-testing
$ REGION=us-central1
$ trap exit_background_processes SIGINT SIGTERM EXIT
$ key=--runner
$ case --runner in
$ RUNNER=spark
$ key=--spark_job_server_jar
$ case --spark_job_server_jar in
$ SPARK_JOB_SERVER_JAR=<https://ci-beam.apache.org/job/beam_PostCommit_Go_VR_Spark/ws/src/runners/spark/3/job-server/build/libs/beam-runners-spark-3-job-server-2.48.0-SNAPSHOT.jar>
$ key=--pipeline_opts
$ case --pipeline_opts in
$ PIPELINE_OPTS=--expansion_jar=test:<https://ci-beam.apache.org/job/beam_PostCommit_Go_VR_Spark/ws/src/sdks/java/testing/expansion-service/build/libs/beam-sdks-java-testing-expansion-service-testExpansionService-2.48.0-SNAPSHOT.jar>
$ cd <https://ci-beam.apache.org/job/beam_PostCommit_Go_VR_Spark/ws/src>
$ test -d sdks/go/test
$ JOB_PORT=37495
$ ENDPOINT=localhost:56833
No endpoint specified; starting a new spark job server on localhost:56833
$ java -jar <https://ci-beam.apache.org/job/beam_PostCommit_Go_VR_Spark/ws/src/runners/spark/3/job-server/build/libs/beam-runners-spark-3-job-server-2.48.0-SNAPSHOT.jar> --spark-master-url local --job-port 56833 --expansion-port 0 --artifact-port 0
$ JOBSERVER_PID=3007560
$ SIMULTANEOUS=1
$ TAG=dev
$ ./gradlew :sdks:go:container:docker -Pdocker-tag=dev
To honour the JVM settings for this build a single-use Daemon process will be forked. See https://docs.gradle.org/7.5.1/userguide/gradle_daemon.html#sec:disabling_the_daemon.
Daemon will be stopped at the end of the build
Configuration on demand is an incubating feature.
23/04/07 14:40:42 WARN software.amazon.awssdk.regions.internal.util.EC2MetadataUtils: Unable to retrieve the requested metadata.
23/04/07 14:40:42 INFO org.apache.beam.runners.jobsubmission.JobServerDriver: ArtifactStagingService started on localhost:41239
23/04/07 14:40:42 INFO org.apache.beam.runners.jobsubmission.JobServerDriver: Java ExpansionService started on localhost:46389
23/04/07 14:40:42 INFO org.apache.beam.runners.jobsubmission.JobServerDriver: JobService started on localhost:56833
23/04/07 14:40:42 INFO org.apache.beam.runners.jobsubmission.JobServerDriver: Job server now running, terminate with Ctrl+C
> Task :buildSrc:compileJava NO-SOURCE
> Task :buildSrc:compileGroovy UP-TO-DATE
> Task :buildSrc:pluginDescriptors UP-TO-DATE
> Task :buildSrc:processResources UP-TO-DATE
> Task :buildSrc:classes UP-TO-DATE
> Task :buildSrc:jar UP-TO-DATE
> Task :buildSrc:assemble UP-TO-DATE
> Task :buildSrc:spotlessGroovy UP-TO-DATE
> Task :buildSrc:spotlessGroovyCheck UP-TO-DATE
> Task :buildSrc:spotlessGroovyGradle UP-TO-DATE
> Task :buildSrc:spotlessGroovyGradleCheck UP-TO-DATE
> Task :buildSrc:spotlessCheck UP-TO-DATE
> Task :buildSrc:pluginUnderTestMetadata UP-TO-DATE
> Task :buildSrc:compileTestJava NO-SOURCE
> Task :buildSrc:compileTestGroovy NO-SOURCE
> Task :buildSrc:processTestResources NO-SOURCE
> Task :buildSrc:testClasses UP-TO-DATE
> Task :buildSrc:test NO-SOURCE
> Task :buildSrc:validatePlugins UP-TO-DATE
> Task :buildSrc:check UP-TO-DATE
> Task :buildSrc:build UP-TO-DATE
System Go installation: /snap/bin/go is go version go1.16.15 linux/amd64; Preparing to use /home/jenkins/go/bin/go1.20.2
go1.20.2: already downloaded in /home/jenkins/sdk/go1.20.2
GOCMD=/home/jenkins/go/bin/go1.20.2
> Task :sdks:go:container:copyLicenses
> Task :sdks:go:container:dockerClean UP-TO-DATE
> Task :sdks:go:container:goPrepare UP-TO-DATE
> Task :sdks:go:container:goBuild
/home/jenkins/go/bin/go1.20.2 build -o ./build/target/linux_amd64/boot boot.go boot_test.go
> Task :sdks:go:container:skipPullLicenses
> Task :sdks:go:container:dockerPrepare
#1 [internal] load build definition from Dockerfile
#1 DONE 0.0s
> Task :sdks:go:container:docker
#1 [internal] load build definition from Dockerfile
#1 transferring dockerfile: 1.94kB done
#1 DONE 0.0s
#2 [internal] load .dockerignore
#2 transferring context: 2B done
#2 DONE 0.0s
#3 [internal] load metadata for docker.io/library/debian:bullseye
#3 DONE 0.3s
#4 [1/8] FROM docker.io/library/debian:bullseye@sha256:7b991788987ad860810df60927e1adbaf8e156520177bd4db82409f81dd3b721
#4 CACHED
#5 [internal] load build context
#5 transferring context: 22.20MB 0.2s done
#5 DONE 0.2s
#6 [2/8] RUN apt-get update && DEBIAN_FRONTEND=noninteractive apt-get install -y ca-certificates && rm -rf /var/lib/apt/lists/*
#6 0.448 Get:1 http://deb.debian.org/debian bullseye InRelease [116 kB]
#6 0.545 Get:2 http://deb.debian.org/debian-security bullseye-security InRelease [48.4 kB]
#6 0.583 Get:3 http://deb.debian.org/debian bullseye-updates InRelease [44.1 kB]
#6 0.705 Get:4 http://deb.debian.org/debian bullseye/main amd64 Packages [8183 kB]
#6 0.953 Get:5 http://deb.debian.org/debian-security bullseye-security/main amd64 Packages [236 kB]
#6 0.988 Get:6 http://deb.debian.org/debian bullseye-updates/main amd64 Packages [14.6 kB]
#6 2.302 Fetched 8642 kB in 2s (4489 kB/s)
#6 2.302 Reading package lists...
#6 3.047 Reading package lists...
#6 3.739 Building dependency tree...
#6 3.934 Reading state information...
#6 4.191 The following additional packages will be installed:
#6 4.192 openssl
#6 4.225 The following NEW packages will be installed:
#6 4.226 ca-certificates openssl
#6 4.328 0 upgraded, 2 newly installed, 0 to remove and 1 not upgraded.
#6 4.328 Need to get 1011 kB of archives.
#6 4.328 After this operation, 1892 kB of additional disk space will be used.
#6 4.328 Get:1 http://deb.debian.org/debian-security bullseye-security/main amd64 openssl amd64 1.1.1n-0+deb11u4 [853 kB]
#6 4.532 Get:2 http://deb.debian.org/debian bullseye/main amd64 ca-certificates all 20210119 [158 kB]
#6 4.784 debconf: delaying package configuration, since apt-utils is not installed
#6 4.826 Fetched 1011 kB in 0s (3368 kB/s)
#6 4.858 Selecting previously unselected package openssl.
#6 4.858 (Reading database ... (Reading database ... 5%(Reading database ... 10%(Reading database ... 15%(Reading database ... 20%(Reading database ... 25%(Reading database ... 30%(Reading database ... 35%(Reading database ... 40%(Reading database ... 45%(Reading database ... 50%(Reading database ... 55%(Reading database ... 60%(Reading database ... 65%(Reading database ... 70%(Reading database ... 75%(Reading database ... 80%(Reading database ... 85%(Reading database ... 90%(Reading database ... 95%(Reading database ... 100%(Reading database ... 6661 files and directories currently installed.)
#6 4.873 Preparing to unpack .../openssl_1.1.1n-0+deb11u4_amd64.deb ...
#6 4.878 Unpacking openssl (1.1.1n-0+deb11u4) ...
#6 5.004 Selecting previously unselected package ca-certificates.
#6 5.006 Preparing to unpack .../ca-certificates_20210119_all.deb ...
#6 5.011 Unpacking ca-certificates (20210119) ...
#6 5.090 Setting up openssl (1.1.1n-0+deb11u4) ...
#6 5.112 Setting up ca-certificates (20210119) ...
#6 6.039 Updating certificates in /etc/ssl/certs...
#6 6.869 129 added, 0 removed; done.
#6 6.932 Processing triggers for ca-certificates (20210119) ...
#6 6.944 Updating certificates in /etc/ssl/certs...
#6 7.620 0 added, 0 removed; done.
#6 7.620 Running hooks in /etc/ca-certificates/update.d...
#6 7.638 done.
#6 DONE 8.3s
#7 [3/8] ADD target/linux_amd64/boot /opt/apache/beam/
#7 DONE 0.3s
#8 [4/8] COPY target/LICENSE /opt/apache/beam/
#8 DONE 0.1s
#9 [5/8] COPY target/NOTICE /opt/apache/beam/
#9 DONE 0.1s
#10 [6/8] COPY target/LICENSE target/go-licenses/* /opt/apache/beam/third_party_licenses/golang/
#10 ERROR: lstat /var/lib/docker/tmp/buildkit-mount1084319500/target/go-licenses: no such file or directory
------
> [6/8] COPY target/LICENSE target/go-licenses/* /opt/apache/beam/third_party_licenses/golang/:
------
ERROR: failed to solve: lstat /var/lib/docker/tmp/buildkit-mount1084319500/target/go-licenses: no such file or directory
FAILURE: Build failed with an exception.
* What went wrong:
> Task :sdks:go:container:docker FAILED
Execution failed for task ':sdks:go:container:docker'.
> Process 'command 'docker'' finished with non-zero exit value 1
* Try:
> Run with --stacktrace option to get the stack trace.
> Run with --info16 actionable tasks: 5 executed, 11 up-to-date
or --debug option to get more log output.
* Get more help at https://help.gradle.org
BUILD FAILED in 24s
Publishing build scan...
https://gradle.com/s/b5mzmpeqbyzly
$ ./gradlew :sdks:go:container:docker -Pdocker-tag=dev
> Task :sdks:go:test:sparkValidatesRunner FAILED
FAILURE: Build failed with an exception.
* Where:
Build file '<https://ci-beam.apache.org/job/beam_PostCommit_Go_VR_Spark/ws/src/sdks/go/test/build.gradle'> line: 116
* What went wrong:
Execution failed for task ':sdks:go:test:sparkValidatesRunner'.
> Process 'command 'sh'' finished with non-zero exit value 1
* Try:
> Run with --stacktrace option to get the stack trace.
> Run with --info or --debug option to get more log output.
* Get more help at https://help.gradle.org
Deprecated Gradle features were used in this build, making it incompatible with Gradle 8.0.
You can use '--warning-mode all' to show the individual deprecation warnings and determine if they come from your own scripts or plugins.
See https://docs.gradle.org/7.5.1/userguide/command_line_interface.html#sec:command_line_warnings
Execution optimizations have been disabled for 1 invalid unit(s) of work during this build to ensure correctness.
Please consult deprecation warnings for more details.
BUILD FAILED in 1m 39s
117 actionable tasks: 74 executed, 39 from cache, 4 up-to-date
Publishing build scan...
https://gradle.com/s/vjnbpzi6hqzlw
Build step 'Invoke Gradle script' changed build result to FAILURE
Build step 'Invoke Gradle script' marked build as failure
---------------------------------------------------------------------
To unsubscribe, e-mail: builds-unsubscribe@beam.apache.org
For additional commands, e-mail: builds-help@beam.apache.org
Build failed in Jenkins: beam_PostCommit_Go_VR_Spark #7411
Posted by Apache Jenkins Server <je...@builds.apache.org>.
See <https://ci-beam.apache.org/job/beam_PostCommit_Go_VR_Spark/7411/display/redirect>
Changes:
------------------------------------------
[...truncated 29.07 KB...]
> Task :runners:java-job-service:processResources NO-SOURCE
> Task :sdks:java:expansion-service:createCheckerFrameworkManifest
> Task :sdks:java:expansion-service:processResources NO-SOURCE
> Task :runners:spark:3:processResources
> Task :sdks:java:core:generateGrammarSource FROM-CACHE
> Task :model:fn-execution:processResources
> Task :sdks:java:extensions:google-cloud-platform-core:createCheckerFrameworkManifest
> Task :sdks:java:io:amazon-web-services2:createCheckerFrameworkManifest
> Task :sdks:java:io:amazon-web-services2:processResources NO-SOURCE
> Task :release:go-licenses:java:copyLicenses
> Task :sdks:java:extensions:google-cloud-platform-core:processResources NO-SOURCE
> Task :release:go-licenses:java:dockerClean UP-TO-DATE
> Task :runners:spark:3:job-server:createCheckerFrameworkManifest
> Task :runners:spark:3:job-server:processResources NO-SOURCE
> Task :sdks:java:container:java8:copyJdkOptions
> Task :runners:direct-java:createCheckerFrameworkManifest
> Task :release:go-licenses:java:dockerPrepare
> Task :runners:direct-java:processResources NO-SOURCE
> Task :runners:local-java:createCheckerFrameworkManifest
> Task :runners:local-java:processResources NO-SOURCE
> Task :sdks:java:extensions:avro:generateTestAvroProtocol NO-SOURCE
> Task :sdks:java:io:hadoop-common:createCheckerFrameworkManifest
> Task :sdks:java:io:hadoop-common:processResources NO-SOURCE
> Task :sdks:java:core:processResources
> Task :sdks:java:io:parquet:createCheckerFrameworkManifest
> Task :sdks:java:core:generateTestAvroProtocol NO-SOURCE
> Task :sdks:java:container:java8:copyLicenses
> Task :sdks:java:io:parquet:processResources NO-SOURCE
> Task :sdks:java:container:java8:dockerClean UP-TO-DATE
> Task :sdks:java:container:java8:validateJavaHome UP-TO-DATE
> Task :sdks:java:testing:expansion-service:createCheckerFrameworkManifest
> Task :sdks:java:testing:expansion-service:compileJava NO-SOURCE
> Task :sdks:java:testing:expansion-service:processResources NO-SOURCE
> Task :sdks:java:testing:expansion-service:classes UP-TO-DATE
> Task :sdks:java:testing:expansion-service:processTestResources
> Task :sdks:java:container:downloadCloudProfilerAgent
version.txt
NOTICES
profiler_java_agent.so
> Task :sdks:java:core:generateTestAvroJava
> Task :sdks:java:extensions:avro:generateTestAvroJava
> Task :sdks:java:core:generateTestGrammarSource NO-SOURCE
> Task :sdks:java:extensions:avro:processTestResources NO-SOURCE
> Task :sdks:java:core:processTestResources
> Task :release:go-licenses:java:docker
Sending build context to Docker daemon 6.656kB
Step 1/8 : FROM golang:1.20-bullseye
---> e1567729a36d
Step 2/8 : WORKDIR /usr/src/app
---> Using cache
---> b86bce335b65
Step 3/8 : COPY go.mod ./
---> Using cache
---> 57f2af6d9e5f
Step 4/8 : RUN go install github.com/google/go-licenses@latest
---> Using cache
---> 20aace7b7fbf
Step 5/8 : COPY get-licenses.sh /opt/apache/beam/
---> Using cache
---> 37ff105afcab
Step 6/8 : ARG sdk_location
---> Using cache
---> 1afb505a62ba
Step 7/8 : ENV sdk_location=$sdk_location
---> Using cache
---> 8b1195413351
Step 8/8 : ENTRYPOINT /opt/apache/beam/get-licenses.sh
---> Using cache
---> 918f3b2d61c0
Successfully built 918f3b2d61c0
Successfully tagged golicenses-java:latest
> Task :model:pipeline:extractIncludeProto
> Task :model:pipeline:extractProto
> Task :model:pipeline:generateProto FROM-CACHE
> Task :sdks:go:test:goBuild
/home/jenkins/go/bin/go1.20.2 build -o ./build/bin/linux_amd64/ ./...
> Task :model:pipeline:compileJava FROM-CACHE
> Task :model:pipeline:processResources
> Task :model:pipeline:classes
> Task :model:pipeline:jar
> Task :model:pipeline:shadowJar FROM-CACHE
> Task :model:job-management:extractIncludeProto
> Task :model:fn-execution:extractIncludeProto
> Task :model:job-management:generateProto FROM-CACHE
> Task :model:fn-execution:generateProto FROM-CACHE
> Task :release:go-licenses:java:dockerRun
+ rm -rf '/output/*'
+ go get github.com/apache/beam/sdks/v2/java/container
go: downloading github.com/apache/beam/sdks/v2 v2.46.0
go: downloading github.com/apache/beam v2.46.0+incompatible
> Task :model:job-management:compileJava FROM-CACHE
> Task :model:job-management:classes
> Task :model:fn-execution:compileJava FROM-CACHE
> Task :model:fn-execution:classes
> Task :model:fn-execution:shadowJar FROM-CACHE
> Task :model:job-management:shadowJar FROM-CACHE
> Task :sdks:java:core:compileJava FROM-CACHE
> Task :sdks:java:core:classes
> Task :sdks:java:core:shadowJar FROM-CACHE
> Task :runners:local-java:compileJava FROM-CACHE
> Task :runners:local-java:classes UP-TO-DATE
> Task :runners:local-java:jar
> Task :sdks:java:extensions:avro:compileJava FROM-CACHE
> Task :sdks:java:extensions:avro:classes UP-TO-DATE
> Task :sdks:java:extensions:avro:jar
> Task :sdks:java:io:hadoop-common:compileJava FROM-CACHE
> Task :sdks:java:io:hadoop-common:classes UP-TO-DATE
> Task :sdks:java:io:hadoop-common:jar
> Task :sdks:java:fn-execution:compileJava FROM-CACHE
> Task :sdks:java:fn-execution:classes UP-TO-DATE
> Task :sdks:java:io:amazon-web-services2:compileJava FROM-CACHE
> Task :sdks:java:io:amazon-web-services2:classes UP-TO-DATE
> Task :sdks:java:fn-execution:jar
> Task :sdks:java:io:parquet:compileJava FROM-CACHE
> Task :sdks:java:io:parquet:classes UP-TO-DATE
> Task :sdks:java:io:parquet:jar
> Task :sdks:java:io:amazon-web-services2:jar
> Task :runners:core-construction-java:compileJava FROM-CACHE
> Task :runners:core-construction-java:classes UP-TO-DATE
> Task :runners:core-construction-java:jar
> Task :runners:core-java:compileJava FROM-CACHE
> Task :runners:core-java:classes UP-TO-DATE
> Task :runners:core-java:jar
> Task :sdks:java:core:compileTestJava FROM-CACHE
> Task :sdks:java:core:testClasses
> Task :sdks:java:extensions:google-cloud-platform-core:compileJava FROM-CACHE
> Task :sdks:java:extensions:google-cloud-platform-core:classes UP-TO-DATE
> Task :sdks:java:extensions:google-cloud-platform-core:jar
> Task :sdks:java:core:shadowTestJar FROM-CACHE
> Task :sdks:java:extensions:avro:compileTestJava FROM-CACHE
> Task :sdks:java:extensions:avro:testClasses UP-TO-DATE
> Task :sdks:java:extensions:avro:testJar
> Task :release:go-licenses:java:dockerRun
go: downloading google.golang.org/grpc v1.52.3
go: downloading google.golang.org/protobuf v1.28.1
go: downloading github.com/golang/protobuf v1.5.2
go: downloading golang.org/x/sys v0.5.0
go: downloading google.golang.org/genproto v0.0.0-20230110181048-76db0878b65f
go: downloading golang.org/x/text v0.7.0
go: added github.com/apache/beam/sdks/v2 v2.46.0
go: added github.com/golang/protobuf v1.5.2
go: added golang.org/x/net v0.5.0
go: added golang.org/x/sys v0.5.0
go: added golang.org/x/text v0.7.0
go: added google.golang.org/genproto v0.0.0-20230110181048-76db0878b65f
go: added google.golang.org/grpc v1.52.3
go: added google.golang.org/protobuf v1.28.1
+ go-licenses save github.com/apache/beam/sdks/v2/java/container --save_path=/output/licenses
W0407 08:39:57.686710 40 library.go:101] "golang.org/x/sys/unix" contains non-Go code that can't be inspected for further dependencies:
/go/pkg/mod/golang.org/x/sys@v0.5.0/unix/asm_linux_amd64.s
+ go-licenses csv github.com/apache/beam/sdks/v2/java/container
+ tee /output/licenses/list.csv
W0407 08:40:01.720955 85 library.go:101] "golang.org/x/sys/unix" contains non-Go code that can't be inspected for further dependencies:
/go/pkg/mod/golang.org/x/sys@v0.5.0/unix/asm_linux_amd64.s
github.com/apache/beam/sdks/v2/go/pkg/beam,https://github.com/apache/beam/blob/sdks/v2.46.0/sdks/go/README.md,Apache-2.0
github.com/apache/beam/sdks/v2/java/container,https://github.com/apache/beam/blob/sdks/v2.46.0/sdks/LICENSE,Apache-2.0
github.com/golang/protobuf,https://github.com/golang/protobuf/blob/v1.5.2/LICENSE,BSD-3-Clause
golang.org/x/net,https://cs.opensource.google/go/x/net/+/v0.5.0:LICENSE,BSD-3-Clause
golang.org/x/sys/unix,https://cs.opensource.google/go/x/sys/+/v0.5.0:LICENSE,BSD-3-Clause
golang.org/x/text,https://cs.opensource.google/go/x/text/+/v0.7.0:LICENSE,BSD-3-Clause
google.golang.org/genproto/googleapis/rpc/status,https://github.com/googleapis/go-genproto/blob/76db0878b65f/LICENSE,Apache-2.0
google.golang.org/grpc,https://github.com/grpc/grpc-go/blob/v1.52.3/LICENSE,Apache-2.0
google.golang.org/protobuf,https://github.com/protocolbuffers/protobuf-go/blob/v1.28.1/LICENSE,BSD-3-Clause
+ chmod -R a+w /output/licenses
> Task :release:go-licenses:java:createLicenses
> Task :sdks:java:container:java8:copyGolangLicenses
> Task :sdks:java:container:generateLicenseReport
> Task :sdks:java:container:generateLicenseReport FAILED
> Task :sdks:java:container:goPrepare UP-TO-DATE
> Task :sdks:java:harness:compileJava FROM-CACHE
> Task :sdks:java:harness:classes UP-TO-DATE
> Task :sdks:java:harness:jar
> Task :runners:java-fn-execution:compileJava FROM-CACHE
> Task :runners:java-fn-execution:classes UP-TO-DATE
> Task :runners:java-fn-execution:jar
> Task :sdks:java:expansion-service:compileJava FROM-CACHE
> Task :sdks:java:expansion-service:classes UP-TO-DATE
> Task :sdks:java:expansion-service:jar
> Task :runners:direct-java:compileJava FROM-CACHE
> Task :runners:direct-java:classes UP-TO-DATE
> Task :runners:java-job-service:compileJava FROM-CACHE
> Task :runners:java-job-service:classes UP-TO-DATE
> Task :runners:java-job-service:jar
> Task :sdks:java:harness:shadowJar FROM-CACHE
> Task :sdks:java:container:java8:copyDockerfileDependencies
> Task :runners:spark:3:compileJava FROM-CACHE
> Task :runners:spark:3:classes
> Task :runners:direct-java:shadowJar FROM-CACHE
> Task :runners:spark:3:jar
> Task :runners:spark:3:job-server:compileJava NO-SOURCE
> Task :runners:spark:3:job-server:classes UP-TO-DATE
> Task :sdks:java:testing:expansion-service:compileTestJava FROM-CACHE
> Task :sdks:java:testing:expansion-service:testClasses
> Task :sdks:java:container:goBuild
/home/jenkins/go/bin/go1.20.2 build -o ./build/target/linux_amd64/boot boot.go boot_test.go
> Task :sdks:java:container:java8:copySdkHarnessLauncher
Execution optimizations have been disabled for task ':sdks:java:container:java8:copySdkHarnessLauncher' to ensure correctness due to the following reasons:
- Gradle detected a problem with the following location: '<https://ci-beam.apache.org/job/beam_PostCommit_Go_VR_Spark/ws/src/sdks/java/container/build/target'.> Reason: Task ':sdks:java:container:java8:copySdkHarnessLauncher' uses this output of task ':sdks:java:container:downloadCloudProfilerAgent' without declaring an explicit or implicit dependency. This can lead to incorrect results being produced, depending on what order the tasks are executed. Please refer to https://docs.gradle.org/7.5.1/userguide/validation_problems.html#implicit_dependency for more details about this problem.
> Task :sdks:java:testing:expansion-service:buildTestExpansionServiceJar FROM-CACHE
> Task :runners:spark:3:job-server:shadowJar FROM-CACHE
FAILURE: Build failed with an exception.
* What went wrong:
Execution failed for task ':sdks:java:container:generateLicenseReport'.
> Could not resolve all dependencies for configuration ':sdks:java:harness:testCompileClasspath'.
> Could not resolve junit:junit-dep:[4.9,).
Required by:
project :sdks:java:harness > project :sdks:java:fn-execution > com.github.stefanbirkner:system-rules:1.19.0
> Failed to list versions for junit:junit-dep.
> Unable to load Maven meta-data from https://oss.sonatype.org/content/repositories/staging/junit/junit-dep/maven-metadata.xml.
> Could not HEAD 'https://oss.sonatype.org/content/repositories/staging/junit/junit-dep/maven-metadata.xml'. Received status code 504 from server: Gateway Time-out
* Try:
> Run with --stacktrace option to get the stack trace.
> Run with --info or --debug option to get more log output.
* Get more help at https://help.gradle.org
Deprecated Gradle features were used in this build, making it incompatible with Gradle 8.0.
You can use '--warning-mode all' to show the individual deprecation warnings and determine if they come from your own scripts or plugins.
See https://docs.gradle.org/7.5.1/userguide/command_line_interface.html#sec:command_line_warnings
Execution optimizations have been disabled for 1 invalid unit(s) of work during this build to ensure correctness.
Please consult deprecation warnings for more details.
BUILD FAILED in 1m 3s
112 actionable tasks: 69 executed, 39 from cache, 4 up-to-date
Publishing build scan...
https://gradle.com/s/tmwcuybzv4nj2
Build step 'Invoke Gradle script' changed build result to FAILURE
Build step 'Invoke Gradle script' marked build as failure
---------------------------------------------------------------------
To unsubscribe, e-mail: builds-unsubscribe@beam.apache.org
For additional commands, e-mail: builds-help@beam.apache.org
Build failed in Jenkins: beam_PostCommit_Go_VR_Spark #7410
Posted by Apache Jenkins Server <je...@builds.apache.org>.
See <https://ci-beam.apache.org/job/beam_PostCommit_Go_VR_Spark/7410/display/redirect>
Changes:
------------------------------------------
[...truncated 71.82 KB...]
#11 DONE 0.1s
#12 [ 8/18] COPY target/jamm.jar target/open-module-agent*.jar /opt/apache/beam/jars/
#12 DONE 0.1s
#13 [ 9/18] COPY target/linux_amd64/boot /opt/apache/beam/
#13 DONE 0.2s
#14 [10/18] COPY target/LICENSE /opt/apache/beam/
#14 DONE 0.1s
#15 [11/18] COPY target/NOTICE /opt/apache/beam/
#15 DONE 0.1s
#16 [12/18] ADD target/third_party_licenses /opt/apache/beam/third_party_licenses/
#16 DONE 0.2s
#17 [13/18] COPY target/LICENSE target/options/* /opt/apache/beam/options/
#17 DONE 0.1s
#18 [14/18] RUN rm /opt/apache/beam/options/LICENSE
#18 DONE 0.4s
#19 [15/18] COPY target/LICENSE target/go-licenses/* /opt/apache/beam/third_party_licenses/golang/
#19 DONE 0.1s
#20 [16/18] RUN rm /opt/apache/beam/third_party_licenses/golang/LICENSE
#20 DONE 0.3s
#21 [17/18] RUN if [ "true" = "false" ] ; then rm -rf /opt/apache/beam/third_party_licenses ; fi
#21 DONE 0.4s
#22 [18/18] COPY target/profiler/* /opt/google_cloud_profiler/
#22 DONE 0.1s
#23 exporting to image
#23 exporting layers
#23 exporting layers 0.2s done
#23 writing image sha256:2c5261603c8255a2fa389c53aac35fae4787cf4c1c6a2889f040b630685036e2
#23 writing image sha256:2c5261603c8255a2fa389c53aac35fae4787cf4c1c6a2889f040b630685036e2 done
#23 naming to docker.io/apache/beam_java8_sdk:2.48.0.dev done
#23 DONE 0.3s
> Task :sdks:go:test:sparkValidatesRunner
$ CURRENT_DIRECTORY=<https://ci-beam.apache.org/job/beam_PostCommit_Go_VR_Spark/ws/src/sdks/go/test>
$ TESTS=./test/integration/... ./test/regression
$ RUNNER=portable
$ TIMEOUT=3h
$ SIMULTANEOUS=3
$ GCS_LOCATION=gs://temp-storage-for-end-to-end-tests
$ GCS_SUBFOLDER=test24748
$ PROJECT=apache-beam-testing
$ DATAFLOW_PROJECT=apache-beam-testing
$ REGION=us-central1
$ trap exit_background_processes SIGINT SIGTERM EXIT
$ key=--runner
$ case --runner in
$ RUNNER=spark
$ key=--spark_job_server_jar
$ case --spark_job_server_jar in
$ SPARK_JOB_SERVER_JAR=<https://ci-beam.apache.org/job/beam_PostCommit_Go_VR_Spark/ws/src/runners/spark/3/job-server/build/libs/beam-runners-spark-3-job-server-2.48.0-SNAPSHOT.jar>
$ key=--pipeline_opts
$ case --pipeline_opts in
$ PIPELINE_OPTS=--expansion_jar=test:<https://ci-beam.apache.org/job/beam_PostCommit_Go_VR_Spark/ws/src/sdks/java/testing/expansion-service/build/libs/beam-sdks-java-testing-expansion-service-testExpansionService-2.48.0-SNAPSHOT.jar>
$ cd <https://ci-beam.apache.org/job/beam_PostCommit_Go_VR_Spark/ws/src>
$ test -d sdks/go/test
$ JOB_PORT=41475
$ ENDPOINT=localhost:40117
No endpoint specified; starting a new spark job server on localhost:40117
$ java -jar <https://ci-beam.apache.org/job/beam_PostCommit_Go_VR_Spark/ws/src/runners/spark/3/job-server/build/libs/beam-runners-spark-3-job-server-2.48.0-SNAPSHOT.jar> --spark-master-url local --job-port 40117 --expansion-port 0 --artifact-port 0
$ JOBSERVER_PID=836212
$ SIMULTANEOUS=1
$ TAG=dev
$ ./gradlew :sdks:go:container:docker -Pdocker-tag=dev
To honour the JVM settings for this build a single-use Daemon process will be forked. See https://docs.gradle.org/7.5.1/userguide/gradle_daemon.html#sec:disabling_the_daemon.
Daemon will be stopped at the end of the build
Configuration on demand is an incubating feature.
23/04/07 02:40:38 WARN software.amazon.awssdk.regions.internal.util.EC2MetadataUtils: Unable to retrieve the requested metadata.
23/04/07 02:40:38 INFO org.apache.beam.runners.jobsubmission.JobServerDriver: ArtifactStagingService started on localhost:36527
23/04/07 02:40:38 INFO org.apache.beam.runners.jobsubmission.JobServerDriver: Java ExpansionService started on localhost:41399
23/04/07 02:40:38 INFO org.apache.beam.runners.jobsubmission.JobServerDriver: JobService started on localhost:40117
23/04/07 02:40:38 INFO org.apache.beam.runners.jobsubmission.JobServerDriver: Job server now running, terminate with Ctrl+C
> Task :buildSrc:compileJava NO-SOURCE
> Task :buildSrc:compileGroovy UP-TO-DATE
> Task :buildSrc:pluginDescriptors UP-TO-DATE
> Task :buildSrc:processResources UP-TO-DATE
> Task :buildSrc:classes UP-TO-DATE
> Task :buildSrc:jar UP-TO-DATE
> Task :buildSrc:assemble UP-TO-DATE
> Task :buildSrc:spotlessGroovy UP-TO-DATE
> Task :buildSrc:spotlessGroovyCheck UP-TO-DATE
> Task :buildSrc:spotlessGroovyGradle UP-TO-DATE
> Task :buildSrc:spotlessGroovyGradleCheck UP-TO-DATE
> Task :buildSrc:spotlessCheck UP-TO-DATE
> Task :buildSrc:pluginUnderTestMetadata UP-TO-DATE
> Task :buildSrc:compileTestJava NO-SOURCE
> Task :buildSrc:compileTestGroovy NO-SOURCE
> Task :buildSrc:processTestResources NO-SOURCE
> Task :buildSrc:testClasses UP-TO-DATE
> Task :buildSrc:test NO-SOURCE
> Task :buildSrc:validatePlugins UP-TO-DATE
> Task :buildSrc:check UP-TO-DATE
> Task :buildSrc:build UP-TO-DATE
System Go installation: /snap/bin/go is go version go1.16.15 linux/amd64; Preparing to use /home/jenkins/go/bin/go1.20.2
go1.20.2: already downloaded in /home/jenkins/sdk/go1.20.2
GOCMD=/home/jenkins/go/bin/go1.20.2
> Task :sdks:go:container:copyLicenses
> Task :sdks:go:container:dockerClean UP-TO-DATE
> Task :sdks:go:container:goPrepare UP-TO-DATE
> Task :sdks:go:container:goBuild
/home/jenkins/go/bin/go1.20.2 build -o ./build/target/linux_amd64/boot boot.go boot_test.go
> Task :sdks:go:container:skipPullLicenses
> Task :sdks:go:container:dockerPrepare
#1 [internal] load build definition from Dockerfile
> Task :sdks:go:container:docker
#1 transferring dockerfile:
#1 transferring dockerfile: 1.94kB done
#1 DONE 0.0s
#2 [internal] load .dockerignore
#2 transferring context: 2B done
#2 DONE 0.0s
#3 [internal] load metadata for docker.io/library/debian:bullseye
#3 DONE 0.3s
#4 [1/8] FROM docker.io/library/debian:bullseye@sha256:7b991788987ad860810df60927e1adbaf8e156520177bd4db82409f81dd3b721
#4 CACHED
#5 [internal] load build context
#5 transferring context: 22.20MB 0.2s done
#5 DONE 0.2s
#6 [2/8] RUN apt-get update && DEBIAN_FRONTEND=noninteractive apt-get install -y ca-certificates && rm -rf /var/lib/apt/lists/*
#6 1.579 Get:1 http://deb.debian.org/debian bullseye InRelease [116 kB]
#6 1.715 Get:2 http://deb.debian.org/debian-security bullseye-security InRelease [48.4 kB]
#6 1.746 Get:3 http://deb.debian.org/debian bullseye-updates InRelease [44.1 kB]
#6 2.311 Get:4 http://deb.debian.org/debian bullseye/main amd64 Packages [8183 kB]
#6 2.529 Get:5 http://deb.debian.org/debian-security bullseye-security/main amd64 Packages [236 kB]
#6 2.558 Get:6 http://deb.debian.org/debian bullseye-updates/main amd64 Packages [14.6 kB]
#6 3.827 Fetched 8642 kB in 2s (3595 kB/s)
#6 3.827 Reading package lists...
#6 4.513 Reading package lists...
#6 5.148 Building dependency tree...
#6 5.301 Reading state information...
#6 5.484 The following additional packages will be installed:
#6 5.484 openssl
#6 5.511 The following NEW packages will be installed:
#6 5.512 ca-certificates openssl
#6 5.583 0 upgraded, 2 newly installed, 0 to remove and 1 not upgraded.
#6 5.583 Need to get 1011 kB of archives.
#6 5.583 After this operation, 1892 kB of additional disk space will be used.
#6 5.583 Get:1 http://deb.debian.org/debian-security bullseye-security/main amd64 openssl amd64 1.1.1n-0+deb11u4 [853 kB]
#6 5.722 Get:2 http://deb.debian.org/debian bullseye/main amd64 ca-certificates all 20210119 [158 kB]
#6 6.484 debconf: delaying package configuration, since apt-utils is not installed
#6 6.524 Fetched 1011 kB in 0s (4902 kB/s)
#6 6.632 Selecting previously unselected package openssl.
#6 6.632 (Reading database ... (Reading database ... 5%(Reading database ... 10%(Reading database ... 15%(Reading database ... 20%(Reading database ... 25%(Reading database ... 30%(Reading database ... 35%(Reading database ... 40%(Reading database ... 45%(Reading database ... 50%(Reading database ... 55%(Reading database ... 60%(Reading database ... 65%(Reading database ... 70%(Reading database ... 75%(Reading database ... 80%(Reading database ... 85%(Reading database ... 90%(Reading database ... 95%(Reading database ... 100%(Reading database ... 6661 files and directories currently installed.)
#6 6.778 Preparing to unpack .../openssl_1.1.1n-0+deb11u4_amd64.deb ...
#6 6.782 Unpacking openssl (1.1.1n-0+deb11u4) ...
#6 6.898 Selecting previously unselected package ca-certificates.
#6 6.900 Preparing to unpack .../ca-certificates_20210119_all.deb ...
#6 6.904 Unpacking ca-certificates (20210119) ...
#6 6.970 Setting up openssl (1.1.1n-0+deb11u4) ...
#6 6.987 Setting up ca-certificates (20210119) ...
#6 7.715 Updating certificates in /etc/ssl/certs...
#6 8.502 129 added, 0 removed; done.
#6 8.580 Processing triggers for ca-certificates (20210119) ...
#6 8.589 Updating certificates in /etc/ssl/certs...
#6 9.162 0 added, 0 removed; done.
#6 9.162 Running hooks in /etc/ca-certificates/update.d...
#6 9.164 done.
#6 DONE 9.8s
#7 [3/8] ADD target/linux_amd64/boot /opt/apache/beam/
#7 DONE 0.3s
#8 [4/8] COPY target/LICENSE /opt/apache/beam/
#8 DONE 0.1s
#9 [5/8] COPY target/NOTICE /opt/apache/beam/
#9 DONE 0.0s
#10 [6/8] COPY target/LICENSE target/go-licenses/* /opt/apache/beam/third_party_licenses/golang/
#10 ERROR: lstat /var/lib/docker/tmp/buildkit-mount2724550082/target/go-licenses: no such file or directory
------
> [6/8] COPY target/LICENSE target/go-licenses/* /opt/apache/beam/third_party_licenses/golang/:
------
ERROR: failed to solve: lstat /var/lib/docker/tmp/buildkit-mount2724550082/target/go-licenses: no such file or directory
> Task :sdks:go:container:docker FAILED
FAILURE: Build failed with an exception.
* What went wrong:
Execution failed for task ':sdks:go:container:docker'.
> Process 'command 'docker'' finished with non-zero exit value 1
* Try:
> Run with --stacktrace option to get the stack trace.
> Run with --info or --debug option to get more log output.
* Get more help at https://help.gradle.org
BUILD FAILED in 25s
16 actionable tasks: 5 executed, 11 up-to-date
Publishing build scan...
https://gradle.com/s/tgrdrlvmkwwgw
$ ./gradlew :sdks:go:container:docker -Pdocker-tag=dev
> Task :sdks:go:test:sparkValidatesRunner FAILED
FAILURE: Build failed with an exception.
* Where:
Build file '<https://ci-beam.apache.org/job/beam_PostCommit_Go_VR_Spark/ws/src/sdks/go/test/build.gradle'> line: 116
* What went wrong:
Execution failed for task ':sdks:go:test:sparkValidatesRunner'.
> Process 'command 'sh'' finished with non-zero exit value 1
* Try:
> Run with --stacktrace option to get the stack trace.
> Run with --info or --debug option to get more log output.
* Get more help at https://help.gradle.org
Deprecated Gradle features were used in this build, making it incompatible with Gradle 8.0.
You can use '--warning-mode all' to show the individual deprecation warnings and determine if they come from your own scripts or plugins.
See https://docs.gradle.org/7.5.1/userguide/command_line_interface.html#sec:command_line_warnings
Execution optimizations have been disabled for 1 invalid unit(s) of work during this build to ensure correctness.
Please consult deprecation warnings for more details.
BUILD FAILED in 1m 37s
117 actionable tasks: 74 executed, 39 from cache, 4 up-to-date
Publishing build scan...
https://gradle.com/s/6jhrin4lnvtl2
Build step 'Invoke Gradle script' changed build result to FAILURE
Build step 'Invoke Gradle script' marked build as failure
---------------------------------------------------------------------
To unsubscribe, e-mail: builds-unsubscribe@beam.apache.org
For additional commands, e-mail: builds-help@beam.apache.org
Build failed in Jenkins: beam_PostCommit_Go_VR_Spark #7409
Posted by Apache Jenkins Server <je...@builds.apache.org>.
See <https://ci-beam.apache.org/job/beam_PostCommit_Go_VR_Spark/7409/display/redirect>
Changes:
------------------------------------------
[...truncated 72.10 KB...]
#11 [ 7/18] ADD target/beam-sdks-java-harness.jar /opt/apache/beam/jars/
#11 DONE 0.1s
#12 [ 8/18] COPY target/jamm.jar target/open-module-agent*.jar /opt/apache/beam/jars/
#12 DONE 0.1s
#13 [ 9/18] COPY target/linux_amd64/boot /opt/apache/beam/
#13 DONE 0.3s
#14 [10/18] COPY target/LICENSE /opt/apache/beam/
#14 DONE 0.1s
#15 [11/18] COPY target/NOTICE /opt/apache/beam/
#15 DONE 0.1s
#16 [12/18] ADD target/third_party_licenses /opt/apache/beam/third_party_licenses/
#16 DONE 0.2s
#17 [13/18] COPY target/LICENSE target/options/* /opt/apache/beam/options/
#17 DONE 0.1s
#18 [14/18] RUN rm /opt/apache/beam/options/LICENSE
#18 DONE 0.4s
#19 [15/18] COPY target/LICENSE target/go-licenses/* /opt/apache/beam/third_party_licenses/golang/
#19 DONE 0.1s
#20 [16/18] RUN rm /opt/apache/beam/third_party_licenses/golang/LICENSE
#20 DONE 1.1s
#21 [17/18] RUN if [ "true" = "false" ] ; then rm -rf /opt/apache/beam/third_party_licenses ; fi
#21 DONE 0.9s
#22 [18/18] COPY target/profiler/* /opt/google_cloud_profiler/
#22 DONE 0.4s
#23 exporting to image
#23 exporting layers
#23 exporting layers 0.3s done
#23 writing image sha256:ea95dd7d5695776fc9f7d62db9e21d7cd43f1ac276f3880909ad40b9ec9e748e done
#23 naming to docker.io/apache/beam_java8_sdk:2.48.0.dev done
#23 DONE 0.3s
> Task :sdks:go:test:sparkValidatesRunner
$ CURRENT_DIRECTORY=<https://ci-beam.apache.org/job/beam_PostCommit_Go_VR_Spark/ws/src/sdks/go/test>
$ TESTS=./test/integration/... ./test/regression
$ RUNNER=portable
$ TIMEOUT=3h
$ SIMULTANEOUS=3
$ GCS_LOCATION=gs://temp-storage-for-end-to-end-tests
$ GCS_SUBFOLDER=test9771
$ PROJECT=apache-beam-testing
$ DATAFLOW_PROJECT=apache-beam-testing
$ REGION=us-central1
$ trap exit_background_processes SIGINT SIGTERM EXIT
$ key=--runner
$ case --runner in
$ RUNNER=spark
$ key=--spark_job_server_jar
$ case --spark_job_server_jar in
$ SPARK_JOB_SERVER_JAR=<https://ci-beam.apache.org/job/beam_PostCommit_Go_VR_Spark/ws/src/runners/spark/3/job-server/build/libs/beam-runners-spark-3-job-server-2.48.0-SNAPSHOT.jar>
$ key=--pipeline_opts
$ case --pipeline_opts in
$ PIPELINE_OPTS=--expansion_jar=test:<https://ci-beam.apache.org/job/beam_PostCommit_Go_VR_Spark/ws/src/sdks/java/testing/expansion-service/build/libs/beam-sdks-java-testing-expansion-service-testExpansionService-2.48.0-SNAPSHOT.jar>
$ cd <https://ci-beam.apache.org/job/beam_PostCommit_Go_VR_Spark/ws/src>
$ test -d sdks/go/test
$ JOB_PORT=59349
$ ENDPOINT=localhost:52871
No endpoint specified; starting a new spark job server on localhost:52871
$ java -jar <https://ci-beam.apache.org/job/beam_PostCommit_Go_VR_Spark/ws/src/runners/spark/3/job-server/build/libs/beam-runners-spark-3-job-server-2.48.0-SNAPSHOT.jar> --spark-master-url local --job-port 52871 --expansion-port 0 --artifact-port 0
$ JOBSERVER_PID=1324284
$ SIMULTANEOUS=1
$ TAG=dev
$ ./gradlew :sdks:go:container:docker -Pdocker-tag=dev
To honour the JVM settings for this build a single-use Daemon process will be forked. See https://docs.gradle.org/7.5.1/userguide/gradle_daemon.html#sec:disabling_the_daemon.
Daemon will be stopped at the end of the build
Configuration on demand is an incubating feature.
23/04/06 20:51:05 WARN software.amazon.awssdk.regions.internal.util.EC2MetadataUtils: Unable to retrieve the requested metadata.
23/04/06 20:51:06 INFO org.apache.beam.runners.jobsubmission.JobServerDriver: ArtifactStagingService started on localhost:46867
23/04/06 20:51:06 INFO org.apache.beam.runners.jobsubmission.JobServerDriver: Java ExpansionService started on localhost:34669
23/04/06 20:51:06 INFO org.apache.beam.runners.jobsubmission.JobServerDriver: JobService started on localhost:52871
23/04/06 20:51:06 INFO org.apache.beam.runners.jobsubmission.JobServerDriver: Job server now running, terminate with Ctrl+C
> Task :buildSrc:compileJava NO-SOURCE
> Task :buildSrc:compileGroovy UP-TO-DATE
> Task :buildSrc:pluginDescriptors UP-TO-DATE
> Task :buildSrc:processResources UP-TO-DATE
> Task :buildSrc:classes UP-TO-DATE
> Task :buildSrc:jar UP-TO-DATE
> Task :buildSrc:assemble UP-TO-DATE
> Task :buildSrc:spotlessGroovy UP-TO-DATE
> Task :buildSrc:spotlessGroovyCheck UP-TO-DATE
> Task :buildSrc:spotlessGroovyGradle UP-TO-DATE
> Task :buildSrc:spotlessGroovyGradleCheck UP-TO-DATE
> Task :buildSrc:spotlessCheck UP-TO-DATE
> Task :buildSrc:pluginUnderTestMetadata UP-TO-DATE
> Task :buildSrc:compileTestJava NO-SOURCE
> Task :buildSrc:compileTestGroovy NO-SOURCE
> Task :buildSrc:processTestResources NO-SOURCE
> Task :buildSrc:testClasses UP-TO-DATE
> Task :buildSrc:test NO-SOURCE
> Task :buildSrc:validatePlugins UP-TO-DATE
> Task :buildSrc:check UP-TO-DATE
> Task :buildSrc:build UP-TO-DATE
System Go installation: /snap/bin/go is go version go1.16.15 linux/amd64; Preparing to use /home/jenkins/go/bin/go1.20.2
go1.20.2: already downloaded in /home/jenkins/sdk/go1.20.2
GOCMD=/home/jenkins/go/bin/go1.20.2
> Task :sdks:go:container:copyLicenses
> Task :sdks:go:container:dockerClean UP-TO-DATE
> Task :sdks:go:container:goPrepare UP-TO-DATE
> Task :sdks:go:container:goBuild
/home/jenkins/go/bin/go1.20.2 build -o ./build/target/linux_amd64/boot boot.go boot_test.go
> Task :sdks:go:container:skipPullLicenses
> Task :sdks:go:container:dockerPrepare
#1 [internal] load build definition from Dockerfile
#1 transferring dockerfile: 1.94kB done
> Task :sdks:go:container:docker
#1 DONE 0.0s
#2 [internal] load .dockerignore
#2 transferring context: 2B done
#2 DONE 0.0s
#3 [internal] load metadata for docker.io/library/debian:bullseye
#3 DONE 0.6s
#4 [1/8] FROM docker.io/library/debian:bullseye@sha256:7b991788987ad860810df60927e1adbaf8e156520177bd4db82409f81dd3b721
#4 CACHED
#5 [internal] load build context
#5 transferring context: 22.20MB 0.2s done
#5 DONE 0.2s
#6 [2/8] RUN apt-get update && DEBIAN_FRONTEND=noninteractive apt-get install -y ca-certificates && rm -rf /var/lib/apt/lists/*
#6 1.285 Get:1 http://deb.debian.org/debian bullseye InRelease [116 kB]
#6 1.353 Get:2 http://deb.debian.org/debian-security bullseye-security InRelease [48.4 kB]
#6 1.391 Get:3 http://deb.debian.org/debian bullseye-updates InRelease [44.1 kB]
#6 1.957 Get:4 http://deb.debian.org/debian bullseye/main amd64 Packages [8183 kB]
#6 2.233 Get:5 http://deb.debian.org/debian-security bullseye-security/main amd64 Packages [236 kB]
#6 2.269 Get:6 http://deb.debian.org/debian bullseye-updates/main amd64 Packages [14.6 kB]
#6 3.574 Fetched 8642 kB in 2s (3596 kB/s)
#6 3.574 Reading package lists...
#6 4.328 Reading package lists...
#6 5.043 Building dependency tree...
#6 5.235 Reading state information...
#6 5.489 The following additional packages will be installed:
#6 5.490 openssl
#6 5.522 The following NEW packages will be installed:
#6 5.523 ca-certificates openssl
#6 5.614 0 upgraded, 2 newly installed, 0 to remove and 1 not upgraded.
#6 5.614 Need to get 1011 kB of archives.
#6 5.614 After this operation, 1892 kB of additional disk space will be used.
#6 5.614 Get:1 http://deb.debian.org/debian-security bullseye-security/main amd64 openssl amd64 1.1.1n-0+deb11u4 [853 kB]
#6 5.787 Get:2 http://deb.debian.org/debian bullseye/main amd64 ca-certificates all 20210119 [158 kB]
#6 6.651 debconf: delaying package configuration, since apt-utils is not installed
#6 6.696 Fetched 1011 kB in 0s (3933 kB/s)
#6 6.810 Selecting previously unselected package openssl.
#6 6.810 (Reading database ... (Reading database ... 5%(Reading database ... 10%(Reading database ... 15%(Reading database ... 20%(Reading database ... 25%(Reading database ... 30%(Reading database ... 35%(Reading database ... 40%(Reading database ... 45%(Reading database ... 50%(Reading database ... 55%(Reading database ... 60%(Reading database ... 65%(Reading database ... 70%(Reading database ... 75%(Reading database ... 80%(Reading database ... 85%(Reading database ... 90%(Reading database ... 95%(Reading database ... 100%(Reading database ... 6661 files and directories currently installed.)
#6 6.907 Preparing to unpack .../openssl_1.1.1n-0+deb11u4_amd64.deb ...
#6 6.912 Unpacking openssl (1.1.1n-0+deb11u4) ...
#6 7.036 Selecting previously unselected package ca-certificates.
#6 7.038 Preparing to unpack .../ca-certificates_20210119_all.deb ...
#6 7.042 Unpacking ca-certificates (20210119) ...
#6 7.114 Setting up openssl (1.1.1n-0+deb11u4) ...
#6 7.132 Setting up ca-certificates (20210119) ...
#6 8.083 Updating certificates in /etc/ssl/certs...
#6 8.961 129 added, 0 removed; done.
#6 9.048 Processing triggers for ca-certificates (20210119) ...
#6 9.058 Updating certificates in /etc/ssl/certs...
#6 9.682 0 added, 0 removed; done.
#6 9.682 Running hooks in /etc/ca-certificates/update.d...
#6 9.685 done.
#6 DONE 13.4s
#7 [3/8] ADD target/linux_amd64/boot /opt/apache/beam/
#7 DONE 0.3s
#8 [4/8] COPY target/LICENSE /opt/apache/beam/
#8 DONE 0.1s
#9 [5/8] COPY target/NOTICE /opt/apache/beam/
#9 DONE 0.1s
#10 [6/8] COPY target/LICENSE target/go-licenses/* /opt/apache/beam/third_party_licenses/golang/
#10 ERROR: lstat /var/lib/docker/tmp/buildkit-mount525672251/target/go-licenses: no such file or directory
------
> [6/8] COPY target/LICENSE target/go-licenses/* /opt/apache/beam/third_party_licenses/golang/:
------
> Task :sdks:go:container:docker FAILEDERROR: failed to solve: lstat /var/lib/docker/tmp/buildkit-mount525672251/target/go-licenses: no such file or directory
FAILURE: Build failed with an exception.
* What went wrong:
Execution failed for task ':sdks:go:container:docker'.
> Process 'command 'docker'' finished with non-zero exit value 1
* Try:
> Run with --stacktrace option to get the stack trace.
> Run with --info or --debug option to get more log output.
* Get more help at https://help.gradle.org
BUILD FAILED in 30s
16 actionable tasks: 5 executed, 11 up-to-date
Publishing build scan...
https://gradle.com/s/22blnz55vvc4u
$ ./gradlew :sdks:go:container:docker -Pdocker-tag=dev
> Task :sdks:go:test:sparkValidatesRunner FAILED
FAILURE: Build failed with an exception.
* Where:
Build file '<https://ci-beam.apache.org/job/beam_PostCommit_Go_VR_Spark/ws/src/sdks/go/test/build.gradle'> line: 116
* What went wrong:
Execution failed for task ':sdks:go:test:sparkValidatesRunner'.
> Process 'command 'sh'' finished with non-zero exit value 1
* Try:
> Run with --stacktrace option to get the stack trace.
> Run with --info or --debug option to get more log output.
* Get more help at https://help.gradle.org
Deprecated Gradle features were used in this build, making it incompatible with Gradle 8.0.
You can use '--warning-mode all' to show the individual deprecation warnings and determine if they come from your own scripts or plugins.
See https://docs.gradle.org/7.5.1/userguide/command_line_interface.html#sec:command_line_warnings
Execution optimizations have been disabled for 1 invalid unit(s) of work during this build to ensure correctness.
Please consult deprecation warnings for more details.
BUILD FAILED in 1m 52s
117 actionable tasks: 74 executed, 39 from cache, 4 up-to-date
Publishing build scan...
https://gradle.com/s/dnx3shvd6s5xa
Build step 'Invoke Gradle script' changed build result to FAILURE
Build step 'Invoke Gradle script' marked build as failure
---------------------------------------------------------------------
To unsubscribe, e-mail: builds-unsubscribe@beam.apache.org
For additional commands, e-mail: builds-help@beam.apache.org