You are viewing a plain text version of this content. The canonical link for it is here.
Posted to commits@deltaspike.apache.org by Apache Jenkins Server <je...@builds.apache.org> on 2024/01/11 02:40:28 UTC

Build failed in Jenkins: DeltaSpike » DeltaSpike RAT-Check #78

See <https://ci-builds.apache.org/job/DeltaSpike/job/DeltaSpike%20RAT-Check/78/display/redirect?page=changes>

Changes:

[phillip.w.g.ross] add explicit dependent scope to PrincipalProvider and TimestampsProvider beans


------------------------------------------
Started by an SCM change
Running as SYSTEM
[EnvInject] - Loading node environment variables.
Building remotely on builds36 (ubuntu) in workspace <https://ci-builds.apache.org/job/DeltaSpike/job/DeltaSpike%20RAT-Check/ws/>
The recommended git tool is: NONE
No credentials specified
Wiping out workspace first.
Cloning the remote Git repository
Cloning repository https://gitbox.apache.org/repos/asf/deltaspike.git
 > git init <https://ci-builds.apache.org/job/DeltaSpike/job/DeltaSpike%20RAT-Check/ws/> # timeout=10
Fetching upstream changes from https://gitbox.apache.org/repos/asf/deltaspike.git
 > git --version # timeout=10
 > git --version # 'git version 2.34.1'
 > git fetch --tags --force --progress -- https://gitbox.apache.org/repos/asf/deltaspike.git +refs/heads/*:refs/remotes/origin/* # timeout=10
 > git config remote.origin.url https://gitbox.apache.org/repos/asf/deltaspike.git # timeout=10
 > git config --add remote.origin.fetch +refs/heads/*:refs/remotes/origin/* # timeout=10
Avoid second fetch
 > git rev-parse origin/master^{commit} # timeout=10
Checking out Revision e7357d14309b30e019ee46e6a73d507d04138b1e (origin/master)
 > git config core.sparsecheckout # timeout=10
 > git checkout -f e7357d14309b30e019ee46e6a73d507d04138b1e # timeout=10
Commit message: "Merge pull request #138 from phillipross/topic/fix/DELTASPIKE-1468"
 > git rev-list --no-walk 9fc5755db26dd738d915fb1f382ec3c460477159 # timeout=10
Parsing POMs
Modules changed, recalculating dependency graph
Established TCP socket on 44303
maven33-agent.jar already up to date
maven33-interceptor.jar already up to date
maven3-interceptor-commons.jar already up to date
[DeltaSpike RAT-Check] $ /home/jenkins/tools/java/latest1.8/bin/java -cp /home/jenkins/maven33-agent.jar:/home/jenkins/tools/maven/apache-maven-3.3.9/boot/plexus-classworlds-2.5.2.jar:/home/jenkins/tools/maven/apache-maven-3.3.9/conf/logging jenkins.maven3.agent.Maven33Main /home/jenkins/tools/maven/apache-maven-3.3.9 /home/jenkins/agent.jar /home/jenkins/maven33-interceptor.jar /home/jenkins/maven3-interceptor-commons.jar 44303
Exception in thread "main" java.lang.UnsupportedClassVersionError: hudson/remoting/Launcher has been compiled by a more recent version of the Java Runtime (class file version 55.0), this version of the Java Runtime only recognizes class file versions up to 52.0
	at java.lang.ClassLoader.defineClass1(Native Method)
	at java.lang.ClassLoader.defineClass(ClassLoader.java:756)
	at java.security.SecureClassLoader.defineClass(SecureClassLoader.java:142)
	at java.net.URLClassLoader.defineClass(URLClassLoader.java:473)
	at java.net.URLClassLoader.access$100(URLClassLoader.java:74)
	at java.net.URLClassLoader$1.run(URLClassLoader.java:369)
	at java.net.URLClassLoader$1.run(URLClassLoader.java:363)
	at java.security.AccessController.doPrivileged(Native Method)
	at java.net.URLClassLoader.findClass(URLClassLoader.java:362)
	at org.codehaus.plexus.classworlds.realm.ClassRealm.loadClassFromSelf(ClassRealm.java:401)
	at org.codehaus.plexus.classworlds.strategy.SelfFirstStrategy.loadClass(SelfFirstStrategy.java:42)
	at org.codehaus.plexus.classworlds.realm.ClassRealm.unsynchronizedLoadClass(ClassRealm.java:271)
	at org.codehaus.plexus.classworlds.realm.ClassRealm.loadClass(ClassRealm.java:247)
	at org.codehaus.plexus.classworlds.realm.ClassRealm.loadClass(ClassRealm.java:239)
	at jenkins.maven3.agent.Maven33Main.main(Maven33Main.java:136)
	at jenkins.maven3.agent.Maven33Main.main(Maven33Main.java:66)
ERROR: Failed to parse POMs
java.io.EOFException: unexpected stream termination
	at hudson.remoting.ChannelBuilder.negotiate(ChannelBuilder.java:459)
	at hudson.remoting.ChannelBuilder.build(ChannelBuilder.java:404)
	at hudson.slaves.Channels.forProcess(Channels.java:121)
	at hudson.maven.AbstractMavenProcessFactory.newProcess(AbstractMavenProcessFactory.java:296)
	at hudson.maven.ProcessCache.get(ProcessCache.java:236)
	at hudson.maven.MavenModuleSetBuild$MavenModuleSetBuildExecution.doRun(MavenModuleSetBuild.java:802)
	at hudson.model.AbstractBuild$AbstractBuildExecution.run(AbstractBuild.java:526)
	at hudson.model.Run.execute(Run.java:1900)
	at hudson.maven.MavenModuleSetBuild.run(MavenModuleSetBuild.java:543)
	at hudson.model.ResourceController.execute(ResourceController.java:101)
	at hudson.model.Executor.run(Executor.java:442)

Build failed in Jenkins: DeltaSpike » DeltaSpike RAT-Check #109

Posted by Apache Jenkins Server <je...@builds.apache.org>.
See <https://ci-builds.apache.org/job/DeltaSpike/job/DeltaSpike%20RAT-Check/109/display/redirect?page=changes>

Changes:

[Thomas Andraschko] updated weld excludes


------------------------------------------
Started by an SCM change
Running as SYSTEM
[EnvInject] - Loading node environment variables.
Building remotely on builds23 (ubuntu) in workspace <https://ci-builds.apache.org/job/DeltaSpike/job/DeltaSpike%20RAT-Check/ws/>
The recommended git tool is: NONE
No credentials specified
Wiping out workspace first.
Cloning the remote Git repository
Cloning repository https://gitbox.apache.org/repos/asf/deltaspike.git
 > git init <https://ci-builds.apache.org/job/DeltaSpike/job/DeltaSpike%20RAT-Check/ws/> # timeout=10
Fetching upstream changes from https://gitbox.apache.org/repos/asf/deltaspike.git
 > git --version # timeout=10
 > git --version # 'git version 2.34.1'
 > git fetch --tags --force --progress -- https://gitbox.apache.org/repos/asf/deltaspike.git +refs/heads/*:refs/remotes/origin/* # timeout=10
 > git config remote.origin.url https://gitbox.apache.org/repos/asf/deltaspike.git # timeout=10
 > git config --add remote.origin.fetch +refs/heads/*:refs/remotes/origin/* # timeout=10
Avoid second fetch
 > git rev-parse origin/master^{commit} # timeout=10
Checking out Revision 1e79f8fe6bb3589a338d2c4849e534911729a6ec (origin/master)
 > git config core.sparsecheckout # timeout=10
 > git checkout -f 1e79f8fe6bb3589a338d2c4849e534911729a6ec # timeout=10
Commit message: "updated weld excludes"
 > git rev-list --no-walk db1d12da81310b732208c76c1a30feb35934be2d # timeout=10
Parsing POMs
Downloaded artifact https://repo.maven.apache.org/maven2/org/jboss/arquillian/arquillian-bom/1.8.0.Final/arquillian-bom-1.8.0.Final.pom
Downloaded artifact https://repo.maven.apache.org/maven2/org/jboss/weld/weld-core-bom/5.1.2.Final/weld-core-bom-5.1.2.Final.pom
Modules changed, recalculating dependency graph
Established TCP socket on 39987
maven33-agent.jar already up to date
maven33-interceptor.jar already up to date
maven3-interceptor-commons.jar already up to date
[DeltaSpike RAT-Check] $ /home/jenkins/tools/java/latest1.8/bin/java -cp /home/jenkins/maven33-agent.jar:/home/jenkins/tools/maven/apache-maven-3.3.9/boot/plexus-classworlds-2.5.2.jar:/home/jenkins/tools/maven/apache-maven-3.3.9/conf/logging jenkins.maven3.agent.Maven33Main /home/jenkins/tools/maven/apache-maven-3.3.9 /home/jenkins/agent.jar /home/jenkins/maven33-interceptor.jar /home/jenkins/maven3-interceptor-commons.jar 39987
Exception in thread "main" java.lang.UnsupportedClassVersionError: hudson/remoting/Launcher has been compiled by a more recent version of the Java Runtime (class file version 55.0), this version of the Java Runtime only recognizes class file versions up to 52.0
	at java.lang.ClassLoader.defineClass1(Native Method)
	at java.lang.ClassLoader.defineClass(ClassLoader.java:756)
	at java.security.SecureClassLoader.defineClass(SecureClassLoader.java:142)
	at java.net.URLClassLoader.defineClass(URLClassLoader.java:473)
	at java.net.URLClassLoader.access$100(URLClassLoader.java:74)
	at java.net.URLClassLoader$1.run(URLClassLoader.java:369)
	at java.net.URLClassLoader$1.run(URLClassLoader.java:363)
	at java.security.AccessController.doPrivileged(Native Method)
	at java.net.URLClassLoader.findClass(URLClassLoader.java:362)
	at org.codehaus.plexus.classworlds.realm.ClassRealm.loadClassFromSelf(ClassRealm.java:401)
	at org.codehaus.plexus.classworlds.strategy.SelfFirstStrategy.loadClass(SelfFirstStrategy.java:42)
	at org.codehaus.plexus.classworlds.realm.ClassRealm.unsynchronizedLoadClass(ClassRealm.java:271)
	at org.codehaus.plexus.classworlds.realm.ClassRealm.loadClass(ClassRealm.java:247)
	at org.codehaus.plexus.classworlds.realm.ClassRealm.loadClass(ClassRealm.java:239)
	at jenkins.maven3.agent.Maven33Main.main(Maven33Main.java:136)
	at jenkins.maven3.agent.Maven33Main.main(Maven33Main.java:66)
ERROR: Failed to parse POMs
java.io.EOFException: unexpected stream termination
	at hudson.remoting.ChannelBuilder.negotiate(ChannelBuilder.java:459)
	at hudson.remoting.ChannelBuilder.build(ChannelBuilder.java:404)
	at hudson.slaves.Channels.forProcess(Channels.java:121)
	at hudson.maven.AbstractMavenProcessFactory.newProcess(AbstractMavenProcessFactory.java:298)
	at hudson.maven.ProcessCache.get(ProcessCache.java:237)
	at hudson.maven.MavenModuleSetBuild$MavenModuleSetBuildExecution.doRun(MavenModuleSetBuild.java:802)
	at hudson.model.AbstractBuild$AbstractBuildExecution.run(AbstractBuild.java:526)
	at hudson.model.Run.execute(Run.java:1841)
	at hudson.maven.MavenModuleSetBuild.run(MavenModuleSetBuild.java:543)
	at hudson.model.ResourceController.execute(ResourceController.java:101)
	at hudson.model.Executor.run(Executor.java:442)

Build failed in Jenkins: DeltaSpike » DeltaSpike RAT-Check #108

Posted by Apache Jenkins Server <je...@builds.apache.org>.
See <https://ci-builds.apache.org/job/DeltaSpike/job/DeltaSpike%20RAT-Check/108/display/redirect?page=changes>

Changes:

[Thomas Andraschko] deltaspike.bean-manager.delegate_lookup=false for Wildfly


------------------------------------------
Started by an SCM change
Running as SYSTEM
[EnvInject] - Loading node environment variables.
Building remotely on EC2 (ec2-Jenkins Ephemeral Node User-CLI) - Jenkins Ephemeral Node - ubuntu label (i-05bdcd8e5bd1042e8) (ubuntu ephemeral) in workspace <https://ci-builds.apache.org/job/DeltaSpike/job/DeltaSpike%20RAT-Check/ws/>
The recommended git tool is: NONE
No credentials specified
Wiping out workspace first.
Cloning the remote Git repository
Cloning repository https://gitbox.apache.org/repos/asf/deltaspike.git
 > git init <https://ci-builds.apache.org/job/DeltaSpike/job/DeltaSpike%20RAT-Check/ws/> # timeout=10
Fetching upstream changes from https://gitbox.apache.org/repos/asf/deltaspike.git
 > git --version # timeout=10
 > git --version # 'git version 2.34.1'
 > git fetch --tags --force --progress -- https://gitbox.apache.org/repos/asf/deltaspike.git +refs/heads/*:refs/remotes/origin/* # timeout=10
 > git config remote.origin.url https://gitbox.apache.org/repos/asf/deltaspike.git # timeout=10
 > git config --add remote.origin.fetch +refs/heads/*:refs/remotes/origin/* # timeout=10
Avoid second fetch
 > git rev-parse origin/master^{commit} # timeout=10
Checking out Revision db1d12da81310b732208c76c1a30feb35934be2d (origin/master)
 > git config core.sparsecheckout # timeout=10
 > git checkout -f db1d12da81310b732208c76c1a30feb35934be2d # timeout=10
Commit message: "deltaspike.bean-manager.delegate_lookup=false for Wildfly"
 > git rev-list --no-walk b033a86127350a446a93bc5e770a1b54fe6ae155 # timeout=10
Parsing POMs
Downloaded artifact https://repo.maven.apache.org/maven2/org/apache/apache/26/apache-26.pom
Downloaded artifact https://repo.maven.apache.org/maven2/org/jboss/arquillian/arquillian-bom/1.8.0.Final/arquillian-bom-1.8.0.Final.pom
Downloaded artifact https://repo.maven.apache.org/maven2/org/jboss/shrinkwrap/shrinkwrap-bom/1.2.6/shrinkwrap-bom-1.2.6.pom
Downloaded artifact https://repo.maven.apache.org/maven2/org/jboss/shrinkwrap/resolver/shrinkwrap-resolver-bom/3.2.1/shrinkwrap-resolver-bom-3.2.1.pom
Downloaded artifact https://repo.maven.apache.org/maven2/org/apache/maven/maven/3.9.3/maven-3.9.3.pom
Downloaded artifact https://repo.maven.apache.org/maven2/org/apache/maven/maven-parent/40/maven-parent-40.pom
Downloaded artifact https://repo.maven.apache.org/maven2/org/apache/apache/30/apache-30.pom
Downloaded artifact https://repo.maven.apache.org/maven2/org/jboss/shrinkwrap/descriptors/shrinkwrap-descriptors-bom/2.0.0/shrinkwrap-descriptors-bom-2.0.0.pom
Downloaded artifact https://repo.maven.apache.org/maven2/org/jboss/weld/weld-core-bom/5.1.2.Final/weld-core-bom-5.1.2.Final.pom
Downloaded artifact https://repo.maven.apache.org/maven2/org/jboss/weld/weld-api-bom/5.0.SP3/weld-api-bom-5.0.SP3.pom
Modules changed, recalculating dependency graph
Established TCP socket on 38115
Copied maven33-agent.jar
Copied maven33-interceptor.jar
Copied maven3-interceptor-commons.jar
[DeltaSpike RAT-Check] $ /home/jenkins/tools/java/latest1.8/bin/java -cp /home/jenkins/maven33-agent.jar:/home/jenkins/tools/maven/apache-maven-3.3.9/boot/plexus-classworlds-2.5.2.jar:/home/jenkins/tools/maven/apache-maven-3.3.9/conf/logging jenkins.maven3.agent.Maven33Main /home/jenkins/tools/maven/apache-maven-3.3.9 /tmp/remoting.jar /home/jenkins/maven33-interceptor.jar /home/jenkins/maven3-interceptor-commons.jar 38115
Exception in thread "main" java.lang.UnsupportedClassVersionError: hudson/remoting/Launcher has been compiled by a more recent version of the Java Runtime (class file version 55.0), this version of the Java Runtime only recognizes class file versions up to 52.0
	at java.lang.ClassLoader.defineClass1(Native Method)
	at java.lang.ClassLoader.defineClass(ClassLoader.java:756)
	at java.security.SecureClassLoader.defineClass(SecureClassLoader.java:142)
	at java.net.URLClassLoader.defineClass(URLClassLoader.java:473)
	at java.net.URLClassLoader.access$100(URLClassLoader.java:74)
	at java.net.URLClassLoader$1.run(URLClassLoader.java:369)
	at java.net.URLClassLoader$1.run(URLClassLoader.java:363)
	at java.security.AccessController.doPrivileged(Native Method)
	at java.net.URLClassLoader.findClass(URLClassLoader.java:362)
	at org.codehaus.plexus.classworlds.realm.ClassRealm.loadClassFromSelf(ClassRealm.java:401)
	at org.codehaus.plexus.classworlds.strategy.SelfFirstStrategy.loadClass(SelfFirstStrategy.java:42)
	at org.codehaus.plexus.classworlds.realm.ClassRealm.unsynchronizedLoadClass(ClassRealm.java:271)
	at org.codehaus.plexus.classworlds.realm.ClassRealm.loadClass(ClassRealm.java:247)
	at org.codehaus.plexus.classworlds.realm.ClassRealm.loadClass(ClassRealm.java:239)
	at jenkins.maven3.agent.Maven33Main.main(Maven33Main.java:136)
	at jenkins.maven3.agent.Maven33Main.main(Maven33Main.java:66)
ERROR: Failed to parse POMs
java.io.EOFException: unexpected stream termination
	at hudson.remoting.ChannelBuilder.negotiate(ChannelBuilder.java:459)
	at hudson.remoting.ChannelBuilder.build(ChannelBuilder.java:404)
	at hudson.slaves.Channels.forProcess(Channels.java:121)
	at hudson.maven.AbstractMavenProcessFactory.newProcess(AbstractMavenProcessFactory.java:298)
	at hudson.maven.ProcessCache.get(ProcessCache.java:237)
	at hudson.maven.MavenModuleSetBuild$MavenModuleSetBuildExecution.doRun(MavenModuleSetBuild.java:802)
	at hudson.model.AbstractBuild$AbstractBuildExecution.run(AbstractBuild.java:526)
	at hudson.model.Run.execute(Run.java:1841)
	at hudson.maven.MavenModuleSetBuild.run(MavenModuleSetBuild.java:543)
	at hudson.model.ResourceController.execute(ResourceController.java:101)
	at hudson.model.Executor.run(Executor.java:442)

Build failed in Jenkins: DeltaSpike » DeltaSpike RAT-Check #107

Posted by Apache Jenkins Server <je...@builds.apache.org>.
See <https://ci-builds.apache.org/job/DeltaSpike/job/DeltaSpike%20RAT-Check/107/display/redirect?page=changes>

Changes:

[Thomas Andraschko] upgrade Payara


------------------------------------------
Started by an SCM change
Running as SYSTEM
[EnvInject] - Loading node environment variables.
Building remotely on builds59 (ubuntu) in workspace <https://ci-builds.apache.org/job/DeltaSpike/job/DeltaSpike%20RAT-Check/ws/>
The recommended git tool is: NONE
No credentials specified
Wiping out workspace first.
Cloning the remote Git repository
Cloning repository https://gitbox.apache.org/repos/asf/deltaspike.git
 > git init <https://ci-builds.apache.org/job/DeltaSpike/job/DeltaSpike%20RAT-Check/ws/> # timeout=10
Fetching upstream changes from https://gitbox.apache.org/repos/asf/deltaspike.git
 > git --version # timeout=10
 > git --version # 'git version 2.34.1'
 > git fetch --tags --force --progress -- https://gitbox.apache.org/repos/asf/deltaspike.git +refs/heads/*:refs/remotes/origin/* # timeout=10
 > git config remote.origin.url https://gitbox.apache.org/repos/asf/deltaspike.git # timeout=10
 > git config --add remote.origin.fetch +refs/heads/*:refs/remotes/origin/* # timeout=10
Avoid second fetch
 > git rev-parse origin/master^{commit} # timeout=10
Checking out Revision b033a86127350a446a93bc5e770a1b54fe6ae155 (origin/master)
 > git config core.sparsecheckout # timeout=10
 > git checkout -f b033a86127350a446a93bc5e770a1b54fe6ae155 # timeout=10
Commit message: "upgrade Payara"
 > git rev-list --no-walk 61cd09b57f78d7ef71e83eec87c730422891296a # timeout=10
Parsing POMs
Modules changed, recalculating dependency graph
Established TCP socket on 33131
maven33-agent.jar already up to date
maven33-interceptor.jar already up to date
maven3-interceptor-commons.jar already up to date
[DeltaSpike RAT-Check] $ /home/jenkins/tools/java/latest1.8/bin/java -cp /home/jenkins/jenkins-agent/maven33-agent.jar:/home/jenkins/tools/maven/apache-maven-3.3.9/boot/plexus-classworlds-2.5.2.jar:/home/jenkins/tools/maven/apache-maven-3.3.9/conf/logging jenkins.maven3.agent.Maven33Main /home/jenkins/tools/maven/apache-maven-3.3.9 /home/jenkins/jenkins-agent/agent.jar /home/jenkins/jenkins-agent/maven33-interceptor.jar /home/jenkins/jenkins-agent/maven3-interceptor-commons.jar 33131
Exception in thread "main" java.lang.UnsupportedClassVersionError: hudson/remoting/Launcher has been compiled by a more recent version of the Java Runtime (class file version 55.0), this version of the Java Runtime only recognizes class file versions up to 52.0
	at java.lang.ClassLoader.defineClass1(Native Method)
	at java.lang.ClassLoader.defineClass(ClassLoader.java:756)
	at java.security.SecureClassLoader.defineClass(SecureClassLoader.java:142)
	at java.net.URLClassLoader.defineClass(URLClassLoader.java:473)
	at java.net.URLClassLoader.access$100(URLClassLoader.java:74)
	at java.net.URLClassLoader$1.run(URLClassLoader.java:369)
	at java.net.URLClassLoader$1.run(URLClassLoader.java:363)
	at java.security.AccessController.doPrivileged(Native Method)
	at java.net.URLClassLoader.findClass(URLClassLoader.java:362)
	at org.codehaus.plexus.classworlds.realm.ClassRealm.loadClassFromSelf(ClassRealm.java:401)
	at org.codehaus.plexus.classworlds.strategy.SelfFirstStrategy.loadClass(SelfFirstStrategy.java:42)
	at org.codehaus.plexus.classworlds.realm.ClassRealm.unsynchronizedLoadClass(ClassRealm.java:271)
	at org.codehaus.plexus.classworlds.realm.ClassRealm.loadClass(ClassRealm.java:247)
	at org.codehaus.plexus.classworlds.realm.ClassRealm.loadClass(ClassRealm.java:239)
	at jenkins.maven3.agent.Maven33Main.main(Maven33Main.java:136)
	at jenkins.maven3.agent.Maven33Main.main(Maven33Main.java:66)
ERROR: Failed to parse POMs
java.io.EOFException: unexpected stream termination
	at hudson.remoting.ChannelBuilder.negotiate(ChannelBuilder.java:459)
	at hudson.remoting.ChannelBuilder.build(ChannelBuilder.java:404)
	at hudson.slaves.Channels.forProcess(Channels.java:121)
	at hudson.maven.AbstractMavenProcessFactory.newProcess(AbstractMavenProcessFactory.java:298)
	at hudson.maven.ProcessCache.get(ProcessCache.java:237)
	at hudson.maven.MavenModuleSetBuild$MavenModuleSetBuildExecution.doRun(MavenModuleSetBuild.java:802)
	at hudson.model.AbstractBuild$AbstractBuildExecution.run(AbstractBuild.java:526)
	at hudson.model.Run.execute(Run.java:1841)
	at hudson.maven.MavenModuleSetBuild.run(MavenModuleSetBuild.java:543)
	at hudson.model.ResourceController.execute(ResourceController.java:101)
	at hudson.model.Executor.run(Executor.java:442)

Build failed in Jenkins: DeltaSpike » DeltaSpike RAT-Check #106

Posted by Apache Jenkins Server <je...@builds.apache.org>.
See <https://ci-builds.apache.org/job/DeltaSpike/job/DeltaSpike%20RAT-Check/106/display/redirect?page=changes>

Changes:

[t.fruehbeck] replace myfaces-api Assert


------------------------------------------
Started by an SCM change
Running as SYSTEM
[EnvInject] - Loading node environment variables.
Building remotely on builds36 (ubuntu) in workspace <https://ci-builds.apache.org/job/DeltaSpike/job/DeltaSpike%20RAT-Check/ws/>
The recommended git tool is: NONE
No credentials specified
Wiping out workspace first.
Cloning the remote Git repository
Cloning repository https://gitbox.apache.org/repos/asf/deltaspike.git
 > git init <https://ci-builds.apache.org/job/DeltaSpike/job/DeltaSpike%20RAT-Check/ws/> # timeout=10
Fetching upstream changes from https://gitbox.apache.org/repos/asf/deltaspike.git
 > git --version # timeout=10
 > git --version # 'git version 2.34.1'
 > git fetch --tags --force --progress -- https://gitbox.apache.org/repos/asf/deltaspike.git +refs/heads/*:refs/remotes/origin/* # timeout=10
 > git config remote.origin.url https://gitbox.apache.org/repos/asf/deltaspike.git # timeout=10
 > git config --add remote.origin.fetch +refs/heads/*:refs/remotes/origin/* # timeout=10
Avoid second fetch
 > git rev-parse origin/master^{commit} # timeout=10
Checking out Revision 61cd09b57f78d7ef71e83eec87c730422891296a (origin/master)
 > git config core.sparsecheckout # timeout=10
 > git checkout -f 61cd09b57f78d7ef71e83eec87c730422891296a # timeout=10
Commit message: "Merge pull request #154 from shadogray/master"
 > git rev-list --no-walk 3cea66769cdf4623f58d1c4d199fa9c226c01c66 # timeout=10
Parsing POMs
Modules changed, recalculating dependency graph
Established TCP socket on 43579
maven33-agent.jar already up to date
maven33-interceptor.jar already up to date
maven3-interceptor-commons.jar already up to date
[DeltaSpike RAT-Check] $ /home/jenkins/tools/java/latest1.8/bin/java -cp /home/jenkins/maven33-agent.jar:/home/jenkins/tools/maven/apache-maven-3.3.9/boot/plexus-classworlds-2.5.2.jar:/home/jenkins/tools/maven/apache-maven-3.3.9/conf/logging jenkins.maven3.agent.Maven33Main /home/jenkins/tools/maven/apache-maven-3.3.9 /home/jenkins/agent.jar /home/jenkins/maven33-interceptor.jar /home/jenkins/maven3-interceptor-commons.jar 43579
Exception in thread "main" java.lang.UnsupportedClassVersionError: hudson/remoting/Launcher has been compiled by a more recent version of the Java Runtime (class file version 55.0), this version of the Java Runtime only recognizes class file versions up to 52.0
	at java.lang.ClassLoader.defineClass1(Native Method)
	at java.lang.ClassLoader.defineClass(ClassLoader.java:756)
	at java.security.SecureClassLoader.defineClass(SecureClassLoader.java:142)
	at java.net.URLClassLoader.defineClass(URLClassLoader.java:473)
	at java.net.URLClassLoader.access$100(URLClassLoader.java:74)
	at java.net.URLClassLoader$1.run(URLClassLoader.java:369)
	at java.net.URLClassLoader$1.run(URLClassLoader.java:363)
	at java.security.AccessController.doPrivileged(Native Method)
	at java.net.URLClassLoader.findClass(URLClassLoader.java:362)
	at org.codehaus.plexus.classworlds.realm.ClassRealm.loadClassFromSelf(ClassRealm.java:401)
	at org.codehaus.plexus.classworlds.strategy.SelfFirstStrategy.loadClass(SelfFirstStrategy.java:42)
	at org.codehaus.plexus.classworlds.realm.ClassRealm.unsynchronizedLoadClass(ClassRealm.java:271)
	at org.codehaus.plexus.classworlds.realm.ClassRealm.loadClass(ClassRealm.java:247)
	at org.codehaus.plexus.classworlds.realm.ClassRealm.loadClass(ClassRealm.java:239)
	at jenkins.maven3.agent.Maven33Main.main(Maven33Main.java:136)
	at jenkins.maven3.agent.Maven33Main.main(Maven33Main.java:66)
ERROR: Failed to parse POMs
java.io.EOFException: unexpected stream termination
	at hudson.remoting.ChannelBuilder.negotiate(ChannelBuilder.java:459)
	at hudson.remoting.ChannelBuilder.build(ChannelBuilder.java:404)
	at hudson.slaves.Channels.forProcess(Channels.java:121)
	at hudson.maven.AbstractMavenProcessFactory.newProcess(AbstractMavenProcessFactory.java:298)
	at hudson.maven.ProcessCache.get(ProcessCache.java:237)
	at hudson.maven.MavenModuleSetBuild$MavenModuleSetBuildExecution.doRun(MavenModuleSetBuild.java:802)
	at hudson.model.AbstractBuild$AbstractBuildExecution.run(AbstractBuild.java:526)
	at hudson.model.Run.execute(Run.java:1841)
	at hudson.maven.MavenModuleSetBuild.run(MavenModuleSetBuild.java:543)
	at hudson.model.ResourceController.execute(ResourceController.java:101)
	at hudson.model.Executor.run(Executor.java:442)

Build failed in Jenkins: DeltaSpike » DeltaSpike RAT-Check #105

Posted by Apache Jenkins Server <je...@builds.apache.org>.
See <https://ci-builds.apache.org/job/DeltaSpike/job/DeltaSpike%20RAT-Check/105/display/redirect?page=changes>

Changes:

[Thomas Andraschko] get rid of warp/drone/graphene

[Thomas Andraschko] get rid of warp/drone/graphene


------------------------------------------
Started by an SCM change
Running as SYSTEM
[EnvInject] - Loading node environment variables.
Building remotely on builds59 (ubuntu) in workspace <https://ci-builds.apache.org/job/DeltaSpike/job/DeltaSpike%20RAT-Check/ws/>
The recommended git tool is: NONE
No credentials specified
Wiping out workspace first.
Cloning the remote Git repository
Cloning repository https://gitbox.apache.org/repos/asf/deltaspike.git
 > git init <https://ci-builds.apache.org/job/DeltaSpike/job/DeltaSpike%20RAT-Check/ws/> # timeout=10
Fetching upstream changes from https://gitbox.apache.org/repos/asf/deltaspike.git
 > git --version # timeout=10
 > git --version # 'git version 2.34.1'
 > git fetch --tags --force --progress -- https://gitbox.apache.org/repos/asf/deltaspike.git +refs/heads/*:refs/remotes/origin/* # timeout=10
 > git config remote.origin.url https://gitbox.apache.org/repos/asf/deltaspike.git # timeout=10
 > git config --add remote.origin.fetch +refs/heads/*:refs/remotes/origin/* # timeout=10
Avoid second fetch
 > git rev-parse origin/master^{commit} # timeout=10
Checking out Revision 3cea66769cdf4623f58d1c4d199fa9c226c01c66 (origin/master)
 > git config core.sparsecheckout # timeout=10
 > git checkout -f 3cea66769cdf4623f58d1c4d199fa9c226c01c66 # timeout=10
Commit message: "get rid of warp/drone/graphene we dont use any features, not active maintened, no chance to support htmlunit3 with those old versions and we dont even use real features of graphene... we just inject a WebDriver via drone"
 > git rev-list --no-walk 645c0ca55086701120e96301e2052acaf4f80ea5 # timeout=10
Parsing POMs
Modules changed, recalculating dependency graph
Established TCP socket on 33727
maven33-agent.jar already up to date
maven33-interceptor.jar already up to date
maven3-interceptor-commons.jar already up to date
[DeltaSpike RAT-Check] $ /home/jenkins/tools/java/latest1.8/bin/java -cp /home/jenkins/jenkins-agent/maven33-agent.jar:/home/jenkins/tools/maven/apache-maven-3.3.9/boot/plexus-classworlds-2.5.2.jar:/home/jenkins/tools/maven/apache-maven-3.3.9/conf/logging jenkins.maven3.agent.Maven33Main /home/jenkins/tools/maven/apache-maven-3.3.9 /home/jenkins/jenkins-agent/agent.jar /home/jenkins/jenkins-agent/maven33-interceptor.jar /home/jenkins/jenkins-agent/maven3-interceptor-commons.jar 33727
Exception in thread "main" java.lang.UnsupportedClassVersionError: hudson/remoting/Launcher has been compiled by a more recent version of the Java Runtime (class file version 55.0), this version of the Java Runtime only recognizes class file versions up to 52.0
	at java.lang.ClassLoader.defineClass1(Native Method)
	at java.lang.ClassLoader.defineClass(ClassLoader.java:756)
	at java.security.SecureClassLoader.defineClass(SecureClassLoader.java:142)
	at java.net.URLClassLoader.defineClass(URLClassLoader.java:473)
	at java.net.URLClassLoader.access$100(URLClassLoader.java:74)
	at java.net.URLClassLoader$1.run(URLClassLoader.java:369)
	at java.net.URLClassLoader$1.run(URLClassLoader.java:363)
	at java.security.AccessController.doPrivileged(Native Method)
	at java.net.URLClassLoader.findClass(URLClassLoader.java:362)
	at org.codehaus.plexus.classworlds.realm.ClassRealm.loadClassFromSelf(ClassRealm.java:401)
	at org.codehaus.plexus.classworlds.strategy.SelfFirstStrategy.loadClass(SelfFirstStrategy.java:42)
	at org.codehaus.plexus.classworlds.realm.ClassRealm.unsynchronizedLoadClass(ClassRealm.java:271)
	at org.codehaus.plexus.classworlds.realm.ClassRealm.loadClass(ClassRealm.java:247)
	at org.codehaus.plexus.classworlds.realm.ClassRealm.loadClass(ClassRealm.java:239)
	at jenkins.maven3.agent.Maven33Main.main(Maven33Main.java:136)
	at jenkins.maven3.agent.Maven33Main.main(Maven33Main.java:66)
ERROR: Failed to parse POMs
java.io.EOFException: unexpected stream termination
	at hudson.remoting.ChannelBuilder.negotiate(ChannelBuilder.java:459)
	at hudson.remoting.ChannelBuilder.build(ChannelBuilder.java:404)
	at hudson.slaves.Channels.forProcess(Channels.java:121)
	at hudson.maven.AbstractMavenProcessFactory.newProcess(AbstractMavenProcessFactory.java:298)
	at hudson.maven.ProcessCache.get(ProcessCache.java:237)
	at hudson.maven.MavenModuleSetBuild$MavenModuleSetBuildExecution.doRun(MavenModuleSetBuild.java:802)
	at hudson.model.AbstractBuild$AbstractBuildExecution.run(AbstractBuild.java:526)
	at hudson.model.Run.execute(Run.java:1841)
	at hudson.maven.MavenModuleSetBuild.run(MavenModuleSetBuild.java:543)
	at hudson.model.ResourceController.execute(ResourceController.java:101)
	at hudson.model.Executor.run(Executor.java:442)

Build failed in Jenkins: DeltaSpike » DeltaSpike RAT-Check #104

Posted by Apache Jenkins Server <je...@builds.apache.org>.
See <https://ci-builds.apache.org/job/DeltaSpike/job/DeltaSpike%20RAT-Check/104/display/redirect?page=changes>

Changes:

[Thomas Andraschko] upgraded graphene + selenium


------------------------------------------
Started by an SCM change
Running as SYSTEM
[EnvInject] - Loading node environment variables.
Building remotely on builds36 (ubuntu) in workspace <https://ci-builds.apache.org/job/DeltaSpike/job/DeltaSpike%20RAT-Check/ws/>
The recommended git tool is: NONE
No credentials specified
Wiping out workspace first.
Cloning the remote Git repository
Cloning repository https://gitbox.apache.org/repos/asf/deltaspike.git
 > git init <https://ci-builds.apache.org/job/DeltaSpike/job/DeltaSpike%20RAT-Check/ws/> # timeout=10
Fetching upstream changes from https://gitbox.apache.org/repos/asf/deltaspike.git
 > git --version # timeout=10
 > git --version # 'git version 2.34.1'
 > git fetch --tags --force --progress -- https://gitbox.apache.org/repos/asf/deltaspike.git +refs/heads/*:refs/remotes/origin/* # timeout=10
 > git config remote.origin.url https://gitbox.apache.org/repos/asf/deltaspike.git # timeout=10
 > git config --add remote.origin.fetch +refs/heads/*:refs/remotes/origin/* # timeout=10
Avoid second fetch
 > git rev-parse origin/master^{commit} # timeout=10
Checking out Revision 645c0ca55086701120e96301e2052acaf4f80ea5 (origin/master)
 > git config core.sparsecheckout # timeout=10
 > git checkout -f 645c0ca55086701120e96301e2052acaf4f80ea5 # timeout=10
Commit message: "upgraded graphene + selenium"
 > git rev-list --no-walk b150f0a9c8990a9689242c9056c7a15366afacc7 # timeout=10
Parsing POMs
Modules changed, recalculating dependency graph
Established TCP socket on 40175
maven33-agent.jar already up to date
maven33-interceptor.jar already up to date
maven3-interceptor-commons.jar already up to date
[DeltaSpike RAT-Check] $ /home/jenkins/tools/java/latest1.8/bin/java -cp /home/jenkins/maven33-agent.jar:/home/jenkins/tools/maven/apache-maven-3.3.9/boot/plexus-classworlds-2.5.2.jar:/home/jenkins/tools/maven/apache-maven-3.3.9/conf/logging jenkins.maven3.agent.Maven33Main /home/jenkins/tools/maven/apache-maven-3.3.9 /home/jenkins/agent.jar /home/jenkins/maven33-interceptor.jar /home/jenkins/maven3-interceptor-commons.jar 40175
Exception in thread "main" java.lang.UnsupportedClassVersionError: hudson/remoting/Launcher has been compiled by a more recent version of the Java Runtime (class file version 55.0), this version of the Java Runtime only recognizes class file versions up to 52.0
	at java.lang.ClassLoader.defineClass1(Native Method)
	at java.lang.ClassLoader.defineClass(ClassLoader.java:756)
	at java.security.SecureClassLoader.defineClass(SecureClassLoader.java:142)
	at java.net.URLClassLoader.defineClass(URLClassLoader.java:473)
	at java.net.URLClassLoader.access$100(URLClassLoader.java:74)
	at java.net.URLClassLoader$1.run(URLClassLoader.java:369)
	at java.net.URLClassLoader$1.run(URLClassLoader.java:363)
	at java.security.AccessController.doPrivileged(Native Method)
	at java.net.URLClassLoader.findClass(URLClassLoader.java:362)
	at org.codehaus.plexus.classworlds.realm.ClassRealm.loadClassFromSelf(ClassRealm.java:401)
	at org.codehaus.plexus.classworlds.strategy.SelfFirstStrategy.loadClass(SelfFirstStrategy.java:42)
	at org.codehaus.plexus.classworlds.realm.ClassRealm.unsynchronizedLoadClass(ClassRealm.java:271)
	at org.codehaus.plexus.classworlds.realm.ClassRealm.loadClass(ClassRealm.java:247)
	at org.codehaus.plexus.classworlds.realm.ClassRealm.loadClass(ClassRealm.java:239)
	at jenkins.maven3.agent.Maven33Main.main(Maven33Main.java:136)
	at jenkins.maven3.agent.Maven33Main.main(Maven33Main.java:66)
ERROR: Failed to parse POMs
java.io.EOFException: unexpected stream termination
	at hudson.remoting.ChannelBuilder.negotiate(ChannelBuilder.java:459)
	at hudson.remoting.ChannelBuilder.build(ChannelBuilder.java:404)
	at hudson.slaves.Channels.forProcess(Channels.java:121)
	at hudson.maven.AbstractMavenProcessFactory.newProcess(AbstractMavenProcessFactory.java:298)
	at hudson.maven.ProcessCache.get(ProcessCache.java:237)
	at hudson.maven.MavenModuleSetBuild$MavenModuleSetBuildExecution.doRun(MavenModuleSetBuild.java:802)
	at hudson.model.AbstractBuild$AbstractBuildExecution.run(AbstractBuild.java:526)
	at hudson.model.Run.execute(Run.java:1841)
	at hudson.maven.MavenModuleSetBuild.run(MavenModuleSetBuild.java:543)
	at hudson.model.ResourceController.execute(ResourceController.java:101)
	at hudson.model.Executor.run(Executor.java:442)

Build failed in Jenkins: DeltaSpike » DeltaSpike RAT-Check #103

Posted by Apache Jenkins Server <je...@builds.apache.org>.
See <https://ci-builds.apache.org/job/DeltaSpike/job/DeltaSpike%20RAT-Check/103/display/redirect?page=changes>

Changes:

[Thomas Andraschko] try to workaround mojarra encodeRedirectURL bug

[Thomas Andraschko] try to workaround mojarra encodeRedirectURL bug


------------------------------------------
Started by an SCM change
Running as SYSTEM
[EnvInject] - Loading node environment variables.
Building remotely on builds59 (ubuntu) in workspace <https://ci-builds.apache.org/job/DeltaSpike/job/DeltaSpike%20RAT-Check/ws/>
The recommended git tool is: NONE
No credentials specified
Wiping out workspace first.
Cloning the remote Git repository
Cloning repository https://gitbox.apache.org/repos/asf/deltaspike.git
 > git init <https://ci-builds.apache.org/job/DeltaSpike/job/DeltaSpike%20RAT-Check/ws/> # timeout=10
Fetching upstream changes from https://gitbox.apache.org/repos/asf/deltaspike.git
 > git --version # timeout=10
 > git --version # 'git version 2.34.1'
 > git fetch --tags --force --progress -- https://gitbox.apache.org/repos/asf/deltaspike.git +refs/heads/*:refs/remotes/origin/* # timeout=10
 > git config remote.origin.url https://gitbox.apache.org/repos/asf/deltaspike.git # timeout=10
 > git config --add remote.origin.fetch +refs/heads/*:refs/remotes/origin/* # timeout=10
Avoid second fetch
 > git rev-parse origin/master^{commit} # timeout=10
Checking out Revision b150f0a9c8990a9689242c9056c7a15366afacc7 (origin/master)
 > git config core.sparsecheckout # timeout=10
 > git checkout -f b150f0a9c8990a9689242c9056c7a15366afacc7 # timeout=10
Commit message: "try to workaround mojarra encodeRedirectURL bug"
 > git rev-list --no-walk 80a09955db24432b596345021c6997339d587958 # timeout=10
Parsing POMs
Modules changed, recalculating dependency graph
Established TCP socket on 37303
maven33-agent.jar already up to date
maven33-interceptor.jar already up to date
maven3-interceptor-commons.jar already up to date
[DeltaSpike RAT-Check] $ /home/jenkins/tools/java/latest1.8/bin/java -cp /home/jenkins/jenkins-agent/maven33-agent.jar:/home/jenkins/tools/maven/apache-maven-3.3.9/boot/plexus-classworlds-2.5.2.jar:/home/jenkins/tools/maven/apache-maven-3.3.9/conf/logging jenkins.maven3.agent.Maven33Main /home/jenkins/tools/maven/apache-maven-3.3.9 /home/jenkins/jenkins-agent/agent.jar /home/jenkins/jenkins-agent/maven33-interceptor.jar /home/jenkins/jenkins-agent/maven3-interceptor-commons.jar 37303
Exception in thread "main" java.lang.UnsupportedClassVersionError: hudson/remoting/Launcher has been compiled by a more recent version of the Java Runtime (class file version 55.0), this version of the Java Runtime only recognizes class file versions up to 52.0
	at java.lang.ClassLoader.defineClass1(Native Method)
	at java.lang.ClassLoader.defineClass(ClassLoader.java:756)
	at java.security.SecureClassLoader.defineClass(SecureClassLoader.java:142)
	at java.net.URLClassLoader.defineClass(URLClassLoader.java:473)
	at java.net.URLClassLoader.access$100(URLClassLoader.java:74)
	at java.net.URLClassLoader$1.run(URLClassLoader.java:369)
	at java.net.URLClassLoader$1.run(URLClassLoader.java:363)
	at java.security.AccessController.doPrivileged(Native Method)
	at java.net.URLClassLoader.findClass(URLClassLoader.java:362)
	at org.codehaus.plexus.classworlds.realm.ClassRealm.loadClassFromSelf(ClassRealm.java:401)
	at org.codehaus.plexus.classworlds.strategy.SelfFirstStrategy.loadClass(SelfFirstStrategy.java:42)
	at org.codehaus.plexus.classworlds.realm.ClassRealm.unsynchronizedLoadClass(ClassRealm.java:271)
	at org.codehaus.plexus.classworlds.realm.ClassRealm.loadClass(ClassRealm.java:247)
	at org.codehaus.plexus.classworlds.realm.ClassRealm.loadClass(ClassRealm.java:239)
	at jenkins.maven3.agent.Maven33Main.main(Maven33Main.java:136)
	at jenkins.maven3.agent.Maven33Main.main(Maven33Main.java:66)
ERROR: Failed to parse POMs
java.io.EOFException: unexpected stream termination
	at hudson.remoting.ChannelBuilder.negotiate(ChannelBuilder.java:459)
	at hudson.remoting.ChannelBuilder.build(ChannelBuilder.java:404)
	at hudson.slaves.Channels.forProcess(Channels.java:121)
	at hudson.maven.AbstractMavenProcessFactory.newProcess(AbstractMavenProcessFactory.java:298)
	at hudson.maven.ProcessCache.get(ProcessCache.java:237)
	at hudson.maven.MavenModuleSetBuild$MavenModuleSetBuildExecution.doRun(MavenModuleSetBuild.java:802)
	at hudson.model.AbstractBuild$AbstractBuildExecution.run(AbstractBuild.java:526)
	at hudson.model.Run.execute(Run.java:1841)
	at hudson.maven.MavenModuleSetBuild.run(MavenModuleSetBuild.java:543)
	at hudson.model.ResourceController.execute(ResourceController.java:101)
	at hudson.model.Executor.run(Executor.java:442)

Build failed in Jenkins: DeltaSpike » DeltaSpike RAT-Check #102

Posted by Apache Jenkins Server <je...@builds.apache.org>.
See <https://ci-builds.apache.org/job/DeltaSpike/job/DeltaSpike%20RAT-Check/102/display/redirect?page=changes>

Changes:

[Thomas Andraschko] DELTASPIKE-1471 Remove @EnableInterceptors in favor of CDI InterceptionFactory


------------------------------------------
Started by an SCM change
Running as SYSTEM
[EnvInject] - Loading node environment variables.
Building remotely on builds38 (ubuntu) in workspace <https://ci-builds.apache.org/job/DeltaSpike/job/DeltaSpike%20RAT-Check/ws/>
The recommended git tool is: NONE
No credentials specified
Wiping out workspace first.
Cloning the remote Git repository
Cloning repository https://gitbox.apache.org/repos/asf/deltaspike.git
 > git init <https://ci-builds.apache.org/job/DeltaSpike/job/DeltaSpike%20RAT-Check/ws/> # timeout=10
Fetching upstream changes from https://gitbox.apache.org/repos/asf/deltaspike.git
 > git --version # timeout=10
 > git --version # 'git version 2.34.1'
 > git fetch --tags --force --progress -- https://gitbox.apache.org/repos/asf/deltaspike.git +refs/heads/*:refs/remotes/origin/* # timeout=10
 > git config remote.origin.url https://gitbox.apache.org/repos/asf/deltaspike.git # timeout=10
 > git config --add remote.origin.fetch +refs/heads/*:refs/remotes/origin/* # timeout=10
Avoid second fetch
 > git rev-parse origin/master^{commit} # timeout=10
Checking out Revision 80a09955db24432b596345021c6997339d587958 (origin/master)
 > git config core.sparsecheckout # timeout=10
 > git checkout -f 80a09955db24432b596345021c6997339d587958 # timeout=10
Commit message: "DELTASPIKE-1471 Remove @EnableInterceptors in favor of CDI InterceptionFactory"
 > git rev-list --no-walk 1e158bfca0c69ebf777c4f69daf38a5f537867a9 # timeout=10
Parsing POMs
Modules changed, recalculating dependency graph
Established TCP socket on 38365
maven33-agent.jar already up to date
maven33-interceptor.jar already up to date
maven3-interceptor-commons.jar already up to date
[DeltaSpike RAT-Check] $ /home/jenkins/tools/java/latest1.8/bin/java -cp /home/jenkins/jenkins-agent/maven33-agent.jar:/home/jenkins/tools/maven/apache-maven-3.3.9/boot/plexus-classworlds-2.5.2.jar:/home/jenkins/tools/maven/apache-maven-3.3.9/conf/logging jenkins.maven3.agent.Maven33Main /home/jenkins/tools/maven/apache-maven-3.3.9 /home/jenkins/jenkins-agent/agent.jar /home/jenkins/jenkins-agent/maven33-interceptor.jar /home/jenkins/jenkins-agent/maven3-interceptor-commons.jar 38365
Exception in thread "main" java.lang.UnsupportedClassVersionError: hudson/remoting/Launcher has been compiled by a more recent version of the Java Runtime (class file version 55.0), this version of the Java Runtime only recognizes class file versions up to 52.0
	at java.lang.ClassLoader.defineClass1(Native Method)
	at java.lang.ClassLoader.defineClass(ClassLoader.java:756)
	at java.security.SecureClassLoader.defineClass(SecureClassLoader.java:142)
	at java.net.URLClassLoader.defineClass(URLClassLoader.java:473)
	at java.net.URLClassLoader.access$100(URLClassLoader.java:74)
	at java.net.URLClassLoader$1.run(URLClassLoader.java:369)
	at java.net.URLClassLoader$1.run(URLClassLoader.java:363)
	at java.security.AccessController.doPrivileged(Native Method)
	at java.net.URLClassLoader.findClass(URLClassLoader.java:362)
	at org.codehaus.plexus.classworlds.realm.ClassRealm.loadClassFromSelf(ClassRealm.java:401)
	at org.codehaus.plexus.classworlds.strategy.SelfFirstStrategy.loadClass(SelfFirstStrategy.java:42)
	at org.codehaus.plexus.classworlds.realm.ClassRealm.unsynchronizedLoadClass(ClassRealm.java:271)
	at org.codehaus.plexus.classworlds.realm.ClassRealm.loadClass(ClassRealm.java:247)
	at org.codehaus.plexus.classworlds.realm.ClassRealm.loadClass(ClassRealm.java:239)
	at jenkins.maven3.agent.Maven33Main.main(Maven33Main.java:136)
	at jenkins.maven3.agent.Maven33Main.main(Maven33Main.java:66)
ERROR: Failed to parse POMs
java.io.EOFException: unexpected stream termination
	at hudson.remoting.ChannelBuilder.negotiate(ChannelBuilder.java:459)
	at hudson.remoting.ChannelBuilder.build(ChannelBuilder.java:404)
	at hudson.slaves.Channels.forProcess(Channels.java:121)
	at hudson.maven.AbstractMavenProcessFactory.newProcess(AbstractMavenProcessFactory.java:298)
	at hudson.maven.ProcessCache.get(ProcessCache.java:237)
	at hudson.maven.MavenModuleSetBuild$MavenModuleSetBuildExecution.doRun(MavenModuleSetBuild.java:802)
	at hudson.model.AbstractBuild$AbstractBuildExecution.run(AbstractBuild.java:526)
	at hudson.model.Run.execute(Run.java:1841)
	at hudson.maven.MavenModuleSetBuild.run(MavenModuleSetBuild.java:543)
	at hudson.model.ResourceController.execute(ResourceController.java:101)
	at hudson.model.Executor.run(Executor.java:442)

Build failed in Jenkins: DeltaSpike » DeltaSpike RAT-Check #101

Posted by Apache Jenkins Server <je...@builds.apache.org>.
See <https://ci-builds.apache.org/job/DeltaSpike/job/DeltaSpike%20RAT-Check/101/display/redirect?page=changes>

Changes:

[Thomas Andraschko] some cleanup and fixed cdicontainer.version


------------------------------------------
Started by an SCM change
Running as SYSTEM
[EnvInject] - Loading node environment variables.
Building remotely on builds38 (ubuntu) in workspace <https://ci-builds.apache.org/job/DeltaSpike/job/DeltaSpike%20RAT-Check/ws/>
The recommended git tool is: NONE
No credentials specified
Wiping out workspace first.
Cloning the remote Git repository
Cloning repository https://gitbox.apache.org/repos/asf/deltaspike.git
 > git init <https://ci-builds.apache.org/job/DeltaSpike/job/DeltaSpike%20RAT-Check/ws/> # timeout=10
Fetching upstream changes from https://gitbox.apache.org/repos/asf/deltaspike.git
 > git --version # timeout=10
 > git --version # 'git version 2.34.1'
 > git fetch --tags --force --progress -- https://gitbox.apache.org/repos/asf/deltaspike.git +refs/heads/*:refs/remotes/origin/* # timeout=10
 > git config remote.origin.url https://gitbox.apache.org/repos/asf/deltaspike.git # timeout=10
 > git config --add remote.origin.fetch +refs/heads/*:refs/remotes/origin/* # timeout=10
Avoid second fetch
 > git rev-parse origin/master^{commit} # timeout=10
Checking out Revision 1e158bfca0c69ebf777c4f69daf38a5f537867a9 (origin/master)
 > git config core.sparsecheckout # timeout=10
 > git checkout -f 1e158bfca0c69ebf777c4f69daf38a5f537867a9 # timeout=10
Commit message: "some cleanup and fixed cdicontainer.version"
 > git rev-list --no-walk 1ae58f8b6ffaace2812ae6a9ca73c61f6c031ac7 # timeout=10
Parsing POMs
Downloaded artifact https://repo.maven.apache.org/maven2/org/jboss/arquillian/arquillian-bom/1.8.0.Final/arquillian-bom-1.8.0.Final.pom
Downloaded artifact https://repo.maven.apache.org/maven2/org/jboss/weld/weld-core-bom/5.1.2.Final/weld-core-bom-5.1.2.Final.pom
Modules changed, recalculating dependency graph
Established TCP socket on 33161
maven33-agent.jar already up to date
maven33-interceptor.jar already up to date
maven3-interceptor-commons.jar already up to date
[DeltaSpike RAT-Check] $ /home/jenkins/tools/java/latest1.8/bin/java -cp /home/jenkins/jenkins-agent/maven33-agent.jar:/home/jenkins/tools/maven/apache-maven-3.3.9/boot/plexus-classworlds-2.5.2.jar:/home/jenkins/tools/maven/apache-maven-3.3.9/conf/logging jenkins.maven3.agent.Maven33Main /home/jenkins/tools/maven/apache-maven-3.3.9 /home/jenkins/jenkins-agent/agent.jar /home/jenkins/jenkins-agent/maven33-interceptor.jar /home/jenkins/jenkins-agent/maven3-interceptor-commons.jar 33161
Exception in thread "main" java.lang.UnsupportedClassVersionError: hudson/remoting/Launcher has been compiled by a more recent version of the Java Runtime (class file version 55.0), this version of the Java Runtime only recognizes class file versions up to 52.0
	at java.lang.ClassLoader.defineClass1(Native Method)
	at java.lang.ClassLoader.defineClass(ClassLoader.java:756)
	at java.security.SecureClassLoader.defineClass(SecureClassLoader.java:142)
	at java.net.URLClassLoader.defineClass(URLClassLoader.java:473)
	at java.net.URLClassLoader.access$100(URLClassLoader.java:74)
	at java.net.URLClassLoader$1.run(URLClassLoader.java:369)
	at java.net.URLClassLoader$1.run(URLClassLoader.java:363)
	at java.security.AccessController.doPrivileged(Native Method)
	at java.net.URLClassLoader.findClass(URLClassLoader.java:362)
	at org.codehaus.plexus.classworlds.realm.ClassRealm.loadClassFromSelf(ClassRealm.java:401)
	at org.codehaus.plexus.classworlds.strategy.SelfFirstStrategy.loadClass(SelfFirstStrategy.java:42)
	at org.codehaus.plexus.classworlds.realm.ClassRealm.unsynchronizedLoadClass(ClassRealm.java:271)
	at org.codehaus.plexus.classworlds.realm.ClassRealm.loadClass(ClassRealm.java:247)
	at org.codehaus.plexus.classworlds.realm.ClassRealm.loadClass(ClassRealm.java:239)
	at jenkins.maven3.agent.Maven33Main.main(Maven33Main.java:136)
	at jenkins.maven3.agent.Maven33Main.main(Maven33Main.java:66)
ERROR: Failed to parse POMs
java.io.EOFException: unexpected stream termination
	at hudson.remoting.ChannelBuilder.negotiate(ChannelBuilder.java:459)
	at hudson.remoting.ChannelBuilder.build(ChannelBuilder.java:404)
	at hudson.slaves.Channels.forProcess(Channels.java:121)
	at hudson.maven.AbstractMavenProcessFactory.newProcess(AbstractMavenProcessFactory.java:298)
	at hudson.maven.ProcessCache.get(ProcessCache.java:237)
	at hudson.maven.MavenModuleSetBuild$MavenModuleSetBuildExecution.doRun(MavenModuleSetBuild.java:802)
	at hudson.model.AbstractBuild$AbstractBuildExecution.run(AbstractBuild.java:526)
	at hudson.model.Run.execute(Run.java:1841)
	at hudson.maven.MavenModuleSetBuild.run(MavenModuleSetBuild.java:543)
	at hudson.model.ResourceController.execute(ResourceController.java:101)
	at hudson.model.Executor.run(Executor.java:442)

Build failed in Jenkins: DeltaSpike » DeltaSpike RAT-Check #100

Posted by Apache Jenkins Server <je...@builds.apache.org>.
See <https://ci-builds.apache.org/job/DeltaSpike/job/DeltaSpike%20RAT-Check/100/display/redirect?page=changes>

Changes:

[t.fruehbeck] JDK17: noverify deprecated, MaxPermSize removed

[Thomas Andraschko] progress on payara-build-managed

[Thomas Andraschko] progress on payara-build-managed


------------------------------------------
Started by an SCM change
Running as SYSTEM
[EnvInject] - Loading node environment variables.
Building remotely on builds47 (tmp-22 ubuntu) in workspace <https://ci-builds.apache.org/job/DeltaSpike/job/DeltaSpike%20RAT-Check/ws/>
The recommended git tool is: NONE
No credentials specified
Wiping out workspace first.
Cloning the remote Git repository
Cloning repository https://gitbox.apache.org/repos/asf/deltaspike.git
 > git init <https://ci-builds.apache.org/job/DeltaSpike/job/DeltaSpike%20RAT-Check/ws/> # timeout=10
Fetching upstream changes from https://gitbox.apache.org/repos/asf/deltaspike.git
 > git --version # timeout=10
 > git --version # 'git version 2.34.1'
 > git fetch --tags --force --progress -- https://gitbox.apache.org/repos/asf/deltaspike.git +refs/heads/*:refs/remotes/origin/* # timeout=10
 > git config remote.origin.url https://gitbox.apache.org/repos/asf/deltaspike.git # timeout=10
 > git config --add remote.origin.fetch +refs/heads/*:refs/remotes/origin/* # timeout=10
Avoid second fetch
 > git rev-parse origin/master^{commit} # timeout=10
Checking out Revision 1ae58f8b6ffaace2812ae6a9ca73c61f6c031ac7 (origin/master)
 > git config core.sparsecheckout # timeout=10
 > git checkout -f 1ae58f8b6ffaace2812ae6a9ca73c61f6c031ac7 # timeout=10
Commit message: "progress on payara-build-managed"
 > git rev-list --no-walk b203fd72fbf80a57101424adc9727cc3aed50358 # timeout=10
Parsing POMs
Modules changed, recalculating dependency graph
Established TCP socket on 41833
maven33-agent.jar already up to date
maven33-interceptor.jar already up to date
maven3-interceptor-commons.jar already up to date
[DeltaSpike RAT-Check] $ /home/jenkins/tools/java/latest1.8/bin/java -cp /home/jenkins/jenkins-agent/maven33-agent.jar:/home/jenkins/tools/maven/apache-maven-3.3.9/boot/plexus-classworlds-2.5.2.jar:/home/jenkins/tools/maven/apache-maven-3.3.9/conf/logging jenkins.maven3.agent.Maven33Main /home/jenkins/tools/maven/apache-maven-3.3.9 /home/jenkins/jenkins-agent/agent.jar /home/jenkins/jenkins-agent/maven33-interceptor.jar /home/jenkins/jenkins-agent/maven3-interceptor-commons.jar 41833
Exception in thread "main" java.lang.UnsupportedClassVersionError: hudson/remoting/Launcher has been compiled by a more recent version of the Java Runtime (class file version 55.0), this version of the Java Runtime only recognizes class file versions up to 52.0
	at java.lang.ClassLoader.defineClass1(Native Method)
	at java.lang.ClassLoader.defineClass(ClassLoader.java:756)
	at java.security.SecureClassLoader.defineClass(SecureClassLoader.java:142)
	at java.net.URLClassLoader.defineClass(URLClassLoader.java:473)
	at java.net.URLClassLoader.access$100(URLClassLoader.java:74)
	at java.net.URLClassLoader$1.run(URLClassLoader.java:369)
	at java.net.URLClassLoader$1.run(URLClassLoader.java:363)
	at java.security.AccessController.doPrivileged(Native Method)
	at java.net.URLClassLoader.findClass(URLClassLoader.java:362)
	at org.codehaus.plexus.classworlds.realm.ClassRealm.loadClassFromSelf(ClassRealm.java:401)
	at org.codehaus.plexus.classworlds.strategy.SelfFirstStrategy.loadClass(SelfFirstStrategy.java:42)
	at org.codehaus.plexus.classworlds.realm.ClassRealm.unsynchronizedLoadClass(ClassRealm.java:271)
	at org.codehaus.plexus.classworlds.realm.ClassRealm.loadClass(ClassRealm.java:247)
	at org.codehaus.plexus.classworlds.realm.ClassRealm.loadClass(ClassRealm.java:239)
	at jenkins.maven3.agent.Maven33Main.main(Maven33Main.java:136)
	at jenkins.maven3.agent.Maven33Main.main(Maven33Main.java:66)
ERROR: Failed to parse POMs
java.io.EOFException: unexpected stream termination
	at hudson.remoting.ChannelBuilder.negotiate(ChannelBuilder.java:459)
	at hudson.remoting.ChannelBuilder.build(ChannelBuilder.java:404)
	at hudson.slaves.Channels.forProcess(Channels.java:121)
	at hudson.maven.AbstractMavenProcessFactory.newProcess(AbstractMavenProcessFactory.java:298)
	at hudson.maven.ProcessCache.get(ProcessCache.java:237)
	at hudson.maven.MavenModuleSetBuild$MavenModuleSetBuildExecution.doRun(MavenModuleSetBuild.java:802)
	at hudson.model.AbstractBuild$AbstractBuildExecution.run(AbstractBuild.java:526)
	at hudson.model.Run.execute(Run.java:1841)
	at hudson.maven.MavenModuleSetBuild.run(MavenModuleSetBuild.java:543)
	at hudson.model.ResourceController.execute(ResourceController.java:101)
	at hudson.model.Executor.run(Executor.java:442)

Build failed in Jenkins: DeltaSpike » DeltaSpike RAT-Check #99

Posted by Apache Jenkins Server <je...@builds.apache.org>.
See <https://ci-builds.apache.org/job/DeltaSpike/job/DeltaSpike%20RAT-Check/99/display/redirect?page=changes>

Changes:

[t.fruehbeck] remove legacy references to jbossas7

[Thomas Andraschko] added payara-build-managed


------------------------------------------
Started by an SCM change
Running as SYSTEM
[EnvInject] - Loading node environment variables.
Building remotely on builds22 (ubuntu) in workspace <https://ci-builds.apache.org/job/DeltaSpike/job/DeltaSpike%20RAT-Check/ws/>
The recommended git tool is: NONE
No credentials specified
Wiping out workspace first.
Cloning the remote Git repository
Cloning repository https://gitbox.apache.org/repos/asf/deltaspike.git
 > git init <https://ci-builds.apache.org/job/DeltaSpike/job/DeltaSpike%20RAT-Check/ws/> # timeout=10
Fetching upstream changes from https://gitbox.apache.org/repos/asf/deltaspike.git
 > git --version # timeout=10
 > git --version # 'git version 2.34.1'
 > git fetch --tags --force --progress -- https://gitbox.apache.org/repos/asf/deltaspike.git +refs/heads/*:refs/remotes/origin/* # timeout=10
 > git config remote.origin.url https://gitbox.apache.org/repos/asf/deltaspike.git # timeout=10
 > git config --add remote.origin.fetch +refs/heads/*:refs/remotes/origin/* # timeout=10
Avoid second fetch
 > git rev-parse origin/master^{commit} # timeout=10
Checking out Revision b203fd72fbf80a57101424adc9727cc3aed50358 (origin/master)
 > git config core.sparsecheckout # timeout=10
 > git checkout -f b203fd72fbf80a57101424adc9727cc3aed50358 # timeout=10
Commit message: "added payara-build-managed"
 > git rev-list --no-walk bca9f74e62d32fb95c9a3cbd74d7a47296659de7 # timeout=10
Parsing POMs
Downloaded artifact https://repo.maven.apache.org/maven2/org/jboss/arquillian/arquillian-bom/1.8.0.Final/arquillian-bom-1.8.0.Final.pom
Downloaded artifact https://repo.maven.apache.org/maven2/org/jboss/weld/weld-core-bom/5.1.2.Final/weld-core-bom-5.1.2.Final.pom
Modules changed, recalculating dependency graph
Established TCP socket on 44191
maven33-agent.jar already up to date
maven33-interceptor.jar already up to date
maven3-interceptor-commons.jar already up to date
[DeltaSpike RAT-Check] $ /home/jenkins/tools/java/latest1.8/bin/java -cp /home/jenkins/jenkins-agent/maven33-agent.jar:/home/jenkins/tools/maven/apache-maven-3.3.9/boot/plexus-classworlds-2.5.2.jar:/home/jenkins/tools/maven/apache-maven-3.3.9/conf/logging jenkins.maven3.agent.Maven33Main /home/jenkins/tools/maven/apache-maven-3.3.9 /home/jenkins/jenkins-agent/agent.jar /home/jenkins/jenkins-agent/maven33-interceptor.jar /home/jenkins/jenkins-agent/maven3-interceptor-commons.jar 44191
Exception in thread "main" java.lang.UnsupportedClassVersionError: hudson/remoting/Launcher has been compiled by a more recent version of the Java Runtime (class file version 55.0), this version of the Java Runtime only recognizes class file versions up to 52.0
	at java.lang.ClassLoader.defineClass1(Native Method)
	at java.lang.ClassLoader.defineClass(ClassLoader.java:756)
	at java.security.SecureClassLoader.defineClass(SecureClassLoader.java:142)
	at java.net.URLClassLoader.defineClass(URLClassLoader.java:473)
	at java.net.URLClassLoader.access$100(URLClassLoader.java:74)
	at java.net.URLClassLoader$1.run(URLClassLoader.java:369)
	at java.net.URLClassLoader$1.run(URLClassLoader.java:363)
	at java.security.AccessController.doPrivileged(Native Method)
	at java.net.URLClassLoader.findClass(URLClassLoader.java:362)
	at org.codehaus.plexus.classworlds.realm.ClassRealm.loadClassFromSelf(ClassRealm.java:401)
	at org.codehaus.plexus.classworlds.strategy.SelfFirstStrategy.loadClass(SelfFirstStrategy.java:42)
	at org.codehaus.plexus.classworlds.realm.ClassRealm.unsynchronizedLoadClass(ClassRealm.java:271)
	at org.codehaus.plexus.classworlds.realm.ClassRealm.loadClass(ClassRealm.java:247)
	at org.codehaus.plexus.classworlds.realm.ClassRealm.loadClass(ClassRealm.java:239)
	at jenkins.maven3.agent.Maven33Main.main(Maven33Main.java:136)
	at jenkins.maven3.agent.Maven33Main.main(Maven33Main.java:66)
ERROR: Failed to parse POMs
java.io.EOFException: unexpected stream termination
	at hudson.remoting.ChannelBuilder.negotiate(ChannelBuilder.java:459)
	at hudson.remoting.ChannelBuilder.build(ChannelBuilder.java:404)
	at hudson.slaves.Channels.forProcess(Channels.java:121)
	at hudson.maven.AbstractMavenProcessFactory.newProcess(AbstractMavenProcessFactory.java:298)
	at hudson.maven.ProcessCache.get(ProcessCache.java:237)
	at hudson.maven.MavenModuleSetBuild$MavenModuleSetBuildExecution.doRun(MavenModuleSetBuild.java:802)
	at hudson.model.AbstractBuild$AbstractBuildExecution.run(AbstractBuild.java:526)
	at hudson.model.Run.execute(Run.java:1841)
	at hudson.maven.MavenModuleSetBuild.run(MavenModuleSetBuild.java:543)
	at hudson.model.ResourceController.execute(ResourceController.java:101)
	at hudson.model.Executor.run(Executor.java:442)

Build failed in Jenkins: DeltaSpike » DeltaSpike RAT-Check #98

Posted by Apache Jenkins Server <je...@builds.apache.org>.
See <https://ci-builds.apache.org/job/DeltaSpike/job/DeltaSpike%20RAT-Check/98/display/redirect?page=changes>

Changes:

[Thomas Andraschko] added workflow for integration testing


------------------------------------------
Started by an SCM change
Running as SYSTEM
[EnvInject] - Loading node environment variables.
Building remotely on builds59 (ubuntu) in workspace <https://ci-builds.apache.org/job/DeltaSpike/job/DeltaSpike%20RAT-Check/ws/>
The recommended git tool is: NONE
No credentials specified
Wiping out workspace first.
Cloning the remote Git repository
Cloning repository https://gitbox.apache.org/repos/asf/deltaspike.git
 > git init <https://ci-builds.apache.org/job/DeltaSpike/job/DeltaSpike%20RAT-Check/ws/> # timeout=10
Fetching upstream changes from https://gitbox.apache.org/repos/asf/deltaspike.git
 > git --version # timeout=10
 > git --version # 'git version 2.34.1'
 > git fetch --tags --force --progress -- https://gitbox.apache.org/repos/asf/deltaspike.git +refs/heads/*:refs/remotes/origin/* # timeout=10
 > git config remote.origin.url https://gitbox.apache.org/repos/asf/deltaspike.git # timeout=10
 > git config --add remote.origin.fetch +refs/heads/*:refs/remotes/origin/* # timeout=10
Avoid second fetch
 > git rev-parse origin/master^{commit} # timeout=10
Checking out Revision bca9f74e62d32fb95c9a3cbd74d7a47296659de7 (origin/master)
 > git config core.sparsecheckout # timeout=10
 > git checkout -f bca9f74e62d32fb95c9a3cbd74d7a47296659de7 # timeout=10
Commit message: "added workflow for integration testing"
 > git rev-list --no-walk 2330d6e7fb22175611e77b702167739baf267a67 # timeout=10
Parsing POMs
Modules changed, recalculating dependency graph
Established TCP socket on 45027
maven33-agent.jar already up to date
maven33-interceptor.jar already up to date
maven3-interceptor-commons.jar already up to date
[DeltaSpike RAT-Check] $ /home/jenkins/tools/java/latest1.8/bin/java -cp /home/jenkins/jenkins-agent/maven33-agent.jar:/home/jenkins/tools/maven/apache-maven-3.3.9/boot/plexus-classworlds-2.5.2.jar:/home/jenkins/tools/maven/apache-maven-3.3.9/conf/logging jenkins.maven3.agent.Maven33Main /home/jenkins/tools/maven/apache-maven-3.3.9 /home/jenkins/jenkins-agent/agent.jar /home/jenkins/jenkins-agent/maven33-interceptor.jar /home/jenkins/jenkins-agent/maven3-interceptor-commons.jar 45027
Exception in thread "main" java.lang.UnsupportedClassVersionError: hudson/remoting/Launcher has been compiled by a more recent version of the Java Runtime (class file version 55.0), this version of the Java Runtime only recognizes class file versions up to 52.0
	at java.lang.ClassLoader.defineClass1(Native Method)
	at java.lang.ClassLoader.defineClass(ClassLoader.java:756)
	at java.security.SecureClassLoader.defineClass(SecureClassLoader.java:142)
	at java.net.URLClassLoader.defineClass(URLClassLoader.java:473)
	at java.net.URLClassLoader.access$100(URLClassLoader.java:74)
	at java.net.URLClassLoader$1.run(URLClassLoader.java:369)
	at java.net.URLClassLoader$1.run(URLClassLoader.java:363)
	at java.security.AccessController.doPrivileged(Native Method)
	at java.net.URLClassLoader.findClass(URLClassLoader.java:362)
	at org.codehaus.plexus.classworlds.realm.ClassRealm.loadClassFromSelf(ClassRealm.java:401)
	at org.codehaus.plexus.classworlds.strategy.SelfFirstStrategy.loadClass(SelfFirstStrategy.java:42)
	at org.codehaus.plexus.classworlds.realm.ClassRealm.unsynchronizedLoadClass(ClassRealm.java:271)
	at org.codehaus.plexus.classworlds.realm.ClassRealm.loadClass(ClassRealm.java:247)
	at org.codehaus.plexus.classworlds.realm.ClassRealm.loadClass(ClassRealm.java:239)
	at jenkins.maven3.agent.Maven33Main.main(Maven33Main.java:136)
	at jenkins.maven3.agent.Maven33Main.main(Maven33Main.java:66)
ERROR: Failed to parse POMs
java.io.EOFException: unexpected stream termination
	at hudson.remoting.ChannelBuilder.negotiate(ChannelBuilder.java:459)
	at hudson.remoting.ChannelBuilder.build(ChannelBuilder.java:404)
	at hudson.slaves.Channels.forProcess(Channels.java:121)
	at hudson.maven.AbstractMavenProcessFactory.newProcess(AbstractMavenProcessFactory.java:298)
	at hudson.maven.ProcessCache.get(ProcessCache.java:237)
	at hudson.maven.MavenModuleSetBuild$MavenModuleSetBuildExecution.doRun(MavenModuleSetBuild.java:802)
	at hudson.model.AbstractBuild$AbstractBuildExecution.run(AbstractBuild.java:526)
	at hudson.model.Run.execute(Run.java:1841)
	at hudson.maven.MavenModuleSetBuild.run(MavenModuleSetBuild.java:543)
	at hudson.model.ResourceController.execute(ResourceController.java:101)
	at hudson.model.Executor.run(Executor.java:442)

Build failed in Jenkins: DeltaSpike » DeltaSpike RAT-Check #97

Posted by Apache Jenkins Server <je...@builds.apache.org>.
See <https://ci-builds.apache.org/job/DeltaSpike/job/DeltaSpike%20RAT-Check/97/display/redirect?page=changes>

Changes:

[Thomas Andraschko] added workflow for integration testing

[Thomas Andraschko] added workflow for integration testing


------------------------------------------
Started by an SCM change
Running as SYSTEM
[EnvInject] - Loading node environment variables.
Building remotely on builds59 (ubuntu) in workspace <https://ci-builds.apache.org/job/DeltaSpike/job/DeltaSpike%20RAT-Check/ws/>
The recommended git tool is: NONE
No credentials specified
Wiping out workspace first.
Cloning the remote Git repository
Cloning repository https://gitbox.apache.org/repos/asf/deltaspike.git
 > git init <https://ci-builds.apache.org/job/DeltaSpike/job/DeltaSpike%20RAT-Check/ws/> # timeout=10
Fetching upstream changes from https://gitbox.apache.org/repos/asf/deltaspike.git
 > git --version # timeout=10
 > git --version # 'git version 2.34.1'
 > git fetch --tags --force --progress -- https://gitbox.apache.org/repos/asf/deltaspike.git +refs/heads/*:refs/remotes/origin/* # timeout=10
 > git config remote.origin.url https://gitbox.apache.org/repos/asf/deltaspike.git # timeout=10
 > git config --add remote.origin.fetch +refs/heads/*:refs/remotes/origin/* # timeout=10
Avoid second fetch
 > git rev-parse origin/master^{commit} # timeout=10
Checking out Revision 2330d6e7fb22175611e77b702167739baf267a67 (origin/master)
 > git config core.sparsecheckout # timeout=10
 > git checkout -f 2330d6e7fb22175611e77b702167739baf267a67 # timeout=10
Commit message: "added workflow for integration testing"
 > git rev-list --no-walk 9593635888a78817f958304b63c3dda4d376d3b2 # timeout=10
Parsing POMs
Modules changed, recalculating dependency graph
Established TCP socket on 43679
maven33-agent.jar already up to date
maven33-interceptor.jar already up to date
maven3-interceptor-commons.jar already up to date
[DeltaSpike RAT-Check] $ /home/jenkins/tools/java/latest1.8/bin/java -cp /home/jenkins/jenkins-agent/maven33-agent.jar:/home/jenkins/tools/maven/apache-maven-3.3.9/boot/plexus-classworlds-2.5.2.jar:/home/jenkins/tools/maven/apache-maven-3.3.9/conf/logging jenkins.maven3.agent.Maven33Main /home/jenkins/tools/maven/apache-maven-3.3.9 /home/jenkins/jenkins-agent/agent.jar /home/jenkins/jenkins-agent/maven33-interceptor.jar /home/jenkins/jenkins-agent/maven3-interceptor-commons.jar 43679
Exception in thread "main" java.lang.UnsupportedClassVersionError: hudson/remoting/Launcher has been compiled by a more recent version of the Java Runtime (class file version 55.0), this version of the Java Runtime only recognizes class file versions up to 52.0
	at java.lang.ClassLoader.defineClass1(Native Method)
	at java.lang.ClassLoader.defineClass(ClassLoader.java:756)
	at java.security.SecureClassLoader.defineClass(SecureClassLoader.java:142)
	at java.net.URLClassLoader.defineClass(URLClassLoader.java:473)
	at java.net.URLClassLoader.access$100(URLClassLoader.java:74)
	at java.net.URLClassLoader$1.run(URLClassLoader.java:369)
	at java.net.URLClassLoader$1.run(URLClassLoader.java:363)
	at java.security.AccessController.doPrivileged(Native Method)
	at java.net.URLClassLoader.findClass(URLClassLoader.java:362)
	at org.codehaus.plexus.classworlds.realm.ClassRealm.loadClassFromSelf(ClassRealm.java:401)
	at org.codehaus.plexus.classworlds.strategy.SelfFirstStrategy.loadClass(SelfFirstStrategy.java:42)
	at org.codehaus.plexus.classworlds.realm.ClassRealm.unsynchronizedLoadClass(ClassRealm.java:271)
	at org.codehaus.plexus.classworlds.realm.ClassRealm.loadClass(ClassRealm.java:247)
	at org.codehaus.plexus.classworlds.realm.ClassRealm.loadClass(ClassRealm.java:239)
	at jenkins.maven3.agent.Maven33Main.main(Maven33Main.java:136)
	at jenkins.maven3.agent.Maven33Main.main(Maven33Main.java:66)
ERROR: Failed to parse POMs
java.io.EOFException: unexpected stream termination
	at hudson.remoting.ChannelBuilder.negotiate(ChannelBuilder.java:459)
	at hudson.remoting.ChannelBuilder.build(ChannelBuilder.java:404)
	at hudson.slaves.Channels.forProcess(Channels.java:121)
	at hudson.maven.AbstractMavenProcessFactory.newProcess(AbstractMavenProcessFactory.java:298)
	at hudson.maven.ProcessCache.get(ProcessCache.java:237)
	at hudson.maven.MavenModuleSetBuild$MavenModuleSetBuildExecution.doRun(MavenModuleSetBuild.java:802)
	at hudson.model.AbstractBuild$AbstractBuildExecution.run(AbstractBuild.java:526)
	at hudson.model.Run.execute(Run.java:1841)
	at hudson.maven.MavenModuleSetBuild.run(MavenModuleSetBuild.java:543)
	at hudson.model.ResourceController.execute(ResourceController.java:101)
	at hudson.model.Executor.run(Executor.java:442)

Build failed in Jenkins: DeltaSpike » DeltaSpike RAT-Check #96

Posted by Apache Jenkins Server <je...@builds.apache.org>.
See <https://ci-builds.apache.org/job/DeltaSpike/job/DeltaSpike%20RAT-Check/96/display/redirect?page=changes>

Changes:

[t.fruehbeck] Wildfly-31 wildfly-build-managed - BeansXmlUtil.discovery-mode=all - mostly working

[t.fruehbeck] JSF module test working


------------------------------------------
Started by an SCM change
Running as SYSTEM
[EnvInject] - Loading node environment variables.
Building remotely on builds36 (ubuntu) in workspace <https://ci-builds.apache.org/job/DeltaSpike/job/DeltaSpike%20RAT-Check/ws/>
The recommended git tool is: NONE
No credentials specified
Wiping out workspace first.
Cloning the remote Git repository
Cloning repository https://gitbox.apache.org/repos/asf/deltaspike.git
 > git init <https://ci-builds.apache.org/job/DeltaSpike/job/DeltaSpike%20RAT-Check/ws/> # timeout=10
Fetching upstream changes from https://gitbox.apache.org/repos/asf/deltaspike.git
 > git --version # timeout=10
 > git --version # 'git version 2.34.1'
 > git fetch --tags --force --progress -- https://gitbox.apache.org/repos/asf/deltaspike.git +refs/heads/*:refs/remotes/origin/* # timeout=10
 > git config remote.origin.url https://gitbox.apache.org/repos/asf/deltaspike.git # timeout=10
 > git config --add remote.origin.fetch +refs/heads/*:refs/remotes/origin/* # timeout=10
Avoid second fetch
 > git rev-parse origin/master^{commit} # timeout=10
Checking out Revision 9593635888a78817f958304b63c3dda4d376d3b2 (origin/master)
 > git config core.sparsecheckout # timeout=10
 > git checkout -f 9593635888a78817f958304b63c3dda4d376d3b2 # timeout=10
Commit message: "Merge pull request #151 from shadogray/master"
 > git rev-list --no-walk e38afd9da40e36769994c8568a2d6f0b16c9c315 # timeout=10
Parsing POMs
Modules changed, recalculating dependency graph
Established TCP socket on 33999
maven33-agent.jar already up to date
maven33-interceptor.jar already up to date
maven3-interceptor-commons.jar already up to date
[DeltaSpike RAT-Check] $ /home/jenkins/tools/java/latest1.8/bin/java -cp /home/jenkins/maven33-agent.jar:/home/jenkins/tools/maven/apache-maven-3.3.9/boot/plexus-classworlds-2.5.2.jar:/home/jenkins/tools/maven/apache-maven-3.3.9/conf/logging jenkins.maven3.agent.Maven33Main /home/jenkins/tools/maven/apache-maven-3.3.9 /home/jenkins/agent.jar /home/jenkins/maven33-interceptor.jar /home/jenkins/maven3-interceptor-commons.jar 33999
Exception in thread "main" java.lang.UnsupportedClassVersionError: hudson/remoting/Launcher has been compiled by a more recent version of the Java Runtime (class file version 55.0), this version of the Java Runtime only recognizes class file versions up to 52.0
	at java.lang.ClassLoader.defineClass1(Native Method)
	at java.lang.ClassLoader.defineClass(ClassLoader.java:756)
	at java.security.SecureClassLoader.defineClass(SecureClassLoader.java:142)
	at java.net.URLClassLoader.defineClass(URLClassLoader.java:473)
	at java.net.URLClassLoader.access$100(URLClassLoader.java:74)
	at java.net.URLClassLoader$1.run(URLClassLoader.java:369)
	at java.net.URLClassLoader$1.run(URLClassLoader.java:363)
	at java.security.AccessController.doPrivileged(Native Method)
	at java.net.URLClassLoader.findClass(URLClassLoader.java:362)
	at org.codehaus.plexus.classworlds.realm.ClassRealm.loadClassFromSelf(ClassRealm.java:401)
	at org.codehaus.plexus.classworlds.strategy.SelfFirstStrategy.loadClass(SelfFirstStrategy.java:42)
	at org.codehaus.plexus.classworlds.realm.ClassRealm.unsynchronizedLoadClass(ClassRealm.java:271)
	at org.codehaus.plexus.classworlds.realm.ClassRealm.loadClass(ClassRealm.java:247)
	at org.codehaus.plexus.classworlds.realm.ClassRealm.loadClass(ClassRealm.java:239)
	at jenkins.maven3.agent.Maven33Main.main(Maven33Main.java:136)
	at jenkins.maven3.agent.Maven33Main.main(Maven33Main.java:66)
ERROR: Failed to parse POMs
java.io.EOFException: unexpected stream termination
	at hudson.remoting.ChannelBuilder.negotiate(ChannelBuilder.java:459)
	at hudson.remoting.ChannelBuilder.build(ChannelBuilder.java:404)
	at hudson.slaves.Channels.forProcess(Channels.java:121)
	at hudson.maven.AbstractMavenProcessFactory.newProcess(AbstractMavenProcessFactory.java:298)
	at hudson.maven.ProcessCache.get(ProcessCache.java:237)
	at hudson.maven.MavenModuleSetBuild$MavenModuleSetBuildExecution.doRun(MavenModuleSetBuild.java:802)
	at hudson.model.AbstractBuild$AbstractBuildExecution.run(AbstractBuild.java:526)
	at hudson.model.Run.execute(Run.java:1841)
	at hudson.maven.MavenModuleSetBuild.run(MavenModuleSetBuild.java:543)
	at hudson.model.ResourceController.execute(ResourceController.java:101)
	at hudson.model.Executor.run(Executor.java:442)

Build failed in Jenkins: DeltaSpike » DeltaSpike RAT-Check #95

Posted by Apache Jenkins Server <je...@builds.apache.org>.
See <https://ci-builds.apache.org/job/DeltaSpike/job/DeltaSpike%20RAT-Check/95/display/redirect?page=changes>

Changes:

[Thomas Andraschko] fixed property


------------------------------------------
Started by an SCM change
Started by an SCM change
Started by an SCM change
Running as SYSTEM
[EnvInject] - Loading node environment variables.
Building remotely on builds43 (ubuntu) in workspace <https://ci-builds.apache.org/job/DeltaSpike/job/DeltaSpike%20RAT-Check/ws/>
The recommended git tool is: NONE
No credentials specified
Wiping out workspace first.
Cloning the remote Git repository
Cloning repository https://gitbox.apache.org/repos/asf/deltaspike.git
 > git init <https://ci-builds.apache.org/job/DeltaSpike/job/DeltaSpike%20RAT-Check/ws/> # timeout=10
Fetching upstream changes from https://gitbox.apache.org/repos/asf/deltaspike.git
 > git --version # timeout=10
 > git --version # 'git version 2.34.1'
 > git fetch --tags --force --progress -- https://gitbox.apache.org/repos/asf/deltaspike.git +refs/heads/*:refs/remotes/origin/* # timeout=10
 > git config remote.origin.url https://gitbox.apache.org/repos/asf/deltaspike.git # timeout=10
 > git config --add remote.origin.fetch +refs/heads/*:refs/remotes/origin/* # timeout=10
Avoid second fetch
 > git rev-parse origin/master^{commit} # timeout=10
Checking out Revision e38afd9da40e36769994c8568a2d6f0b16c9c315 (origin/master)
 > git config core.sparsecheckout # timeout=10
 > git checkout -f e38afd9da40e36769994c8568a2d6f0b16c9c315 # timeout=10
Commit message: "fixed property"
 > git rev-list --no-walk 861c140e0bf86814cbc77d2189d3fd1e6552dee7 # timeout=10
Parsing POMs
Modules changed, recalculating dependency graph
Established TCP socket on 37647
maven33-agent.jar already up to date
maven33-interceptor.jar already up to date
maven3-interceptor-commons.jar already up to date
[DeltaSpike RAT-Check] $ /home/jenkins/tools/java/latest1.8/bin/java -cp /home/jenkins/jenkins-agent/maven33-agent.jar:/home/jenkins/tools/maven/apache-maven-3.3.9/boot/plexus-classworlds-2.5.2.jar:/home/jenkins/tools/maven/apache-maven-3.3.9/conf/logging jenkins.maven3.agent.Maven33Main /home/jenkins/tools/maven/apache-maven-3.3.9 /home/jenkins/jenkins-agent/agent.jar /home/jenkins/jenkins-agent/maven33-interceptor.jar /home/jenkins/jenkins-agent/maven3-interceptor-commons.jar 37647
Exception in thread "main" java.lang.UnsupportedClassVersionError: hudson/remoting/Launcher has been compiled by a more recent version of the Java Runtime (class file version 55.0), this version of the Java Runtime only recognizes class file versions up to 52.0
	at java.lang.ClassLoader.defineClass1(Native Method)
	at java.lang.ClassLoader.defineClass(ClassLoader.java:756)
	at java.security.SecureClassLoader.defineClass(SecureClassLoader.java:142)
	at java.net.URLClassLoader.defineClass(URLClassLoader.java:473)
	at java.net.URLClassLoader.access$100(URLClassLoader.java:74)
	at java.net.URLClassLoader$1.run(URLClassLoader.java:369)
	at java.net.URLClassLoader$1.run(URLClassLoader.java:363)
	at java.security.AccessController.doPrivileged(Native Method)
	at java.net.URLClassLoader.findClass(URLClassLoader.java:362)
	at org.codehaus.plexus.classworlds.realm.ClassRealm.loadClassFromSelf(ClassRealm.java:401)
	at org.codehaus.plexus.classworlds.strategy.SelfFirstStrategy.loadClass(SelfFirstStrategy.java:42)
	at org.codehaus.plexus.classworlds.realm.ClassRealm.unsynchronizedLoadClass(ClassRealm.java:271)
	at org.codehaus.plexus.classworlds.realm.ClassRealm.loadClass(ClassRealm.java:247)
	at org.codehaus.plexus.classworlds.realm.ClassRealm.loadClass(ClassRealm.java:239)
	at jenkins.maven3.agent.Maven33Main.main(Maven33Main.java:136)
	at jenkins.maven3.agent.Maven33Main.main(Maven33Main.java:66)
ERROR: Failed to parse POMs
java.io.EOFException: unexpected stream termination
	at hudson.remoting.ChannelBuilder.negotiate(ChannelBuilder.java:459)
	at hudson.remoting.ChannelBuilder.build(ChannelBuilder.java:404)
	at hudson.slaves.Channels.forProcess(Channels.java:121)
	at hudson.maven.AbstractMavenProcessFactory.newProcess(AbstractMavenProcessFactory.java:298)
	at hudson.maven.ProcessCache.get(ProcessCache.java:237)
	at hudson.maven.MavenModuleSetBuild$MavenModuleSetBuildExecution.doRun(MavenModuleSetBuild.java:802)
	at hudson.model.AbstractBuild$AbstractBuildExecution.run(AbstractBuild.java:526)
	at hudson.model.Run.execute(Run.java:1841)
	at hudson.maven.MavenModuleSetBuild.run(MavenModuleSetBuild.java:543)
	at hudson.model.ResourceController.execute(ResourceController.java:101)
	at hudson.model.Executor.run(Executor.java:442)

Build failed in Jenkins: DeltaSpike » DeltaSpike RAT-Check #94

Posted by Apache Jenkins Server <je...@builds.apache.org>.
See <https://ci-builds.apache.org/job/DeltaSpike/job/DeltaSpike%20RAT-Check/94/display/redirect?page=changes>

Changes:

[Thomas Andraschko] try to fix transaction strategy


------------------------------------------
Started by an SCM change
Started by an SCM change
Running as SYSTEM
[EnvInject] - Loading node environment variables.
Building remotely on builds36 (ubuntu) in workspace <https://ci-builds.apache.org/job/DeltaSpike/job/DeltaSpike%20RAT-Check/ws/>
The recommended git tool is: NONE
No credentials specified
Wiping out workspace first.
Cloning the remote Git repository
Cloning repository https://gitbox.apache.org/repos/asf/deltaspike.git
 > git init <https://ci-builds.apache.org/job/DeltaSpike/job/DeltaSpike%20RAT-Check/ws/> # timeout=10
Fetching upstream changes from https://gitbox.apache.org/repos/asf/deltaspike.git
 > git --version # timeout=10
 > git --version # 'git version 2.34.1'
 > git fetch --tags --force --progress -- https://gitbox.apache.org/repos/asf/deltaspike.git +refs/heads/*:refs/remotes/origin/* # timeout=10
 > git config remote.origin.url https://gitbox.apache.org/repos/asf/deltaspike.git # timeout=10
 > git config --add remote.origin.fetch +refs/heads/*:refs/remotes/origin/* # timeout=10
Avoid second fetch
 > git rev-parse origin/master^{commit} # timeout=10
Checking out Revision 861c140e0bf86814cbc77d2189d3fd1e6552dee7 (origin/master)
 > git config core.sparsecheckout # timeout=10
 > git checkout -f 861c140e0bf86814cbc77d2189d3fd1e6552dee7 # timeout=10
Commit message: "try to fix transaction strategy"
 > git rev-list --no-walk 8bd220b1b8ddc015651d1700701c51567888b120 # timeout=10
Parsing POMs
Downloaded artifact https://repo.maven.apache.org/maven2/org/jboss/arquillian/arquillian-bom/1.8.0.Final/arquillian-bom-1.8.0.Final.pom
Downloaded artifact https://repo.maven.apache.org/maven2/org/jboss/weld/weld-core-bom/5.1.2.Final/weld-core-bom-5.1.2.Final.pom
Modules changed, recalculating dependency graph
Established TCP socket on 38797
maven33-agent.jar already up to date
maven33-interceptor.jar already up to date
maven3-interceptor-commons.jar already up to date
[DeltaSpike RAT-Check] $ /home/jenkins/tools/java/latest1.8/bin/java -cp /home/jenkins/maven33-agent.jar:/home/jenkins/tools/maven/apache-maven-3.3.9/boot/plexus-classworlds-2.5.2.jar:/home/jenkins/tools/maven/apache-maven-3.3.9/conf/logging jenkins.maven3.agent.Maven33Main /home/jenkins/tools/maven/apache-maven-3.3.9 /home/jenkins/agent.jar /home/jenkins/maven33-interceptor.jar /home/jenkins/maven3-interceptor-commons.jar 38797
Exception in thread "main" java.lang.UnsupportedClassVersionError: hudson/remoting/Launcher has been compiled by a more recent version of the Java Runtime (class file version 55.0), this version of the Java Runtime only recognizes class file versions up to 52.0
	at java.lang.ClassLoader.defineClass1(Native Method)
	at java.lang.ClassLoader.defineClass(ClassLoader.java:756)
	at java.security.SecureClassLoader.defineClass(SecureClassLoader.java:142)
	at java.net.URLClassLoader.defineClass(URLClassLoader.java:473)
	at java.net.URLClassLoader.access$100(URLClassLoader.java:74)
	at java.net.URLClassLoader$1.run(URLClassLoader.java:369)
	at java.net.URLClassLoader$1.run(URLClassLoader.java:363)
	at java.security.AccessController.doPrivileged(Native Method)
	at java.net.URLClassLoader.findClass(URLClassLoader.java:362)
	at org.codehaus.plexus.classworlds.realm.ClassRealm.loadClassFromSelf(ClassRealm.java:401)
	at org.codehaus.plexus.classworlds.strategy.SelfFirstStrategy.loadClass(SelfFirstStrategy.java:42)
	at org.codehaus.plexus.classworlds.realm.ClassRealm.unsynchronizedLoadClass(ClassRealm.java:271)
	at org.codehaus.plexus.classworlds.realm.ClassRealm.loadClass(ClassRealm.java:247)
	at org.codehaus.plexus.classworlds.realm.ClassRealm.loadClass(ClassRealm.java:239)
	at jenkins.maven3.agent.Maven33Main.main(Maven33Main.java:136)
	at jenkins.maven3.agent.Maven33Main.main(Maven33Main.java:66)
ERROR: Failed to parse POMs
java.io.EOFException: unexpected stream termination
	at hudson.remoting.ChannelBuilder.negotiate(ChannelBuilder.java:459)
	at hudson.remoting.ChannelBuilder.build(ChannelBuilder.java:404)
	at hudson.slaves.Channels.forProcess(Channels.java:121)
	at hudson.maven.AbstractMavenProcessFactory.newProcess(AbstractMavenProcessFactory.java:298)
	at hudson.maven.ProcessCache.get(ProcessCache.java:237)
	at hudson.maven.MavenModuleSetBuild$MavenModuleSetBuildExecution.doRun(MavenModuleSetBuild.java:802)
	at hudson.model.AbstractBuild$AbstractBuildExecution.run(AbstractBuild.java:526)
	at hudson.model.Run.execute(Run.java:1841)
	at hudson.maven.MavenModuleSetBuild.run(MavenModuleSetBuild.java:543)
	at hudson.model.ResourceController.execute(ResourceController.java:101)
	at hudson.model.Executor.run(Executor.java:442)

Build failed in Jenkins: DeltaSpike » DeltaSpike RAT-Check #93

Posted by Apache Jenkins Server <je...@builds.apache.org>.
See <https://ci-builds.apache.org/job/DeltaSpike/job/DeltaSpike%20RAT-Check/93/display/redirect?page=changes>

Changes:

[Thomas Andraschko] fixed ExtendedRepositoryAbstractIntermediate testcase

[Thomas Andraschko] missing scope


------------------------------------------
Started by an SCM change
Running as SYSTEM
[EnvInject] - Loading node environment variables.
Building remotely on EC2 (ec2-Jenkins Ephemeral Node User-CLI) - Jenkins Ephemeral Node - ubuntu label (i-03f890e4440ffc5d8) (ubuntu ephemeral) in workspace <https://ci-builds.apache.org/job/DeltaSpike/job/DeltaSpike%20RAT-Check/ws/>
The recommended git tool is: NONE
No credentials specified
Wiping out workspace first.
Cloning the remote Git repository
Cloning repository https://gitbox.apache.org/repos/asf/deltaspike.git
 > git init <https://ci-builds.apache.org/job/DeltaSpike/job/DeltaSpike%20RAT-Check/ws/> # timeout=10
Fetching upstream changes from https://gitbox.apache.org/repos/asf/deltaspike.git
 > git --version # timeout=10
 > git --version # 'git version 2.34.1'
 > git fetch --tags --force --progress -- https://gitbox.apache.org/repos/asf/deltaspike.git +refs/heads/*:refs/remotes/origin/* # timeout=10
 > git config remote.origin.url https://gitbox.apache.org/repos/asf/deltaspike.git # timeout=10
 > git config --add remote.origin.fetch +refs/heads/*:refs/remotes/origin/* # timeout=10
Avoid second fetch
 > git rev-parse origin/master^{commit} # timeout=10
Checking out Revision 8bd220b1b8ddc015651d1700701c51567888b120 (origin/master)
 > git config core.sparsecheckout # timeout=10
 > git checkout -f 8bd220b1b8ddc015651d1700701c51567888b120 # timeout=10
Commit message: "missing scope"
 > git rev-list --no-walk 77ca7fe9ff74dcf89197a60a21d1c0dd0862f515 # timeout=10
Parsing POMs
Downloaded artifact https://repo.maven.apache.org/maven2/org/jboss/arquillian/arquillian-bom/1.8.0.Final/arquillian-bom-1.8.0.Final.pom
Downloaded artifact https://repo.maven.apache.org/maven2/org/jboss/shrinkwrap/resolver/shrinkwrap-resolver-bom/3.2.1/shrinkwrap-resolver-bom-3.2.1.pom
Downloaded artifact https://repo.maven.apache.org/maven2/org/apache/maven/maven/3.9.3/maven-3.9.3.pom
Downloaded artifact https://repo.maven.apache.org/maven2/org/jboss/weld/weld-core-bom/5.1.2.Final/weld-core-bom-5.1.2.Final.pom
Downloaded artifact https://repo.maven.apache.org/maven2/org/jboss/weld/weld-api-bom/5.0.SP3/weld-api-bom-5.0.SP3.pom
Modules changed, recalculating dependency graph
Established TCP socket on 46147
Copied maven33-agent.jar
Copied maven33-interceptor.jar
maven3-interceptor-commons.jar already up to date
[DeltaSpike RAT-Check] $ /home/jenkins/tools/java/latest1.8/bin/java -cp /home/jenkins/maven33-agent.jar:/home/jenkins/tools/maven/apache-maven-3.3.9/boot/plexus-classworlds-2.5.2.jar:/home/jenkins/tools/maven/apache-maven-3.3.9/conf/logging jenkins.maven3.agent.Maven33Main /home/jenkins/tools/maven/apache-maven-3.3.9 /tmp/remoting.jar /home/jenkins/maven33-interceptor.jar /home/jenkins/maven3-interceptor-commons.jar 46147
Exception in thread "main" java.lang.UnsupportedClassVersionError: hudson/remoting/Launcher has been compiled by a more recent version of the Java Runtime (class file version 55.0), this version of the Java Runtime only recognizes class file versions up to 52.0
	at java.lang.ClassLoader.defineClass1(Native Method)
	at java.lang.ClassLoader.defineClass(ClassLoader.java:756)
	at java.security.SecureClassLoader.defineClass(SecureClassLoader.java:142)
	at java.net.URLClassLoader.defineClass(URLClassLoader.java:473)
	at java.net.URLClassLoader.access$100(URLClassLoader.java:74)
	at java.net.URLClassLoader$1.run(URLClassLoader.java:369)
	at java.net.URLClassLoader$1.run(URLClassLoader.java:363)
	at java.security.AccessController.doPrivileged(Native Method)
	at java.net.URLClassLoader.findClass(URLClassLoader.java:362)
	at org.codehaus.plexus.classworlds.realm.ClassRealm.loadClassFromSelf(ClassRealm.java:401)
	at org.codehaus.plexus.classworlds.strategy.SelfFirstStrategy.loadClass(SelfFirstStrategy.java:42)
	at org.codehaus.plexus.classworlds.realm.ClassRealm.unsynchronizedLoadClass(ClassRealm.java:271)
	at org.codehaus.plexus.classworlds.realm.ClassRealm.loadClass(ClassRealm.java:247)
	at org.codehaus.plexus.classworlds.realm.ClassRealm.loadClass(ClassRealm.java:239)
	at jenkins.maven3.agent.Maven33Main.main(Maven33Main.java:136)
	at jenkins.maven3.agent.Maven33Main.main(Maven33Main.java:66)
ERROR: Failed to parse POMs
java.io.EOFException: unexpected stream termination
	at hudson.remoting.ChannelBuilder.negotiate(ChannelBuilder.java:459)
	at hudson.remoting.ChannelBuilder.build(ChannelBuilder.java:404)
	at hudson.slaves.Channels.forProcess(Channels.java:121)
	at hudson.maven.AbstractMavenProcessFactory.newProcess(AbstractMavenProcessFactory.java:298)
	at hudson.maven.ProcessCache.get(ProcessCache.java:237)
	at hudson.maven.MavenModuleSetBuild$MavenModuleSetBuildExecution.doRun(MavenModuleSetBuild.java:802)
	at hudson.model.AbstractBuild$AbstractBuildExecution.run(AbstractBuild.java:526)
	at hudson.model.Run.execute(Run.java:1841)
	at hudson.maven.MavenModuleSetBuild.run(MavenModuleSetBuild.java:543)
	at hudson.model.ResourceController.execute(ResourceController.java:101)
	at hudson.model.Executor.run(Executor.java:442)

Build failed in Jenkins: DeltaSpike » DeltaSpike RAT-Check #92

Posted by Apache Jenkins Server <je...@builds.apache.org>.
See <https://ci-builds.apache.org/job/DeltaSpike/job/DeltaSpike%20RAT-Check/92/display/redirect?page=changes>

Changes:

[Thomas Andraschko] try to fix arquillian tests; tomee-build-managed works

[Thomas Andraschko] fixed payara-build-managed and try to fix payara-embedded

[Thomas Andraschko] arquillian progress


------------------------------------------
Started by an SCM change
Running as SYSTEM
[EnvInject] - Loading node environment variables.
Building remotely on EC2 (ec2-Jenkins Ephemeral Node User-CLI) - Jenkins Ephemeral Node - ubuntu label (i-041e445dc907413b8) (ubuntu ephemeral) in workspace <https://ci-builds.apache.org/job/DeltaSpike/job/DeltaSpike%20RAT-Check/ws/>
The recommended git tool is: NONE
No credentials specified
Wiping out workspace first.
Cloning the remote Git repository
Cloning repository https://gitbox.apache.org/repos/asf/deltaspike.git
 > git init <https://ci-builds.apache.org/job/DeltaSpike/job/DeltaSpike%20RAT-Check/ws/> # timeout=10
Fetching upstream changes from https://gitbox.apache.org/repos/asf/deltaspike.git
 > git --version # timeout=10
 > git --version # 'git version 2.34.1'
 > git fetch --tags --force --progress -- https://gitbox.apache.org/repos/asf/deltaspike.git +refs/heads/*:refs/remotes/origin/* # timeout=10
 > git config remote.origin.url https://gitbox.apache.org/repos/asf/deltaspike.git # timeout=10
 > git config --add remote.origin.fetch +refs/heads/*:refs/remotes/origin/* # timeout=10
Avoid second fetch
 > git rev-parse origin/master^{commit} # timeout=10
Checking out Revision 77ca7fe9ff74dcf89197a60a21d1c0dd0862f515 (origin/master)
 > git config core.sparsecheckout # timeout=10
 > git checkout -f 77ca7fe9ff74dcf89197a60a21d1c0dd0862f515 # timeout=10
Commit message: "arquillian progress"
 > git rev-list --no-walk dd5c82fda938ec59edd8053066517a01aa82894a # timeout=10
Parsing POMs
Downloaded artifact https://repo.maven.apache.org/maven2/org/jboss/arquillian/arquillian-bom/1.8.0.Final/arquillian-bom-1.8.0.Final.pom
Downloaded artifact https://repo.maven.apache.org/maven2/org/jboss/shrinkwrap/resolver/shrinkwrap-resolver-bom/3.2.1/shrinkwrap-resolver-bom-3.2.1.pom
Downloaded artifact https://repo.maven.apache.org/maven2/org/apache/maven/maven/3.9.3/maven-3.9.3.pom
Downloaded artifact https://repo.maven.apache.org/maven2/org/jboss/weld/weld-core-bom/5.1.2.Final/weld-core-bom-5.1.2.Final.pom
Downloaded artifact https://repo.maven.apache.org/maven2/org/jboss/weld/weld-api-bom/5.0.SP3/weld-api-bom-5.0.SP3.pom
Modules changed, recalculating dependency graph
Established TCP socket on 36423
Copied maven33-agent.jar
Copied maven33-interceptor.jar
maven3-interceptor-commons.jar already up to date
[DeltaSpike RAT-Check] $ /home/jenkins/tools/java/latest1.8/bin/java -cp /home/jenkins/maven33-agent.jar:/home/jenkins/tools/maven/apache-maven-3.3.9/boot/plexus-classworlds-2.5.2.jar:/home/jenkins/tools/maven/apache-maven-3.3.9/conf/logging jenkins.maven3.agent.Maven33Main /home/jenkins/tools/maven/apache-maven-3.3.9 /tmp/remoting.jar /home/jenkins/maven33-interceptor.jar /home/jenkins/maven3-interceptor-commons.jar 36423
Exception in thread "main" java.lang.UnsupportedClassVersionError: hudson/remoting/Launcher has been compiled by a more recent version of the Java Runtime (class file version 55.0), this version of the Java Runtime only recognizes class file versions up to 52.0
	at java.lang.ClassLoader.defineClass1(Native Method)
	at java.lang.ClassLoader.defineClass(ClassLoader.java:756)
	at java.security.SecureClassLoader.defineClass(SecureClassLoader.java:142)
	at java.net.URLClassLoader.defineClass(URLClassLoader.java:473)
	at java.net.URLClassLoader.access$100(URLClassLoader.java:74)
	at java.net.URLClassLoader$1.run(URLClassLoader.java:369)
	at java.net.URLClassLoader$1.run(URLClassLoader.java:363)
	at java.security.AccessController.doPrivileged(Native Method)
	at java.net.URLClassLoader.findClass(URLClassLoader.java:362)
	at org.codehaus.plexus.classworlds.realm.ClassRealm.loadClassFromSelf(ClassRealm.java:401)
	at org.codehaus.plexus.classworlds.strategy.SelfFirstStrategy.loadClass(SelfFirstStrategy.java:42)
	at org.codehaus.plexus.classworlds.realm.ClassRealm.unsynchronizedLoadClass(ClassRealm.java:271)
	at org.codehaus.plexus.classworlds.realm.ClassRealm.loadClass(ClassRealm.java:247)
	at org.codehaus.plexus.classworlds.realm.ClassRealm.loadClass(ClassRealm.java:239)
	at jenkins.maven3.agent.Maven33Main.main(Maven33Main.java:136)
	at jenkins.maven3.agent.Maven33Main.main(Maven33Main.java:66)
ERROR: Failed to parse POMs
java.io.EOFException: unexpected stream termination
	at hudson.remoting.ChannelBuilder.negotiate(ChannelBuilder.java:459)
	at hudson.remoting.ChannelBuilder.build(ChannelBuilder.java:404)
	at hudson.slaves.Channels.forProcess(Channels.java:121)
	at hudson.maven.AbstractMavenProcessFactory.newProcess(AbstractMavenProcessFactory.java:298)
	at hudson.maven.ProcessCache.get(ProcessCache.java:237)
	at hudson.maven.MavenModuleSetBuild$MavenModuleSetBuildExecution.doRun(MavenModuleSetBuild.java:802)
	at hudson.model.AbstractBuild$AbstractBuildExecution.run(AbstractBuild.java:526)
	at hudson.model.Run.execute(Run.java:1841)
	at hudson.maven.MavenModuleSetBuild.run(MavenModuleSetBuild.java:543)
	at hudson.model.ResourceController.execute(ResourceController.java:101)
	at hudson.model.Executor.run(Executor.java:442)

Build failed in Jenkins: DeltaSpike » DeltaSpike RAT-Check #91

Posted by Apache Jenkins Server <je...@builds.apache.org>.
See <https://ci-builds.apache.org/job/DeltaSpike/job/DeltaSpike%20RAT-Check/91/display/redirect?page=changes>

Changes:

[t.fruehbeck] Arquillian.protocol to jakarta,6.0 - TestCase for Failure on generic abstract repository


------------------------------------------
Started by an SCM change
Running as SYSTEM
[EnvInject] - Loading node environment variables.
Building remotely on builds59 (ubuntu) in workspace <https://ci-builds.apache.org/job/DeltaSpike/job/DeltaSpike%20RAT-Check/ws/>
The recommended git tool is: NONE
No credentials specified
Wiping out workspace first.
Cloning the remote Git repository
Cloning repository https://gitbox.apache.org/repos/asf/deltaspike.git
 > git init <https://ci-builds.apache.org/job/DeltaSpike/job/DeltaSpike%20RAT-Check/ws/> # timeout=10
Fetching upstream changes from https://gitbox.apache.org/repos/asf/deltaspike.git
 > git --version # timeout=10
 > git --version # 'git version 2.34.1'
 > git fetch --tags --force --progress -- https://gitbox.apache.org/repos/asf/deltaspike.git +refs/heads/*:refs/remotes/origin/* # timeout=10
 > git config remote.origin.url https://gitbox.apache.org/repos/asf/deltaspike.git # timeout=10
 > git config --add remote.origin.fetch +refs/heads/*:refs/remotes/origin/* # timeout=10
Avoid second fetch
 > git rev-parse origin/master^{commit} # timeout=10
Checking out Revision dd5c82fda938ec59edd8053066517a01aa82894a (origin/master)
 > git config core.sparsecheckout # timeout=10
 > git checkout -f dd5c82fda938ec59edd8053066517a01aa82894a # timeout=10
Commit message: "Merge pull request #150 from shadogray/master"
 > git rev-list --no-walk 00af44c5696f7546950b235bcb9d49b0b3051db3 # timeout=10
Parsing POMs
Modules changed, recalculating dependency graph
Established TCP socket on 38975
maven33-agent.jar already up to date
maven33-interceptor.jar already up to date
maven3-interceptor-commons.jar already up to date
[DeltaSpike RAT-Check] $ /home/jenkins/tools/java/latest1.8/bin/java -cp /home/jenkins/jenkins-agent/maven33-agent.jar:/home/jenkins/tools/maven/apache-maven-3.3.9/boot/plexus-classworlds-2.5.2.jar:/home/jenkins/tools/maven/apache-maven-3.3.9/conf/logging jenkins.maven3.agent.Maven33Main /home/jenkins/tools/maven/apache-maven-3.3.9 /home/jenkins/jenkins-agent/agent.jar /home/jenkins/jenkins-agent/maven33-interceptor.jar /home/jenkins/jenkins-agent/maven3-interceptor-commons.jar 38975
Exception in thread "main" java.lang.UnsupportedClassVersionError: hudson/remoting/Launcher has been compiled by a more recent version of the Java Runtime (class file version 55.0), this version of the Java Runtime only recognizes class file versions up to 52.0
	at java.lang.ClassLoader.defineClass1(Native Method)
	at java.lang.ClassLoader.defineClass(ClassLoader.java:756)
	at java.security.SecureClassLoader.defineClass(SecureClassLoader.java:142)
	at java.net.URLClassLoader.defineClass(URLClassLoader.java:473)
	at java.net.URLClassLoader.access$100(URLClassLoader.java:74)
	at java.net.URLClassLoader$1.run(URLClassLoader.java:369)
	at java.net.URLClassLoader$1.run(URLClassLoader.java:363)
	at java.security.AccessController.doPrivileged(Native Method)
	at java.net.URLClassLoader.findClass(URLClassLoader.java:362)
	at org.codehaus.plexus.classworlds.realm.ClassRealm.loadClassFromSelf(ClassRealm.java:401)
	at org.codehaus.plexus.classworlds.strategy.SelfFirstStrategy.loadClass(SelfFirstStrategy.java:42)
	at org.codehaus.plexus.classworlds.realm.ClassRealm.unsynchronizedLoadClass(ClassRealm.java:271)
	at org.codehaus.plexus.classworlds.realm.ClassRealm.loadClass(ClassRealm.java:247)
	at org.codehaus.plexus.classworlds.realm.ClassRealm.loadClass(ClassRealm.java:239)
	at jenkins.maven3.agent.Maven33Main.main(Maven33Main.java:136)
	at jenkins.maven3.agent.Maven33Main.main(Maven33Main.java:66)
ERROR: Failed to parse POMs
java.io.EOFException: unexpected stream termination
	at hudson.remoting.ChannelBuilder.negotiate(ChannelBuilder.java:459)
	at hudson.remoting.ChannelBuilder.build(ChannelBuilder.java:404)
	at hudson.slaves.Channels.forProcess(Channels.java:121)
	at hudson.maven.AbstractMavenProcessFactory.newProcess(AbstractMavenProcessFactory.java:298)
	at hudson.maven.ProcessCache.get(ProcessCache.java:237)
	at hudson.maven.MavenModuleSetBuild$MavenModuleSetBuildExecution.doRun(MavenModuleSetBuild.java:802)
	at hudson.model.AbstractBuild$AbstractBuildExecution.run(AbstractBuild.java:526)
	at hudson.model.Run.execute(Run.java:1841)
	at hudson.maven.MavenModuleSetBuild.run(MavenModuleSetBuild.java:543)
	at hudson.model.ResourceController.execute(ResourceController.java:101)
	at hudson.model.Executor.run(Executor.java:442)

Build failed in Jenkins: DeltaSpike » DeltaSpike RAT-Check #90

Posted by Apache Jenkins Server <je...@builds.apache.org>.
See <https://ci-builds.apache.org/job/DeltaSpike/job/DeltaSpike%20RAT-Check/90/display/redirect?page=changes>

Changes:

[t.fruehbeck] Weld5 - add Dependent scope to @Repository, skip intermediate generic repositories

[t.fruehbeck] Migrate to Node.20

[Thomas Andraschko] fixed build

[github] Revert "Weld5 - add Dependent scope to @Repository, skip intermediate generic…"


------------------------------------------
Started by an SCM change
Started by an SCM change
Running as SYSTEM
[EnvInject] - Loading node environment variables.
Building remotely on EC2 (ec2-Jenkins Ephemeral Node User-CLI) - Jenkins Ephemeral Node - ubuntu label (i-0f6598c1c15379ffe) (ubuntu ephemeral) in workspace <https://ci-builds.apache.org/job/DeltaSpike/job/DeltaSpike%20RAT-Check/ws/>
The recommended git tool is: NONE
No credentials specified
Wiping out workspace first.
Cloning the remote Git repository
Cloning repository https://gitbox.apache.org/repos/asf/deltaspike.git
 > git init <https://ci-builds.apache.org/job/DeltaSpike/job/DeltaSpike%20RAT-Check/ws/> # timeout=10
Fetching upstream changes from https://gitbox.apache.org/repos/asf/deltaspike.git
 > git --version # timeout=10
 > git --version # 'git version 2.34.1'
 > git fetch --tags --force --progress -- https://gitbox.apache.org/repos/asf/deltaspike.git +refs/heads/*:refs/remotes/origin/* # timeout=10
 > git config remote.origin.url https://gitbox.apache.org/repos/asf/deltaspike.git # timeout=10
 > git config --add remote.origin.fetch +refs/heads/*:refs/remotes/origin/* # timeout=10
Avoid second fetch
 > git rev-parse origin/master^{commit} # timeout=10
Checking out Revision 00af44c5696f7546950b235bcb9d49b0b3051db3 (origin/master)
 > git config core.sparsecheckout # timeout=10
 > git checkout -f 00af44c5696f7546950b235bcb9d49b0b3051db3 # timeout=10
Commit message: "Merge pull request #148 from apache/revert-147-master"
 > git rev-list --no-walk 149dd8083bc98a8e42bb763c6bc741c014309725 # timeout=10
Parsing POMs
Downloaded artifact https://repo.maven.apache.org/maven2/org/jboss/arquillian/arquillian-bom/1.7.1.Final/arquillian-bom-1.7.1.Final.pom
Downloaded artifact https://repo.maven.apache.org/maven2/org/jboss/shrinkwrap/shrinkwrap-bom/1.2.6/shrinkwrap-bom-1.2.6.pom
Downloaded artifact https://repo.maven.apache.org/maven2/org/jboss/shrinkwrap/resolver/shrinkwrap-resolver-bom/3.1.4/shrinkwrap-resolver-bom-3.1.4.pom
Downloaded artifact https://repo.maven.apache.org/maven2/org/apache/maven/maven/3.6.3/maven-3.6.3.pom
Downloaded artifact https://repo.maven.apache.org/maven2/org/jboss/shrinkwrap/descriptors/shrinkwrap-descriptors-bom/2.0.0/shrinkwrap-descriptors-bom-2.0.0.pom
Downloaded artifact https://repo.maven.apache.org/maven2/org/jboss/weld/weld-core-bom/5.0.1.Final/weld-core-bom-5.0.1.Final.pom
Downloaded artifact https://repo.maven.apache.org/maven2/org/jboss/weld/weld-api-bom/5.0.SP2/weld-api-bom-5.0.SP2.pom
Downloaded artifact https://repo.maven.apache.org/maven2/org/jboss/shrinkwrap/resolver/shrinkwrap-resolver-bom/3.2.1/shrinkwrap-resolver-bom-3.2.1.pom
Downloaded artifact https://repo.maven.apache.org/maven2/org/apache/maven/maven/3.9.3/maven-3.9.3.pom
Modules changed, recalculating dependency graph
Established TCP socket on 37357
maven33-agent.jar already up to date
maven33-interceptor.jar already up to date
maven3-interceptor-commons.jar already up to date
[DeltaSpike RAT-Check] $ /home/jenkins/tools/java/latest1.8/bin/java -cp /home/jenkins/maven33-agent.jar:/home/jenkins/tools/maven/apache-maven-3.3.9/boot/plexus-classworlds-2.5.2.jar:/home/jenkins/tools/maven/apache-maven-3.3.9/conf/logging jenkins.maven3.agent.Maven33Main /home/jenkins/tools/maven/apache-maven-3.3.9 /tmp/remoting.jar /home/jenkins/maven33-interceptor.jar /home/jenkins/maven3-interceptor-commons.jar 37357
Exception in thread "main" java.lang.UnsupportedClassVersionError: hudson/remoting/Launcher has been compiled by a more recent version of the Java Runtime (class file version 55.0), this version of the Java Runtime only recognizes class file versions up to 52.0
	at java.lang.ClassLoader.defineClass1(Native Method)
	at java.lang.ClassLoader.defineClass(ClassLoader.java:756)
	at java.security.SecureClassLoader.defineClass(SecureClassLoader.java:142)
	at java.net.URLClassLoader.defineClass(URLClassLoader.java:473)
	at java.net.URLClassLoader.access$100(URLClassLoader.java:74)
	at java.net.URLClassLoader$1.run(URLClassLoader.java:369)
	at java.net.URLClassLoader$1.run(URLClassLoader.java:363)
	at java.security.AccessController.doPrivileged(Native Method)
	at java.net.URLClassLoader.findClass(URLClassLoader.java:362)
	at org.codehaus.plexus.classworlds.realm.ClassRealm.loadClassFromSelf(ClassRealm.java:401)
	at org.codehaus.plexus.classworlds.strategy.SelfFirstStrategy.loadClass(SelfFirstStrategy.java:42)
	at org.codehaus.plexus.classworlds.realm.ClassRealm.unsynchronizedLoadClass(ClassRealm.java:271)
	at org.codehaus.plexus.classworlds.realm.ClassRealm.loadClass(ClassRealm.java:247)
	at org.codehaus.plexus.classworlds.realm.ClassRealm.loadClass(ClassRealm.java:239)
	at jenkins.maven3.agent.Maven33Main.main(Maven33Main.java:136)
	at jenkins.maven3.agent.Maven33Main.main(Maven33Main.java:66)
ERROR: Failed to parse POMs
java.io.EOFException: unexpected stream termination
	at hudson.remoting.ChannelBuilder.negotiate(ChannelBuilder.java:459)
	at hudson.remoting.ChannelBuilder.build(ChannelBuilder.java:404)
	at hudson.slaves.Channels.forProcess(Channels.java:121)
	at hudson.maven.AbstractMavenProcessFactory.newProcess(AbstractMavenProcessFactory.java:298)
	at hudson.maven.ProcessCache.get(ProcessCache.java:237)
	at hudson.maven.MavenModuleSetBuild$MavenModuleSetBuildExecution.doRun(MavenModuleSetBuild.java:802)
	at hudson.model.AbstractBuild$AbstractBuildExecution.run(AbstractBuild.java:526)
	at hudson.model.Run.execute(Run.java:1841)
	at hudson.maven.MavenModuleSetBuild.run(MavenModuleSetBuild.java:543)
	at hudson.model.ResourceController.execute(ResourceController.java:101)
	at hudson.model.Executor.run(Executor.java:442)

Build failed in Jenkins: DeltaSpike » DeltaSpike RAT-Check #89

Posted by Apache Jenkins Server <je...@builds.apache.org>.
See <https://ci-builds.apache.org/job/DeltaSpike/job/DeltaSpike%20RAT-Check/89/display/redirect?page=changes>

Changes:

[t.fruehbeck] reenable examples

[t.fruehbeck] move to TomEE-10-SNAPSHOT

[t.fruehbeck] move TomEE-API to 10.0-M2

[t.fruehbeck] revert example dependencies to project.version


------------------------------------------
Started by an SCM change
Running as SYSTEM
[EnvInject] - Loading node environment variables.
Building remotely on builds38 (ubuntu) in workspace <https://ci-builds.apache.org/job/DeltaSpike/job/DeltaSpike%20RAT-Check/ws/>
The recommended git tool is: NONE
No credentials specified
Wiping out workspace first.
Cloning the remote Git repository
Cloning repository https://gitbox.apache.org/repos/asf/deltaspike.git
 > git init <https://ci-builds.apache.org/job/DeltaSpike/job/DeltaSpike%20RAT-Check/ws/> # timeout=10
Fetching upstream changes from https://gitbox.apache.org/repos/asf/deltaspike.git
 > git --version # timeout=10
 > git --version # 'git version 2.34.1'
 > git fetch --tags --force --progress -- https://gitbox.apache.org/repos/asf/deltaspike.git +refs/heads/*:refs/remotes/origin/* # timeout=10
 > git config remote.origin.url https://gitbox.apache.org/repos/asf/deltaspike.git # timeout=10
 > git config --add remote.origin.fetch +refs/heads/*:refs/remotes/origin/* # timeout=10
Avoid second fetch
 > git rev-parse origin/master^{commit} # timeout=10
Checking out Revision 149dd8083bc98a8e42bb763c6bc741c014309725 (origin/master)
 > git config core.sparsecheckout # timeout=10
 > git checkout -f 149dd8083bc98a8e42bb763c6bc741c014309725 # timeout=10
Commit message: "Merge pull request #146 from shadogray/master"
 > git rev-list --no-walk fbf2a4974a861eab97207336d09567f32f1bd337 # timeout=10
Parsing POMs
Downloaded artifact https://repo.maven.apache.org/maven2/org/jboss/weld/weld-core-bom/5.0.1.Final/weld-core-bom-5.0.1.Final.pom
Downloaded artifact https://repo.maven.apache.org/maven2/org/jboss/weld/weld-api-bom/5.0.SP2/weld-api-bom-5.0.SP2.pom
Modules changed, recalculating dependency graph
Established TCP socket on 36283
maven33-agent.jar already up to date
maven33-interceptor.jar already up to date
maven3-interceptor-commons.jar already up to date
[DeltaSpike RAT-Check] $ /home/jenkins/tools/java/latest1.8/bin/java -cp /home/jenkins/jenkins-agent/maven33-agent.jar:/home/jenkins/tools/maven/apache-maven-3.3.9/boot/plexus-classworlds-2.5.2.jar:/home/jenkins/tools/maven/apache-maven-3.3.9/conf/logging jenkins.maven3.agent.Maven33Main /home/jenkins/tools/maven/apache-maven-3.3.9 /home/jenkins/jenkins-agent/agent.jar /home/jenkins/jenkins-agent/maven33-interceptor.jar /home/jenkins/jenkins-agent/maven3-interceptor-commons.jar 36283
Exception in thread "main" java.lang.UnsupportedClassVersionError: hudson/remoting/Launcher has been compiled by a more recent version of the Java Runtime (class file version 55.0), this version of the Java Runtime only recognizes class file versions up to 52.0
	at java.lang.ClassLoader.defineClass1(Native Method)
	at java.lang.ClassLoader.defineClass(ClassLoader.java:756)
	at java.security.SecureClassLoader.defineClass(SecureClassLoader.java:142)
	at java.net.URLClassLoader.defineClass(URLClassLoader.java:473)
	at java.net.URLClassLoader.access$100(URLClassLoader.java:74)
	at java.net.URLClassLoader$1.run(URLClassLoader.java:369)
	at java.net.URLClassLoader$1.run(URLClassLoader.java:363)
	at java.security.AccessController.doPrivileged(Native Method)
	at java.net.URLClassLoader.findClass(URLClassLoader.java:362)
	at org.codehaus.plexus.classworlds.realm.ClassRealm.loadClassFromSelf(ClassRealm.java:401)
	at org.codehaus.plexus.classworlds.strategy.SelfFirstStrategy.loadClass(SelfFirstStrategy.java:42)
	at org.codehaus.plexus.classworlds.realm.ClassRealm.unsynchronizedLoadClass(ClassRealm.java:271)
	at org.codehaus.plexus.classworlds.realm.ClassRealm.loadClass(ClassRealm.java:247)
	at org.codehaus.plexus.classworlds.realm.ClassRealm.loadClass(ClassRealm.java:239)
	at jenkins.maven3.agent.Maven33Main.main(Maven33Main.java:136)
	at jenkins.maven3.agent.Maven33Main.main(Maven33Main.java:66)
ERROR: Failed to parse POMs
java.io.EOFException: unexpected stream termination
	at hudson.remoting.ChannelBuilder.negotiate(ChannelBuilder.java:459)
	at hudson.remoting.ChannelBuilder.build(ChannelBuilder.java:404)
	at hudson.slaves.Channels.forProcess(Channels.java:121)
	at hudson.maven.AbstractMavenProcessFactory.newProcess(AbstractMavenProcessFactory.java:298)
	at hudson.maven.ProcessCache.get(ProcessCache.java:237)
	at hudson.maven.MavenModuleSetBuild$MavenModuleSetBuildExecution.doRun(MavenModuleSetBuild.java:802)
	at hudson.model.AbstractBuild$AbstractBuildExecution.run(AbstractBuild.java:526)
	at hudson.model.Run.execute(Run.java:1841)
	at hudson.maven.MavenModuleSetBuild.run(MavenModuleSetBuild.java:543)
	at hudson.model.ResourceController.execute(ResourceController.java:101)
	at hudson.model.Executor.run(Executor.java:442)

Build failed in Jenkins: DeltaSpike » DeltaSpike RAT-Check #88

Posted by Apache Jenkins Server <je...@builds.apache.org>.
See <https://ci-builds.apache.org/job/DeltaSpike/job/DeltaSpike%20RAT-Check/88/display/redirect?page=changes>

Changes:

[Thomas Andraschko] fixed ClientWindowRenderMode#NONE


------------------------------------------
Started by an SCM change
Running as SYSTEM
[EnvInject] - Loading node environment variables.
Building remotely on builds56 (tmp-22 ubuntu) in workspace <https://ci-builds.apache.org/job/DeltaSpike/job/DeltaSpike%20RAT-Check/ws/>
The recommended git tool is: NONE
No credentials specified
Wiping out workspace first.
Cloning the remote Git repository
Cloning repository https://gitbox.apache.org/repos/asf/deltaspike.git
 > git init <https://ci-builds.apache.org/job/DeltaSpike/job/DeltaSpike%20RAT-Check/ws/> # timeout=10
Fetching upstream changes from https://gitbox.apache.org/repos/asf/deltaspike.git
 > git --version # timeout=10
 > git --version # 'git version 2.34.1'
 > git fetch --tags --force --progress -- https://gitbox.apache.org/repos/asf/deltaspike.git +refs/heads/*:refs/remotes/origin/* # timeout=10
 > git config remote.origin.url https://gitbox.apache.org/repos/asf/deltaspike.git # timeout=10
 > git config --add remote.origin.fetch +refs/heads/*:refs/remotes/origin/* # timeout=10
Avoid second fetch
 > git rev-parse origin/master^{commit} # timeout=10
Checking out Revision fbf2a4974a861eab97207336d09567f32f1bd337 (origin/master)
 > git config core.sparsecheckout # timeout=10
 > git checkout -f fbf2a4974a861eab97207336d09567f32f1bd337 # timeout=10
Commit message: "fixed ClientWindowRenderMode#NONE"
 > git rev-list --no-walk 6d9364adf3c8d22b28af1a4213aca6af8dd8defa # timeout=10
Parsing POMs
Downloaded artifact https://repo.maven.apache.org/maven2/org/jboss/weld/weld-core-bom/5.0.1.Final/weld-core-bom-5.0.1.Final.pom
Downloaded artifact https://repo.maven.apache.org/maven2/org/jboss/weld/weld-api-bom/5.0.SP2/weld-api-bom-5.0.SP2.pom
Modules changed, recalculating dependency graph
Established TCP socket on 46227
maven33-agent.jar already up to date
maven33-interceptor.jar already up to date
maven3-interceptor-commons.jar already up to date
[DeltaSpike RAT-Check] $ /home/jenkins/tools/java/latest1.8/bin/java -cp /home/jenkins/jenkins-agent/maven33-agent.jar:/home/jenkins/tools/maven/apache-maven-3.3.9/boot/plexus-classworlds-2.5.2.jar:/home/jenkins/tools/maven/apache-maven-3.3.9/conf/logging jenkins.maven3.agent.Maven33Main /home/jenkins/tools/maven/apache-maven-3.3.9 /home/jenkins/jenkins-agent/agent.jar /home/jenkins/jenkins-agent/maven33-interceptor.jar /home/jenkins/jenkins-agent/maven3-interceptor-commons.jar 46227
Exception in thread "main" java.lang.UnsupportedClassVersionError: hudson/remoting/Launcher has been compiled by a more recent version of the Java Runtime (class file version 55.0), this version of the Java Runtime only recognizes class file versions up to 52.0
	at java.lang.ClassLoader.defineClass1(Native Method)
	at java.lang.ClassLoader.defineClass(ClassLoader.java:756)
	at java.security.SecureClassLoader.defineClass(SecureClassLoader.java:142)
	at java.net.URLClassLoader.defineClass(URLClassLoader.java:473)
	at java.net.URLClassLoader.access$100(URLClassLoader.java:74)
	at java.net.URLClassLoader$1.run(URLClassLoader.java:369)
	at java.net.URLClassLoader$1.run(URLClassLoader.java:363)
	at java.security.AccessController.doPrivileged(Native Method)
	at java.net.URLClassLoader.findClass(URLClassLoader.java:362)
	at org.codehaus.plexus.classworlds.realm.ClassRealm.loadClassFromSelf(ClassRealm.java:401)
	at org.codehaus.plexus.classworlds.strategy.SelfFirstStrategy.loadClass(SelfFirstStrategy.java:42)
	at org.codehaus.plexus.classworlds.realm.ClassRealm.unsynchronizedLoadClass(ClassRealm.java:271)
	at org.codehaus.plexus.classworlds.realm.ClassRealm.loadClass(ClassRealm.java:247)
	at org.codehaus.plexus.classworlds.realm.ClassRealm.loadClass(ClassRealm.java:239)
	at jenkins.maven3.agent.Maven33Main.main(Maven33Main.java:136)
	at jenkins.maven3.agent.Maven33Main.main(Maven33Main.java:66)
ERROR: Failed to parse POMs
java.io.EOFException: unexpected stream termination
	at hudson.remoting.ChannelBuilder.negotiate(ChannelBuilder.java:459)
	at hudson.remoting.ChannelBuilder.build(ChannelBuilder.java:404)
	at hudson.slaves.Channels.forProcess(Channels.java:121)
	at hudson.maven.AbstractMavenProcessFactory.newProcess(AbstractMavenProcessFactory.java:296)
	at hudson.maven.ProcessCache.get(ProcessCache.java:236)
	at hudson.maven.MavenModuleSetBuild$MavenModuleSetBuildExecution.doRun(MavenModuleSetBuild.java:802)
	at hudson.model.AbstractBuild$AbstractBuildExecution.run(AbstractBuild.java:526)
	at hudson.model.Run.execute(Run.java:1900)
	at hudson.maven.MavenModuleSetBuild.run(MavenModuleSetBuild.java:543)
	at hudson.model.ResourceController.execute(ResourceController.java:101)
	at hudson.model.Executor.run(Executor.java:442)

Build failed in Jenkins: DeltaSpike » DeltaSpike RAT-Check #87

Posted by Apache Jenkins Server <je...@builds.apache.org>.
See <https://ci-builds.apache.org/job/DeltaSpike/job/DeltaSpike%20RAT-Check/87/display/redirect?page=changes>

Changes:

[t.fruehbeck] NPE in WeldContainerControl on missing default test-container config


------------------------------------------
Started by an SCM change
Running as SYSTEM
[EnvInject] - Loading node environment variables.
Building remotely on builds49 (tmp-22 ubuntu pkcs11) in workspace <https://ci-builds.apache.org/job/DeltaSpike/job/DeltaSpike%20RAT-Check/ws/>
The recommended git tool is: NONE
No credentials specified
Wiping out workspace first.
Cloning the remote Git repository
Cloning repository https://gitbox.apache.org/repos/asf/deltaspike.git
 > git init <https://ci-builds.apache.org/job/DeltaSpike/job/DeltaSpike%20RAT-Check/ws/> # timeout=10
Fetching upstream changes from https://gitbox.apache.org/repos/asf/deltaspike.git
 > git --version # timeout=10
 > git --version # 'git version 2.34.1'
 > git fetch --tags --force --progress -- https://gitbox.apache.org/repos/asf/deltaspike.git +refs/heads/*:refs/remotes/origin/* # timeout=10
 > git config remote.origin.url https://gitbox.apache.org/repos/asf/deltaspike.git # timeout=10
 > git config --add remote.origin.fetch +refs/heads/*:refs/remotes/origin/* # timeout=10
Avoid second fetch
 > git rev-parse origin/master^{commit} # timeout=10
Checking out Revision 6d9364adf3c8d22b28af1a4213aca6af8dd8defa (origin/master)
 > git config core.sparsecheckout # timeout=10
 > git checkout -f 6d9364adf3c8d22b28af1a4213aca6af8dd8defa # timeout=10
Commit message: "Merge pull request #142 from shadogray/master"
 > git rev-list --no-walk e68e001bd4242cb431be6a9067520b445777e5cb # timeout=10
Parsing POMs
Modules changed, recalculating dependency graph
Established TCP socket on 37407
maven33-agent.jar already up to date
maven33-interceptor.jar already up to date
maven3-interceptor-commons.jar already up to date
[DeltaSpike RAT-Check] $ /home/jenkins/tools/java/latest1.8/bin/java -cp /home/jenkins/jenkins-agent/maven33-agent.jar:/home/jenkins/tools/maven/apache-maven-3.3.9/boot/plexus-classworlds-2.5.2.jar:/home/jenkins/tools/maven/apache-maven-3.3.9/conf/logging jenkins.maven3.agent.Maven33Main /home/jenkins/tools/maven/apache-maven-3.3.9 /home/jenkins/jenkins-agent/agent.jar /home/jenkins/jenkins-agent/maven33-interceptor.jar /home/jenkins/jenkins-agent/maven3-interceptor-commons.jar 37407
Exception in thread "main" java.lang.UnsupportedClassVersionError: hudson/remoting/Launcher has been compiled by a more recent version of the Java Runtime (class file version 55.0), this version of the Java Runtime only recognizes class file versions up to 52.0
	at java.lang.ClassLoader.defineClass1(Native Method)
	at java.lang.ClassLoader.defineClass(ClassLoader.java:756)
	at java.security.SecureClassLoader.defineClass(SecureClassLoader.java:142)
	at java.net.URLClassLoader.defineClass(URLClassLoader.java:473)
	at java.net.URLClassLoader.access$100(URLClassLoader.java:74)
	at java.net.URLClassLoader$1.run(URLClassLoader.java:369)
	at java.net.URLClassLoader$1.run(URLClassLoader.java:363)
	at java.security.AccessController.doPrivileged(Native Method)
	at java.net.URLClassLoader.findClass(URLClassLoader.java:362)
	at org.codehaus.plexus.classworlds.realm.ClassRealm.loadClassFromSelf(ClassRealm.java:401)
	at org.codehaus.plexus.classworlds.strategy.SelfFirstStrategy.loadClass(SelfFirstStrategy.java:42)
	at org.codehaus.plexus.classworlds.realm.ClassRealm.unsynchronizedLoadClass(ClassRealm.java:271)
	at org.codehaus.plexus.classworlds.realm.ClassRealm.loadClass(ClassRealm.java:247)
	at org.codehaus.plexus.classworlds.realm.ClassRealm.loadClass(ClassRealm.java:239)
	at jenkins.maven3.agent.Maven33Main.main(Maven33Main.java:136)
	at jenkins.maven3.agent.Maven33Main.main(Maven33Main.java:66)
ERROR: Failed to parse POMs
java.io.EOFException: unexpected stream termination
	at hudson.remoting.ChannelBuilder.negotiate(ChannelBuilder.java:459)
	at hudson.remoting.ChannelBuilder.build(ChannelBuilder.java:404)
	at hudson.slaves.Channels.forProcess(Channels.java:121)
	at hudson.maven.AbstractMavenProcessFactory.newProcess(AbstractMavenProcessFactory.java:296)
	at hudson.maven.ProcessCache.get(ProcessCache.java:236)
	at hudson.maven.MavenModuleSetBuild$MavenModuleSetBuildExecution.doRun(MavenModuleSetBuild.java:802)
	at hudson.model.AbstractBuild$AbstractBuildExecution.run(AbstractBuild.java:526)
	at hudson.model.Run.execute(Run.java:1900)
	at hudson.maven.MavenModuleSetBuild.run(MavenModuleSetBuild.java:543)
	at hudson.model.ResourceController.execute(ResourceController.java:101)
	at hudson.model.Executor.run(Executor.java:442)

Build failed in Jenkins: DeltaSpike » DeltaSpike RAT-Check #86

Posted by Apache Jenkins Server <je...@builds.apache.org>.
See <https://ci-builds.apache.org/job/DeltaSpike/job/DeltaSpike%20RAT-Check/86/display/redirect?page=changes>

Changes:

[t.fruehbeck] migrate faces-config.xml to Jakarta-Faces-4

[t.fruehbeck] move web.xml to Jakarta EE 10

[t.fruehbeck] add warning about ambiguous resolution of EntityManager producers


------------------------------------------
Started by an SCM change
Running as SYSTEM
[EnvInject] - Loading node environment variables.
Building remotely on builds59 (tmp-22 ubuntu) in workspace <https://ci-builds.apache.org/job/DeltaSpike/job/DeltaSpike%20RAT-Check/ws/>
The recommended git tool is: NONE
No credentials specified
Wiping out workspace first.
Cloning the remote Git repository
Cloning repository https://gitbox.apache.org/repos/asf/deltaspike.git
 > git init <https://ci-builds.apache.org/job/DeltaSpike/job/DeltaSpike%20RAT-Check/ws/> # timeout=10
Fetching upstream changes from https://gitbox.apache.org/repos/asf/deltaspike.git
 > git --version # timeout=10
 > git --version # 'git version 2.34.1'
 > git fetch --tags --force --progress -- https://gitbox.apache.org/repos/asf/deltaspike.git +refs/heads/*:refs/remotes/origin/* # timeout=10
 > git config remote.origin.url https://gitbox.apache.org/repos/asf/deltaspike.git # timeout=10
 > git config --add remote.origin.fetch +refs/heads/*:refs/remotes/origin/* # timeout=10
Avoid second fetch
 > git rev-parse origin/master^{commit} # timeout=10
Checking out Revision e68e001bd4242cb431be6a9067520b445777e5cb (origin/master)
 > git config core.sparsecheckout # timeout=10
 > git checkout -f e68e001bd4242cb431be6a9067520b445777e5cb # timeout=10
Commit message: "Merge pull request #141 from shadogray/master"
 > git rev-list --no-walk 32c97029f21b89bdaba8b471abeb015c0c95c9a2 # timeout=10
Parsing POMs
Modules changed, recalculating dependency graph
Established TCP socket on 41027
maven33-agent.jar already up to date
maven33-interceptor.jar already up to date
maven3-interceptor-commons.jar already up to date
[DeltaSpike RAT-Check] $ /home/jenkins/tools/java/latest1.8/bin/java -cp /home/jenkins/jenkins-agent/maven33-agent.jar:/home/jenkins/tools/maven/apache-maven-3.3.9/boot/plexus-classworlds-2.5.2.jar:/home/jenkins/tools/maven/apache-maven-3.3.9/conf/logging jenkins.maven3.agent.Maven33Main /home/jenkins/tools/maven/apache-maven-3.3.9 /home/jenkins/jenkins-agent/agent.jar /home/jenkins/jenkins-agent/maven33-interceptor.jar /home/jenkins/jenkins-agent/maven3-interceptor-commons.jar 41027
Exception in thread "main" java.lang.UnsupportedClassVersionError: hudson/remoting/Launcher has been compiled by a more recent version of the Java Runtime (class file version 55.0), this version of the Java Runtime only recognizes class file versions up to 52.0
	at java.lang.ClassLoader.defineClass1(Native Method)
	at java.lang.ClassLoader.defineClass(ClassLoader.java:756)
	at java.security.SecureClassLoader.defineClass(SecureClassLoader.java:142)
	at java.net.URLClassLoader.defineClass(URLClassLoader.java:473)
	at java.net.URLClassLoader.access$100(URLClassLoader.java:74)
	at java.net.URLClassLoader$1.run(URLClassLoader.java:369)
	at java.net.URLClassLoader$1.run(URLClassLoader.java:363)
	at java.security.AccessController.doPrivileged(Native Method)
	at java.net.URLClassLoader.findClass(URLClassLoader.java:362)
	at org.codehaus.plexus.classworlds.realm.ClassRealm.loadClassFromSelf(ClassRealm.java:401)
	at org.codehaus.plexus.classworlds.strategy.SelfFirstStrategy.loadClass(SelfFirstStrategy.java:42)
	at org.codehaus.plexus.classworlds.realm.ClassRealm.unsynchronizedLoadClass(ClassRealm.java:271)
	at org.codehaus.plexus.classworlds.realm.ClassRealm.loadClass(ClassRealm.java:247)
	at org.codehaus.plexus.classworlds.realm.ClassRealm.loadClass(ClassRealm.java:239)
	at jenkins.maven3.agent.Maven33Main.main(Maven33Main.java:136)
	at jenkins.maven3.agent.Maven33Main.main(Maven33Main.java:66)
ERROR: Failed to parse POMs
java.io.EOFException: unexpected stream termination
	at hudson.remoting.ChannelBuilder.negotiate(ChannelBuilder.java:459)
	at hudson.remoting.ChannelBuilder.build(ChannelBuilder.java:404)
	at hudson.slaves.Channels.forProcess(Channels.java:121)
	at hudson.maven.AbstractMavenProcessFactory.newProcess(AbstractMavenProcessFactory.java:296)
	at hudson.maven.ProcessCache.get(ProcessCache.java:236)
	at hudson.maven.MavenModuleSetBuild$MavenModuleSetBuildExecution.doRun(MavenModuleSetBuild.java:802)
	at hudson.model.AbstractBuild$AbstractBuildExecution.run(AbstractBuild.java:526)
	at hudson.model.Run.execute(Run.java:1900)
	at hudson.maven.MavenModuleSetBuild.run(MavenModuleSetBuild.java:543)
	at hudson.model.ResourceController.execute(ResourceController.java:101)
	at hudson.model.Executor.run(Executor.java:442)

Build failed in Jenkins: DeltaSpike » DeltaSpike RAT-Check #85

Posted by Apache Jenkins Server <je...@builds.apache.org>.
See <https://ci-builds.apache.org/job/DeltaSpike/job/DeltaSpike%20RAT-Check/85/display/redirect?page=changes>

Changes:

[Thomas Andraschko] reintroduced jsf-playground


------------------------------------------
Started by an SCM change
Running as SYSTEM
[EnvInject] - Loading node environment variables.
Building remotely on builds28 (ubuntu) in workspace <https://ci-builds.apache.org/job/DeltaSpike/job/DeltaSpike%20RAT-Check/ws/>
The recommended git tool is: NONE
No credentials specified
Wiping out workspace first.
Cloning the remote Git repository
Cloning repository https://gitbox.apache.org/repos/asf/deltaspike.git
 > git init <https://ci-builds.apache.org/job/DeltaSpike/job/DeltaSpike%20RAT-Check/ws/> # timeout=10
Fetching upstream changes from https://gitbox.apache.org/repos/asf/deltaspike.git
 > git --version # timeout=10
 > git --version # 'git version 2.34.1'
 > git fetch --tags --force --progress -- https://gitbox.apache.org/repos/asf/deltaspike.git +refs/heads/*:refs/remotes/origin/* # timeout=10
 > git config remote.origin.url https://gitbox.apache.org/repos/asf/deltaspike.git # timeout=10
 > git config --add remote.origin.fetch +refs/heads/*:refs/remotes/origin/* # timeout=10
Avoid second fetch
 > git rev-parse origin/master^{commit} # timeout=10
Checking out Revision 32c97029f21b89bdaba8b471abeb015c0c95c9a2 (origin/master)
 > git config core.sparsecheckout # timeout=10
 > git checkout -f 32c97029f21b89bdaba8b471abeb015c0c95c9a2 # timeout=10
Commit message: "reintroduced jsf-playground"
 > git rev-list --no-walk 4530d147dcc6a895ff29a5b2d3401d341647411b # timeout=10
Parsing POMs
Downloaded artifact https://repo.maven.apache.org/maven2/org/jboss/weld/weld-core-bom/5.0.1.Final/weld-core-bom-5.0.1.Final.pom
Downloaded artifact https://repo.maven.apache.org/maven2/org/jboss/weld/weld-api-bom/5.0.SP2/weld-api-bom-5.0.SP2.pom
Modules changed, recalculating dependency graph
Established TCP socket on 46337
maven33-agent.jar already up to date
maven33-interceptor.jar already up to date
maven3-interceptor-commons.jar already up to date
[DeltaSpike RAT-Check] $ /home/jenkins/tools/java/latest1.8/bin/java -cp /home/jenkins/jenkins-agent/maven33-agent.jar:/home/jenkins/tools/maven/apache-maven-3.3.9/boot/plexus-classworlds-2.5.2.jar:/home/jenkins/tools/maven/apache-maven-3.3.9/conf/logging jenkins.maven3.agent.Maven33Main /home/jenkins/tools/maven/apache-maven-3.3.9 /home/jenkins/jenkins-agent/agent.jar /home/jenkins/jenkins-agent/maven33-interceptor.jar /home/jenkins/jenkins-agent/maven3-interceptor-commons.jar 46337
Exception in thread "main" java.lang.UnsupportedClassVersionError: hudson/remoting/Launcher has been compiled by a more recent version of the Java Runtime (class file version 55.0), this version of the Java Runtime only recognizes class file versions up to 52.0
	at java.lang.ClassLoader.defineClass1(Native Method)
	at java.lang.ClassLoader.defineClass(ClassLoader.java:756)
	at java.security.SecureClassLoader.defineClass(SecureClassLoader.java:142)
	at java.net.URLClassLoader.defineClass(URLClassLoader.java:473)
	at java.net.URLClassLoader.access$100(URLClassLoader.java:74)
	at java.net.URLClassLoader$1.run(URLClassLoader.java:369)
	at java.net.URLClassLoader$1.run(URLClassLoader.java:363)
	at java.security.AccessController.doPrivileged(Native Method)
	at java.net.URLClassLoader.findClass(URLClassLoader.java:362)
	at org.codehaus.plexus.classworlds.realm.ClassRealm.loadClassFromSelf(ClassRealm.java:401)
	at org.codehaus.plexus.classworlds.strategy.SelfFirstStrategy.loadClass(SelfFirstStrategy.java:42)
	at org.codehaus.plexus.classworlds.realm.ClassRealm.unsynchronizedLoadClass(ClassRealm.java:271)
	at org.codehaus.plexus.classworlds.realm.ClassRealm.loadClass(ClassRealm.java:247)
	at org.codehaus.plexus.classworlds.realm.ClassRealm.loadClass(ClassRealm.java:239)
	at jenkins.maven3.agent.Maven33Main.main(Maven33Main.java:136)
	at jenkins.maven3.agent.Maven33Main.main(Maven33Main.java:66)
ERROR: Failed to parse POMs
java.io.EOFException: unexpected stream termination
	at hudson.remoting.ChannelBuilder.negotiate(ChannelBuilder.java:459)
	at hudson.remoting.ChannelBuilder.build(ChannelBuilder.java:404)
	at hudson.slaves.Channels.forProcess(Channels.java:121)
	at hudson.maven.AbstractMavenProcessFactory.newProcess(AbstractMavenProcessFactory.java:296)
	at hudson.maven.ProcessCache.get(ProcessCache.java:236)
	at hudson.maven.MavenModuleSetBuild$MavenModuleSetBuildExecution.doRun(MavenModuleSetBuild.java:802)
	at hudson.model.AbstractBuild$AbstractBuildExecution.run(AbstractBuild.java:526)
	at hudson.model.Run.execute(Run.java:1900)
	at hudson.maven.MavenModuleSetBuild.run(MavenModuleSetBuild.java:543)
	at hudson.model.ResourceController.execute(ResourceController.java:101)
	at hudson.model.Executor.run(Executor.java:442)

Build failed in Jenkins: DeltaSpike » DeltaSpike RAT-Check #84

Posted by Apache Jenkins Server <je...@builds.apache.org>.
See <https://ci-builds.apache.org/job/DeltaSpike/job/DeltaSpike%20RAT-Check/84/display/redirect?page=changes>

Changes:

[Thomas Andraschko] DELTASPIKE-1469


------------------------------------------
Started by an SCM change
Running as SYSTEM
[EnvInject] - Loading node environment variables.
Building remotely on builds59 (tmp-22 ubuntu) in workspace <https://ci-builds.apache.org/job/DeltaSpike/job/DeltaSpike%20RAT-Check/ws/>
The recommended git tool is: NONE
No credentials specified
Wiping out workspace first.
Cloning the remote Git repository
Cloning repository https://gitbox.apache.org/repos/asf/deltaspike.git
 > git init <https://ci-builds.apache.org/job/DeltaSpike/job/DeltaSpike%20RAT-Check/ws/> # timeout=10
Fetching upstream changes from https://gitbox.apache.org/repos/asf/deltaspike.git
 > git --version # timeout=10
 > git --version # 'git version 2.34.1'
 > git fetch --tags --force --progress -- https://gitbox.apache.org/repos/asf/deltaspike.git +refs/heads/*:refs/remotes/origin/* # timeout=10
 > git config remote.origin.url https://gitbox.apache.org/repos/asf/deltaspike.git # timeout=10
 > git config --add remote.origin.fetch +refs/heads/*:refs/remotes/origin/* # timeout=10
Avoid second fetch
 > git rev-parse origin/master^{commit} # timeout=10
Checking out Revision 4530d147dcc6a895ff29a5b2d3401d341647411b (origin/master)
 > git config core.sparsecheckout # timeout=10
 > git checkout -f 4530d147dcc6a895ff29a5b2d3401d341647411b # timeout=10
Commit message: "DELTASPIKE-1469"
 > git rev-list --no-walk 7a190160968e6b13288e8a476a187c0327e53b26 # timeout=10
Parsing POMs
Downloaded artifact https://repo.maven.apache.org/maven2/org/jboss/weld/weld-core-bom/5.0.1.Final/weld-core-bom-5.0.1.Final.pom
Downloaded artifact https://repo.maven.apache.org/maven2/org/jboss/weld/weld-api-bom/5.0.SP2/weld-api-bom-5.0.SP2.pom
Modules changed, recalculating dependency graph
Established TCP socket on 42793
maven33-agent.jar already up to date
maven33-interceptor.jar already up to date
maven3-interceptor-commons.jar already up to date
[DeltaSpike RAT-Check] $ /home/jenkins/tools/java/latest1.8/bin/java -cp /home/jenkins/jenkins-agent/maven33-agent.jar:/home/jenkins/tools/maven/apache-maven-3.3.9/boot/plexus-classworlds-2.5.2.jar:/home/jenkins/tools/maven/apache-maven-3.3.9/conf/logging jenkins.maven3.agent.Maven33Main /home/jenkins/tools/maven/apache-maven-3.3.9 /home/jenkins/jenkins-agent/agent.jar /home/jenkins/jenkins-agent/maven33-interceptor.jar /home/jenkins/jenkins-agent/maven3-interceptor-commons.jar 42793
Exception in thread "main" java.lang.UnsupportedClassVersionError: hudson/remoting/Launcher has been compiled by a more recent version of the Java Runtime (class file version 55.0), this version of the Java Runtime only recognizes class file versions up to 52.0
	at java.lang.ClassLoader.defineClass1(Native Method)
	at java.lang.ClassLoader.defineClass(ClassLoader.java:756)
	at java.security.SecureClassLoader.defineClass(SecureClassLoader.java:142)
	at java.net.URLClassLoader.defineClass(URLClassLoader.java:473)
	at java.net.URLClassLoader.access$100(URLClassLoader.java:74)
	at java.net.URLClassLoader$1.run(URLClassLoader.java:369)
	at java.net.URLClassLoader$1.run(URLClassLoader.java:363)
	at java.security.AccessController.doPrivileged(Native Method)
	at java.net.URLClassLoader.findClass(URLClassLoader.java:362)
	at org.codehaus.plexus.classworlds.realm.ClassRealm.loadClassFromSelf(ClassRealm.java:401)
	at org.codehaus.plexus.classworlds.strategy.SelfFirstStrategy.loadClass(SelfFirstStrategy.java:42)
	at org.codehaus.plexus.classworlds.realm.ClassRealm.unsynchronizedLoadClass(ClassRealm.java:271)
	at org.codehaus.plexus.classworlds.realm.ClassRealm.loadClass(ClassRealm.java:247)
	at org.codehaus.plexus.classworlds.realm.ClassRealm.loadClass(ClassRealm.java:239)
	at jenkins.maven3.agent.Maven33Main.main(Maven33Main.java:136)
	at jenkins.maven3.agent.Maven33Main.main(Maven33Main.java:66)
ERROR: Failed to parse POMs
java.io.EOFException: unexpected stream termination
	at hudson.remoting.ChannelBuilder.negotiate(ChannelBuilder.java:459)
	at hudson.remoting.ChannelBuilder.build(ChannelBuilder.java:404)
	at hudson.slaves.Channels.forProcess(Channels.java:121)
	at hudson.maven.AbstractMavenProcessFactory.newProcess(AbstractMavenProcessFactory.java:296)
	at hudson.maven.ProcessCache.get(ProcessCache.java:236)
	at hudson.maven.MavenModuleSetBuild$MavenModuleSetBuildExecution.doRun(MavenModuleSetBuild.java:802)
	at hudson.model.AbstractBuild$AbstractBuildExecution.run(AbstractBuild.java:526)
	at hudson.model.Run.execute(Run.java:1900)
	at hudson.maven.MavenModuleSetBuild.run(MavenModuleSetBuild.java:543)
	at hudson.model.ResourceController.execute(ResourceController.java:101)
	at hudson.model.Executor.run(Executor.java:442)

Build failed in Jenkins: DeltaSpike » DeltaSpike RAT-Check #83

Posted by Apache Jenkins Server <je...@builds.apache.org>.
See <https://ci-builds.apache.org/job/DeltaSpike/job/DeltaSpike%20RAT-Check/83/display/redirect?page=changes>

Changes:

[t.fruehbeck] move to Weld-5.0.1.Final and jakarta.el

[github] Update ds-ci.yml


------------------------------------------
Started by an SCM change
Running as SYSTEM
[EnvInject] - Loading node environment variables.
Building remotely on builds36 (ubuntu) in workspace <https://ci-builds.apache.org/job/DeltaSpike/job/DeltaSpike%20RAT-Check/ws/>
The recommended git tool is: NONE
No credentials specified
Wiping out workspace first.
Cloning the remote Git repository
Cloning repository https://gitbox.apache.org/repos/asf/deltaspike.git
 > git init <https://ci-builds.apache.org/job/DeltaSpike/job/DeltaSpike%20RAT-Check/ws/> # timeout=10
Fetching upstream changes from https://gitbox.apache.org/repos/asf/deltaspike.git
 > git --version # timeout=10
 > git --version # 'git version 2.34.1'
 > git fetch --tags --force --progress -- https://gitbox.apache.org/repos/asf/deltaspike.git +refs/heads/*:refs/remotes/origin/* # timeout=10
 > git config remote.origin.url https://gitbox.apache.org/repos/asf/deltaspike.git # timeout=10
 > git config --add remote.origin.fetch +refs/heads/*:refs/remotes/origin/* # timeout=10
Avoid second fetch
 > git rev-parse origin/master^{commit} # timeout=10
Checking out Revision 7a190160968e6b13288e8a476a187c0327e53b26 (origin/master)
 > git config core.sparsecheckout # timeout=10
 > git checkout -f 7a190160968e6b13288e8a476a187c0327e53b26 # timeout=10
Commit message: "Merge pull request #140 from shadogray/master"
 > git rev-list --no-walk c2292f68dd7a22a80b54bf7816ae8fa100335630 # timeout=10
Parsing POMs
Downloaded artifact https://repo.maven.apache.org/maven2/org/jboss/weld/weld-core-bom/5.0.1.Final/weld-core-bom-5.0.1.Final.pom
Downloaded artifact https://repo.maven.apache.org/maven2/org/jboss/weld/weld-api-bom/5.0.SP2/weld-api-bom-5.0.SP2.pom
Modules changed, recalculating dependency graph
Established TCP socket on 44565
maven33-agent.jar already up to date
maven33-interceptor.jar already up to date
maven3-interceptor-commons.jar already up to date
[DeltaSpike RAT-Check] $ /home/jenkins/tools/java/latest1.8/bin/java -cp /home/jenkins/maven33-agent.jar:/home/jenkins/tools/maven/apache-maven-3.3.9/boot/plexus-classworlds-2.5.2.jar:/home/jenkins/tools/maven/apache-maven-3.3.9/conf/logging jenkins.maven3.agent.Maven33Main /home/jenkins/tools/maven/apache-maven-3.3.9 /home/jenkins/agent.jar /home/jenkins/maven33-interceptor.jar /home/jenkins/maven3-interceptor-commons.jar 44565
Exception in thread "main" java.lang.UnsupportedClassVersionError: hudson/remoting/Launcher has been compiled by a more recent version of the Java Runtime (class file version 55.0), this version of the Java Runtime only recognizes class file versions up to 52.0
	at java.lang.ClassLoader.defineClass1(Native Method)
	at java.lang.ClassLoader.defineClass(ClassLoader.java:756)
	at java.security.SecureClassLoader.defineClass(SecureClassLoader.java:142)
	at java.net.URLClassLoader.defineClass(URLClassLoader.java:473)
	at java.net.URLClassLoader.access$100(URLClassLoader.java:74)
	at java.net.URLClassLoader$1.run(URLClassLoader.java:369)
	at java.net.URLClassLoader$1.run(URLClassLoader.java:363)
	at java.security.AccessController.doPrivileged(Native Method)
	at java.net.URLClassLoader.findClass(URLClassLoader.java:362)
	at org.codehaus.plexus.classworlds.realm.ClassRealm.loadClassFromSelf(ClassRealm.java:401)
	at org.codehaus.plexus.classworlds.strategy.SelfFirstStrategy.loadClass(SelfFirstStrategy.java:42)
	at org.codehaus.plexus.classworlds.realm.ClassRealm.unsynchronizedLoadClass(ClassRealm.java:271)
	at org.codehaus.plexus.classworlds.realm.ClassRealm.loadClass(ClassRealm.java:247)
	at org.codehaus.plexus.classworlds.realm.ClassRealm.loadClass(ClassRealm.java:239)
	at jenkins.maven3.agent.Maven33Main.main(Maven33Main.java:136)
	at jenkins.maven3.agent.Maven33Main.main(Maven33Main.java:66)
ERROR: Failed to parse POMs
java.io.EOFException: unexpected stream termination
	at hudson.remoting.ChannelBuilder.negotiate(ChannelBuilder.java:459)
	at hudson.remoting.ChannelBuilder.build(ChannelBuilder.java:404)
	at hudson.slaves.Channels.forProcess(Channels.java:121)
	at hudson.maven.AbstractMavenProcessFactory.newProcess(AbstractMavenProcessFactory.java:296)
	at hudson.maven.ProcessCache.get(ProcessCache.java:236)
	at hudson.maven.MavenModuleSetBuild$MavenModuleSetBuildExecution.doRun(MavenModuleSetBuild.java:802)
	at hudson.model.AbstractBuild$AbstractBuildExecution.run(AbstractBuild.java:526)
	at hudson.model.Run.execute(Run.java:1900)
	at hudson.maven.MavenModuleSetBuild.run(MavenModuleSetBuild.java:543)
	at hudson.model.ResourceController.execute(ResourceController.java:101)
	at hudson.model.Executor.run(Executor.java:442)

Build failed in Jenkins: DeltaSpike » DeltaSpike RAT-Check #82

Posted by Apache Jenkins Server <je...@builds.apache.org>.
See <https://ci-builds.apache.org/job/DeltaSpike/job/DeltaSpike%20RAT-Check/82/display/redirect?page=changes>

Changes:

[Thomas Andraschko] workaround BeanConfigurator

[Thomas Andraschko] fixed deprecation

[Thomas Andraschko] removed old profiles

[Thomas Andraschko] cosmetics

[Thomas Andraschko] profile cleanup


------------------------------------------
Started by an SCM change
Running as SYSTEM
[EnvInject] - Loading node environment variables.
Building remotely on builds59 (tmp-22 ubuntu) in workspace <https://ci-builds.apache.org/job/DeltaSpike/job/DeltaSpike%20RAT-Check/ws/>
The recommended git tool is: NONE
No credentials specified
Wiping out workspace first.
Cloning the remote Git repository
Cloning repository https://gitbox.apache.org/repos/asf/deltaspike.git
 > git init <https://ci-builds.apache.org/job/DeltaSpike/job/DeltaSpike%20RAT-Check/ws/> # timeout=10
Fetching upstream changes from https://gitbox.apache.org/repos/asf/deltaspike.git
 > git --version # timeout=10
 > git --version # 'git version 2.34.1'
 > git fetch --tags --force --progress -- https://gitbox.apache.org/repos/asf/deltaspike.git +refs/heads/*:refs/remotes/origin/* # timeout=10
 > git config remote.origin.url https://gitbox.apache.org/repos/asf/deltaspike.git # timeout=10
 > git config --add remote.origin.fetch +refs/heads/*:refs/remotes/origin/* # timeout=10
Avoid second fetch
 > git rev-parse origin/master^{commit} # timeout=10
Checking out Revision c2292f68dd7a22a80b54bf7816ae8fa100335630 (origin/master)
 > git config core.sparsecheckout # timeout=10
 > git checkout -f c2292f68dd7a22a80b54bf7816ae8fa100335630 # timeout=10
Commit message: "profile cleanup"
 > git rev-list --no-walk f883d7b5dd22d3fdb3785e7511bdd9aa55cd5126 # timeout=10
Parsing POMs
Modules changed, recalculating dependency graph
Established TCP socket on 45671
maven33-agent.jar already up to date
maven33-interceptor.jar already up to date
maven3-interceptor-commons.jar already up to date
[DeltaSpike RAT-Check] $ /home/jenkins/tools/java/latest1.8/bin/java -cp /home/jenkins/jenkins-agent/maven33-agent.jar:/home/jenkins/tools/maven/apache-maven-3.3.9/boot/plexus-classworlds-2.5.2.jar:/home/jenkins/tools/maven/apache-maven-3.3.9/conf/logging jenkins.maven3.agent.Maven33Main /home/jenkins/tools/maven/apache-maven-3.3.9 /home/jenkins/jenkins-agent/agent.jar /home/jenkins/jenkins-agent/maven33-interceptor.jar /home/jenkins/jenkins-agent/maven3-interceptor-commons.jar 45671
Exception in thread "main" java.lang.UnsupportedClassVersionError: hudson/remoting/Launcher has been compiled by a more recent version of the Java Runtime (class file version 55.0), this version of the Java Runtime only recognizes class file versions up to 52.0
	at java.lang.ClassLoader.defineClass1(Native Method)
	at java.lang.ClassLoader.defineClass(ClassLoader.java:756)
	at java.security.SecureClassLoader.defineClass(SecureClassLoader.java:142)
	at java.net.URLClassLoader.defineClass(URLClassLoader.java:473)
	at java.net.URLClassLoader.access$100(URLClassLoader.java:74)
	at java.net.URLClassLoader$1.run(URLClassLoader.java:369)
	at java.net.URLClassLoader$1.run(URLClassLoader.java:363)
	at java.security.AccessController.doPrivileged(Native Method)
	at java.net.URLClassLoader.findClass(URLClassLoader.java:362)
	at org.codehaus.plexus.classworlds.realm.ClassRealm.loadClassFromSelf(ClassRealm.java:401)
	at org.codehaus.plexus.classworlds.strategy.SelfFirstStrategy.loadClass(SelfFirstStrategy.java:42)
	at org.codehaus.plexus.classworlds.realm.ClassRealm.unsynchronizedLoadClass(ClassRealm.java:271)
	at org.codehaus.plexus.classworlds.realm.ClassRealm.loadClass(ClassRealm.java:247)
	at org.codehaus.plexus.classworlds.realm.ClassRealm.loadClass(ClassRealm.java:239)
	at jenkins.maven3.agent.Maven33Main.main(Maven33Main.java:136)
	at jenkins.maven3.agent.Maven33Main.main(Maven33Main.java:66)
ERROR: Failed to parse POMs
java.io.EOFException: unexpected stream termination
	at hudson.remoting.ChannelBuilder.negotiate(ChannelBuilder.java:459)
	at hudson.remoting.ChannelBuilder.build(ChannelBuilder.java:404)
	at hudson.slaves.Channels.forProcess(Channels.java:121)
	at hudson.maven.AbstractMavenProcessFactory.newProcess(AbstractMavenProcessFactory.java:296)
	at hudson.maven.ProcessCache.get(ProcessCache.java:236)
	at hudson.maven.MavenModuleSetBuild$MavenModuleSetBuildExecution.doRun(MavenModuleSetBuild.java:802)
	at hudson.model.AbstractBuild$AbstractBuildExecution.run(AbstractBuild.java:526)
	at hudson.model.Run.execute(Run.java:1900)
	at hudson.maven.MavenModuleSetBuild.run(MavenModuleSetBuild.java:543)
	at hudson.model.ResourceController.execute(ResourceController.java:101)
	at hudson.model.Executor.run(Executor.java:442)

Build failed in Jenkins: DeltaSpike » DeltaSpike RAT-Check #81

Posted by Apache Jenkins Server <je...@builds.apache.org>.
See <https://ci-builds.apache.org/job/DeltaSpike/job/DeltaSpike%20RAT-Check/81/display/redirect?page=changes>

Changes:

[Thomas Andraschko] fixed MessageBundle bean builder

[Thomas Andraschko] fixed MessageBundle bean builder

[Thomas Andraschko] fixed MessageBundle bean builder

[Thomas Andraschko] fixed asm shading

[Thomas Andraschko] workaround BeanConfigurator


------------------------------------------
Started by an SCM change
Running as SYSTEM
[EnvInject] - Loading node environment variables.
Building remotely on builds36 (ubuntu) in workspace <https://ci-builds.apache.org/job/DeltaSpike/job/DeltaSpike%20RAT-Check/ws/>
The recommended git tool is: NONE
No credentials specified
Wiping out workspace first.
Cloning the remote Git repository
Cloning repository https://gitbox.apache.org/repos/asf/deltaspike.git
 > git init <https://ci-builds.apache.org/job/DeltaSpike/job/DeltaSpike%20RAT-Check/ws/> # timeout=10
Fetching upstream changes from https://gitbox.apache.org/repos/asf/deltaspike.git
 > git --version # timeout=10
 > git --version # 'git version 2.34.1'
 > git fetch --tags --force --progress -- https://gitbox.apache.org/repos/asf/deltaspike.git +refs/heads/*:refs/remotes/origin/* # timeout=10
 > git config remote.origin.url https://gitbox.apache.org/repos/asf/deltaspike.git # timeout=10
 > git config --add remote.origin.fetch +refs/heads/*:refs/remotes/origin/* # timeout=10
Avoid second fetch
 > git rev-parse origin/master^{commit} # timeout=10
Checking out Revision f883d7b5dd22d3fdb3785e7511bdd9aa55cd5126 (origin/master)
 > git config core.sparsecheckout # timeout=10
 > git checkout -f f883d7b5dd22d3fdb3785e7511bdd9aa55cd5126 # timeout=10
Commit message: "workaround BeanConfigurator"
 > git rev-list --no-walk 87c2e974fc92ec94b508df687ed450d80b3b928f # timeout=10
Parsing POMs
Modules changed, recalculating dependency graph
Established TCP socket on 35695
maven33-agent.jar already up to date
maven33-interceptor.jar already up to date
maven3-interceptor-commons.jar already up to date
[DeltaSpike RAT-Check] $ /home/jenkins/tools/java/latest1.8/bin/java -cp /home/jenkins/maven33-agent.jar:/home/jenkins/tools/maven/apache-maven-3.3.9/boot/plexus-classworlds-2.5.2.jar:/home/jenkins/tools/maven/apache-maven-3.3.9/conf/logging jenkins.maven3.agent.Maven33Main /home/jenkins/tools/maven/apache-maven-3.3.9 /home/jenkins/agent.jar /home/jenkins/maven33-interceptor.jar /home/jenkins/maven3-interceptor-commons.jar 35695
Exception in thread "main" java.lang.UnsupportedClassVersionError: hudson/remoting/Launcher has been compiled by a more recent version of the Java Runtime (class file version 55.0), this version of the Java Runtime only recognizes class file versions up to 52.0
	at java.lang.ClassLoader.defineClass1(Native Method)
	at java.lang.ClassLoader.defineClass(ClassLoader.java:756)
	at java.security.SecureClassLoader.defineClass(SecureClassLoader.java:142)
	at java.net.URLClassLoader.defineClass(URLClassLoader.java:473)
	at java.net.URLClassLoader.access$100(URLClassLoader.java:74)
	at java.net.URLClassLoader$1.run(URLClassLoader.java:369)
	at java.net.URLClassLoader$1.run(URLClassLoader.java:363)
	at java.security.AccessController.doPrivileged(Native Method)
	at java.net.URLClassLoader.findClass(URLClassLoader.java:362)
	at org.codehaus.plexus.classworlds.realm.ClassRealm.loadClassFromSelf(ClassRealm.java:401)
	at org.codehaus.plexus.classworlds.strategy.SelfFirstStrategy.loadClass(SelfFirstStrategy.java:42)
	at org.codehaus.plexus.classworlds.realm.ClassRealm.unsynchronizedLoadClass(ClassRealm.java:271)
	at org.codehaus.plexus.classworlds.realm.ClassRealm.loadClass(ClassRealm.java:247)
	at org.codehaus.plexus.classworlds.realm.ClassRealm.loadClass(ClassRealm.java:239)
	at jenkins.maven3.agent.Maven33Main.main(Maven33Main.java:136)
	at jenkins.maven3.agent.Maven33Main.main(Maven33Main.java:66)
ERROR: Failed to parse POMs
java.io.EOFException: unexpected stream termination
	at hudson.remoting.ChannelBuilder.negotiate(ChannelBuilder.java:459)
	at hudson.remoting.ChannelBuilder.build(ChannelBuilder.java:404)
	at hudson.slaves.Channels.forProcess(Channels.java:121)
	at hudson.maven.AbstractMavenProcessFactory.newProcess(AbstractMavenProcessFactory.java:296)
	at hudson.maven.ProcessCache.get(ProcessCache.java:236)
	at hudson.maven.MavenModuleSetBuild$MavenModuleSetBuildExecution.doRun(MavenModuleSetBuild.java:802)
	at hudson.model.AbstractBuild$AbstractBuildExecution.run(AbstractBuild.java:526)
	at hudson.model.Run.execute(Run.java:1900)
	at hudson.maven.MavenModuleSetBuild.run(MavenModuleSetBuild.java:543)
	at hudson.model.ResourceController.execute(ResourceController.java:101)
	at hudson.model.Executor.run(Executor.java:442)

Build failed in Jenkins: DeltaSpike » DeltaSpike RAT-Check #80

Posted by Apache Jenkins Server <je...@builds.apache.org>.
See <https://ci-builds.apache.org/job/DeltaSpike/job/DeltaSpike%20RAT-Check/80/display/redirect?page=changes>

Changes:

[t.fruehbeck] Profile Weld: update properties and dependencies


------------------------------------------
Started by an SCM change
Running as SYSTEM
[EnvInject] - Loading node environment variables.
Building remotely on builds36 (ubuntu) in workspace <https://ci-builds.apache.org/job/DeltaSpike/job/DeltaSpike%20RAT-Check/ws/>
The recommended git tool is: NONE
No credentials specified
Wiping out workspace first.
Cloning the remote Git repository
Cloning repository https://gitbox.apache.org/repos/asf/deltaspike.git
 > git init <https://ci-builds.apache.org/job/DeltaSpike/job/DeltaSpike%20RAT-Check/ws/> # timeout=10
Fetching upstream changes from https://gitbox.apache.org/repos/asf/deltaspike.git
 > git --version # timeout=10
 > git --version # 'git version 2.34.1'
 > git fetch --tags --force --progress -- https://gitbox.apache.org/repos/asf/deltaspike.git +refs/heads/*:refs/remotes/origin/* # timeout=10
 > git config remote.origin.url https://gitbox.apache.org/repos/asf/deltaspike.git # timeout=10
 > git config --add remote.origin.fetch +refs/heads/*:refs/remotes/origin/* # timeout=10
Avoid second fetch
 > git rev-parse origin/master^{commit} # timeout=10
Checking out Revision 87c2e974fc92ec94b508df687ed450d80b3b928f (origin/master)
 > git config core.sparsecheckout # timeout=10
 > git checkout -f 87c2e974fc92ec94b508df687ed450d80b3b928f # timeout=10
Commit message: "Merge pull request #139 from shadogray/master"
 > git rev-list --no-walk d67e6bb1593937955d3ae6d2efbc295915e16928 # timeout=10
Parsing POMs
Modules changed, recalculating dependency graph
Established TCP socket on 37911
maven33-agent.jar already up to date
maven33-interceptor.jar already up to date
maven3-interceptor-commons.jar already up to date
[DeltaSpike RAT-Check] $ /home/jenkins/tools/java/latest1.8/bin/java -cp /home/jenkins/maven33-agent.jar:/home/jenkins/tools/maven/apache-maven-3.3.9/boot/plexus-classworlds-2.5.2.jar:/home/jenkins/tools/maven/apache-maven-3.3.9/conf/logging jenkins.maven3.agent.Maven33Main /home/jenkins/tools/maven/apache-maven-3.3.9 /home/jenkins/agent.jar /home/jenkins/maven33-interceptor.jar /home/jenkins/maven3-interceptor-commons.jar 37911
Exception in thread "main" java.lang.UnsupportedClassVersionError: hudson/remoting/Launcher has been compiled by a more recent version of the Java Runtime (class file version 55.0), this version of the Java Runtime only recognizes class file versions up to 52.0
	at java.lang.ClassLoader.defineClass1(Native Method)
	at java.lang.ClassLoader.defineClass(ClassLoader.java:756)
	at java.security.SecureClassLoader.defineClass(SecureClassLoader.java:142)
	at java.net.URLClassLoader.defineClass(URLClassLoader.java:473)
	at java.net.URLClassLoader.access$100(URLClassLoader.java:74)
	at java.net.URLClassLoader$1.run(URLClassLoader.java:369)
	at java.net.URLClassLoader$1.run(URLClassLoader.java:363)
	at java.security.AccessController.doPrivileged(Native Method)
	at java.net.URLClassLoader.findClass(URLClassLoader.java:362)
	at org.codehaus.plexus.classworlds.realm.ClassRealm.loadClassFromSelf(ClassRealm.java:401)
	at org.codehaus.plexus.classworlds.strategy.SelfFirstStrategy.loadClass(SelfFirstStrategy.java:42)
	at org.codehaus.plexus.classworlds.realm.ClassRealm.unsynchronizedLoadClass(ClassRealm.java:271)
	at org.codehaus.plexus.classworlds.realm.ClassRealm.loadClass(ClassRealm.java:247)
	at org.codehaus.plexus.classworlds.realm.ClassRealm.loadClass(ClassRealm.java:239)
	at jenkins.maven3.agent.Maven33Main.main(Maven33Main.java:136)
	at jenkins.maven3.agent.Maven33Main.main(Maven33Main.java:66)
ERROR: Failed to parse POMs
java.io.EOFException: unexpected stream termination
	at hudson.remoting.ChannelBuilder.negotiate(ChannelBuilder.java:459)
	at hudson.remoting.ChannelBuilder.build(ChannelBuilder.java:404)
	at hudson.slaves.Channels.forProcess(Channels.java:121)
	at hudson.maven.AbstractMavenProcessFactory.newProcess(AbstractMavenProcessFactory.java:296)
	at hudson.maven.ProcessCache.get(ProcessCache.java:236)
	at hudson.maven.MavenModuleSetBuild$MavenModuleSetBuildExecution.doRun(MavenModuleSetBuild.java:802)
	at hudson.model.AbstractBuild$AbstractBuildExecution.run(AbstractBuild.java:526)
	at hudson.model.Run.execute(Run.java:1900)
	at hudson.maven.MavenModuleSetBuild.run(MavenModuleSetBuild.java:543)
	at hudson.model.ResourceController.execute(ResourceController.java:101)
	at hudson.model.Executor.run(Executor.java:442)

Build failed in Jenkins: DeltaSpike » DeltaSpike RAT-Check #79

Posted by Apache Jenkins Server <je...@builds.apache.org>.
See <https://ci-builds.apache.org/job/DeltaSpike/job/DeltaSpike%20RAT-Check/79/display/redirect?page=changes>

Changes:

[Thomas Andraschko] javax -> jakarta

[Thomas Andraschko] javax -> jakarta

[Thomas Andraschko] shade not required anymore


------------------------------------------
Started by an SCM change
Running as SYSTEM
[EnvInject] - Loading node environment variables.
Building remotely on builds36 (ubuntu) in workspace <https://ci-builds.apache.org/job/DeltaSpike/job/DeltaSpike%20RAT-Check/ws/>
The recommended git tool is: NONE
No credentials specified
Wiping out workspace first.
Cloning the remote Git repository
Cloning repository https://gitbox.apache.org/repos/asf/deltaspike.git
 > git init <https://ci-builds.apache.org/job/DeltaSpike/job/DeltaSpike%20RAT-Check/ws/> # timeout=10
Fetching upstream changes from https://gitbox.apache.org/repos/asf/deltaspike.git
 > git --version # timeout=10
 > git --version # 'git version 2.34.1'
 > git fetch --tags --force --progress -- https://gitbox.apache.org/repos/asf/deltaspike.git +refs/heads/*:refs/remotes/origin/* # timeout=10
 > git config remote.origin.url https://gitbox.apache.org/repos/asf/deltaspike.git # timeout=10
 > git config --add remote.origin.fetch +refs/heads/*:refs/remotes/origin/* # timeout=10
Avoid second fetch
 > git rev-parse origin/master^{commit} # timeout=10
Checking out Revision d67e6bb1593937955d3ae6d2efbc295915e16928 (origin/master)
 > git config core.sparsecheckout # timeout=10
 > git checkout -f d67e6bb1593937955d3ae6d2efbc295915e16928 # timeout=10
Commit message: "shade not required anymore"
 > git rev-list --no-walk e7357d14309b30e019ee46e6a73d507d04138b1e # timeout=10
Parsing POMs
Modules changed, recalculating dependency graph
Established TCP socket on 41821
maven33-agent.jar already up to date
maven33-interceptor.jar already up to date
maven3-interceptor-commons.jar already up to date
[DeltaSpike RAT-Check] $ /home/jenkins/tools/java/latest1.8/bin/java -cp /home/jenkins/maven33-agent.jar:/home/jenkins/tools/maven/apache-maven-3.3.9/boot/plexus-classworlds-2.5.2.jar:/home/jenkins/tools/maven/apache-maven-3.3.9/conf/logging jenkins.maven3.agent.Maven33Main /home/jenkins/tools/maven/apache-maven-3.3.9 /home/jenkins/agent.jar /home/jenkins/maven33-interceptor.jar /home/jenkins/maven3-interceptor-commons.jar 41821
Exception in thread "main" java.lang.UnsupportedClassVersionError: hudson/remoting/Launcher has been compiled by a more recent version of the Java Runtime (class file version 55.0), this version of the Java Runtime only recognizes class file versions up to 52.0
	at java.lang.ClassLoader.defineClass1(Native Method)
	at java.lang.ClassLoader.defineClass(ClassLoader.java:756)
	at java.security.SecureClassLoader.defineClass(SecureClassLoader.java:142)
	at java.net.URLClassLoader.defineClass(URLClassLoader.java:473)
	at java.net.URLClassLoader.access$100(URLClassLoader.java:74)
	at java.net.URLClassLoader$1.run(URLClassLoader.java:369)
	at java.net.URLClassLoader$1.run(URLClassLoader.java:363)
	at java.security.AccessController.doPrivileged(Native Method)
	at java.net.URLClassLoader.findClass(URLClassLoader.java:362)
	at org.codehaus.plexus.classworlds.realm.ClassRealm.loadClassFromSelf(ClassRealm.java:401)
	at org.codehaus.plexus.classworlds.strategy.SelfFirstStrategy.loadClass(SelfFirstStrategy.java:42)
	at org.codehaus.plexus.classworlds.realm.ClassRealm.unsynchronizedLoadClass(ClassRealm.java:271)
	at org.codehaus.plexus.classworlds.realm.ClassRealm.loadClass(ClassRealm.java:247)
	at org.codehaus.plexus.classworlds.realm.ClassRealm.loadClass(ClassRealm.java:239)
	at jenkins.maven3.agent.Maven33Main.main(Maven33Main.java:136)
	at jenkins.maven3.agent.Maven33Main.main(Maven33Main.java:66)
ERROR: Failed to parse POMs
java.io.EOFException: unexpected stream termination
	at hudson.remoting.ChannelBuilder.negotiate(ChannelBuilder.java:459)
	at hudson.remoting.ChannelBuilder.build(ChannelBuilder.java:404)
	at hudson.slaves.Channels.forProcess(Channels.java:121)
	at hudson.maven.AbstractMavenProcessFactory.newProcess(AbstractMavenProcessFactory.java:296)
	at hudson.maven.ProcessCache.get(ProcessCache.java:236)
	at hudson.maven.MavenModuleSetBuild$MavenModuleSetBuildExecution.doRun(MavenModuleSetBuild.java:802)
	at hudson.model.AbstractBuild$AbstractBuildExecution.run(AbstractBuild.java:526)
	at hudson.model.Run.execute(Run.java:1900)
	at hudson.maven.MavenModuleSetBuild.run(MavenModuleSetBuild.java:543)
	at hudson.model.ResourceController.execute(ResourceController.java:101)
	at hudson.model.Executor.run(Executor.java:442)