You are viewing a plain text version of this content. The canonical link for it is here.
Posted to builds@beam.apache.org by Apache Jenkins Server <je...@builds.apache.org> on 2020/08/21 01:07:47 UTC
Build failed in Jenkins: beam_PostCommit_Py_VR_Dataflow_V2 #947
See <https://ci-beam.apache.org/job/beam_PostCommit_Py_VR_Dataflow_V2/947/display/redirect?page=changes>
Changes:
[daniel.o.programmer] [BEAM-3301] Consolidating starcgen method names in graph/fn.go and
[daniel.o.programmer] [BEAM-10289] Fixing miscalculated SDF split fraction.
[noreply] [BEAM-10701] Generate Codecov XML (#12566)
[noreply] [BEAM-9979] Fix read index being reported to be reset after any metrics
[noreply] [BEAM-9546] DataframeTransform can now consume a schema-aware
------------------------------------------
[...truncated 5.63 MB...]
],
"non_parallel_inputs": {},
"output_info": [
{
"encoding": {
"@type": "kind:windowed_value",
"component_encodings": [
{
"@type": "FastPrimitivesCoder$<string of 176 bytes>",
"component_encodings": [
{
"@type": "FastPrimitivesCoder$<string of 176 bytes>",
"component_encodings": [],
"pipeline_proto_coder_id": "ref_Coder_FastPrimitivesCoder_4"
},
{
"@type": "FastPrimitivesCoder$<string of 176 bytes>",
"component_encodings": [],
"pipeline_proto_coder_id": "ref_Coder_FastPrimitivesCoder_4"
}
],
"is_pair_like": true,
"pipeline_proto_coder_id": "ref_Coder_FastPrimitivesCoder_4"
},
{
"@type": "kind:global_window"
}
],
"is_wrapper": true
},
"output_name": "None",
"user_name": "assert_that/Unkey.out"
}
],
"parallel_input": {
"@type": "OutputReference",
"output_name": "None",
"step_name": "s19"
},
"serialized_fn": "ref_AppliedPTransform_assert_that/Unkey_29",
"user_name": "assert_that/Unkey"
}
},
{
"kind": "ParallelDo",
"name": "s21",
"properties": {
"display_data": [
{
"key": "fn",
"label": "Transform Function",
"namespace": "apache_beam.transforms.core.CallableWrapperDoFn",
"type": "STRING",
"value": "_equal"
},
{
"key": "fn",
"label": "Transform Function",
"namespace": "apache_beam.transforms.core.ParDo",
"shortValue": "CallableWrapperDoFn",
"type": "STRING",
"value": "apache_beam.transforms.core.CallableWrapperDoFn"
}
],
"non_parallel_inputs": {},
"output_info": [
{
"encoding": {
"@type": "kind:windowed_value",
"component_encodings": [
{
"@type": "FastPrimitivesCoder$<string of 176 bytes>",
"component_encodings": [
{
"@type": "FastPrimitivesCoder$<string of 176 bytes>",
"component_encodings": [],
"pipeline_proto_coder_id": "ref_Coder_FastPrimitivesCoder_4"
},
{
"@type": "FastPrimitivesCoder$<string of 176 bytes>",
"component_encodings": [],
"pipeline_proto_coder_id": "ref_Coder_FastPrimitivesCoder_4"
}
],
"is_pair_like": true,
"pipeline_proto_coder_id": "ref_Coder_FastPrimitivesCoder_4"
},
{
"@type": "kind:global_window"
}
],
"is_wrapper": true
},
"output_name": "None",
"user_name": "assert_that/Match.out"
}
],
"parallel_input": {
"@type": "OutputReference",
"output_name": "None",
"step_name": "s20"
},
"serialized_fn": "ref_AppliedPTransform_assert_that/Match_30",
"user_name": "assert_that/Match"
}
}
],
"type": "JOB_TYPE_STREAMING"
}
INFO:apache_beam.runners.dataflow.internal.apiclient:Create job: <Job
createTime: u'2020-08-21T00:59:29.247528Z'
currentStateTime: u'1970-01-01T00:00:00Z'
id: u'2020-08-20_17_59_28-8554732655575912405'
location: u'us-central1'
name: u'beamapp-jenkins-0821005918-622996'
projectId: u'apache-beam-testing'
stageStates: []
startTime: u'2020-08-21T00:59:29.247528Z'
steps: []
tempFiles: []
type: TypeValueValuesEnum(JOB_TYPE_STREAMING, 2)>
INFO:apache_beam.runners.dataflow.internal.apiclient:Created job with id: [2020-08-20_17_59_28-8554732655575912405]
INFO:apache_beam.runners.dataflow.internal.apiclient:Submitted job: 2020-08-20_17_59_28-8554732655575912405
INFO:apache_beam.runners.dataflow.internal.apiclient:To access the Dataflow monitoring console, please navigate to https://console.cloud.google.com/dataflow/jobs/us-central1/2020-08-20_17_59_28-8554732655575912405?project=apache-beam-testing
INFO:apache_beam.runners.dataflow.dataflow_runner:2020-08-21T00:59:27.249Z: JOB_MESSAGE_DETAILED: Autoscaling: Reduced the number of workers to 0 based on low average worker CPU utilization, and the pipeline having sufficiently low backlog and keeping up with input rate.
INFO:apache_beam.runners.dataflow.dataflow_runner:2020-08-21T00:59:27.333Z: JOB_MESSAGE_BASIC: Worker pool stopped.
INFO:apache_beam.runners.dataflow.dataflow_runner:2020-08-21T00:59:27.395Z: JOB_MESSAGE_DEBUG: Tearing down pending resources...
INFO:apache_beam.runners.dataflow.dataflow_runner:Job 2020-08-20_17_49_32-12019885076709819354 is in state JOB_STATE_DONE
WARNING:apache_beam.runners.dataflow.test_dataflow_runner:Waiting indefinitely for streaming job.
INFO:apache_beam.runners.dataflow.dataflow_runner:Job 2020-08-20_17_59_28-8554732655575912405 is in state JOB_STATE_RUNNING
test_empty_singleton_side_input (apache_beam.transforms.sideinputs_test.SideInputsTest) ... ok
INFO:apache_beam.runners.dataflow.dataflow_runner:2020-08-21T00:59:28.093Z: JOB_MESSAGE_DETAILED: Autoscaling is enabled for job 2020-08-20_17_59_28-8554732655575912405. The number of workers will be between 1 and 100.
INFO:apache_beam.runners.dataflow.dataflow_runner:2020-08-21T00:59:28.093Z: JOB_MESSAGE_WARNING: Autoscaling is enabled for Dataflow Streaming Engine. Workers will scale between 1 and 100 unless maxNumWorkers is specified.
INFO:apache_beam.runners.dataflow.dataflow_runner:2020-08-21T00:59:28.093Z: JOB_MESSAGE_DETAILED: Autoscaling was automatically enabled for job 2020-08-20_17_59_28-8554732655575912405.
INFO:apache_beam.runners.dataflow.dataflow_runner:2020-08-21T00:59:32.256Z: JOB_MESSAGE_BASIC: Worker configuration: n1-standard-2 in us-central1-a.
INFO:apache_beam.runners.dataflow.dataflow_runner:2020-08-21T00:59:33.011Z: JOB_MESSAGE_DETAILED: Expanding SplittableParDo operations into optimizable parts.
INFO:apache_beam.runners.dataflow.dataflow_runner:2020-08-21T00:59:33.042Z: JOB_MESSAGE_DETAILED: Expanding CollectionToSingleton operations into optimizable parts.
INFO:apache_beam.runners.dataflow.dataflow_runner:2020-08-21T00:59:33.110Z: JOB_MESSAGE_DETAILED: Expanding CoGroupByKey operations into optimizable parts.
INFO:apache_beam.runners.dataflow.dataflow_runner:2020-08-21T00:59:33.153Z: JOB_MESSAGE_DEBUG: Combiner lifting skipped for step assert_that/Group/GroupByKey: GroupByKey not followed by a combiner.
INFO:apache_beam.runners.dataflow.dataflow_runner:2020-08-21T00:59:33.180Z: JOB_MESSAGE_DEBUG: Combiner lifting skipped for step Create/MaybeReshuffle/Reshuffle/ReshufflePerKey/GroupByKey: GroupByKey not followed by a combiner.
INFO:apache_beam.runners.dataflow.dataflow_runner:2020-08-21T00:59:33.219Z: JOB_MESSAGE_DETAILED: Expanding SplittableProcessKeyed operations into optimizable parts.
INFO:apache_beam.runners.dataflow.dataflow_runner:2020-08-21T00:59:33.245Z: JOB_MESSAGE_DETAILED: Expanding GroupByKey operations into streaming Read/Write steps
INFO:apache_beam.runners.dataflow.dataflow_runner:2020-08-21T00:59:33.341Z: JOB_MESSAGE_DETAILED: Lifting ValueCombiningMappingFns into MergeBucketsMappingFns
INFO:apache_beam.runners.dataflow.dataflow_runner:2020-08-21T00:59:33.437Z: JOB_MESSAGE_DEBUG: Annotating graph with Autotuner information.
INFO:apache_beam.runners.dataflow.dataflow_runner:2020-08-21T00:59:33.495Z: JOB_MESSAGE_DETAILED: Fusing adjacent ParDo, Read, Write, and Flatten operations
INFO:apache_beam.runners.dataflow.dataflow_runner:2020-08-21T00:59:33.530Z: JOB_MESSAGE_DETAILED: Unzipping flatten s17 for input s15.None
INFO:apache_beam.runners.dataflow.dataflow_runner:2020-08-21T00:59:33.560Z: JOB_MESSAGE_DETAILED: Fusing unzipped copy of assert_that/Group/GroupByKey/WriteStream, through flatten assert_that/Group/Flatten, into producer assert_that/Group/pair_with_0
INFO:apache_beam.runners.dataflow.dataflow_runner:2020-08-21T00:59:33.609Z: JOB_MESSAGE_DETAILED: Fusing consumer assert_that/Group/GroupByKey/WriteStream into assert_that/Group/pair_with_1
INFO:apache_beam.runners.dataflow.dataflow_runner:2020-08-21T00:59:33.643Z: JOB_MESSAGE_DETAILED: Fusing consumer Create/MaybeReshuffle/Reshuffle/ReshufflePerKey/GroupByKey/MergeBuckets into Create/MaybeReshuffle/Reshuffle/ReshufflePerKey/GroupByKey/ReadStream
INFO:apache_beam.runners.dataflow.dataflow_runner:2020-08-21T00:59:33.676Z: JOB_MESSAGE_DETAILED: Fusing consumer Create/MaybeReshuffle/Reshuffle/ReshufflePerKey/FlatMap(restore_timestamps) into Create/MaybeReshuffle/Reshuffle/ReshufflePerKey/GroupByKey/MergeBuckets
INFO:apache_beam.runners.dataflow.dataflow_runner:2020-08-21T00:59:33.709Z: JOB_MESSAGE_DETAILED: Fusing consumer Create/MaybeReshuffle/Reshuffle/RemoveRandomKeys into Create/MaybeReshuffle/Reshuffle/ReshufflePerKey/FlatMap(restore_timestamps)
INFO:apache_beam.runners.dataflow.dataflow_runner:2020-08-21T00:59:33.744Z: JOB_MESSAGE_DETAILED: Fusing consumer Create/Map(decode) into Create/MaybeReshuffle/Reshuffle/RemoveRandomKeys
INFO:apache_beam.runners.dataflow.dataflow_runner:2020-08-21T00:59:33.779Z: JOB_MESSAGE_DETAILED: Fusing consumer Key param into Create/Map(decode)
INFO:apache_beam.runners.dataflow.dataflow_runner:2020-08-21T00:59:33.807Z: JOB_MESSAGE_DETAILED: Fusing consumer assert_that/WindowInto(WindowIntoFn) into Key param
INFO:apache_beam.runners.dataflow.dataflow_runner:2020-08-21T00:59:33.839Z: JOB_MESSAGE_DETAILED: Fusing consumer assert_that/ToVoidKey into assert_that/WindowInto(WindowIntoFn)
INFO:apache_beam.runners.dataflow.dataflow_runner:2020-08-21T00:59:33.872Z: JOB_MESSAGE_DETAILED: Fusing consumer assert_that/Group/pair_with_1 into assert_that/ToVoidKey
INFO:apache_beam.runners.dataflow.dataflow_runner:2020-08-21T00:59:33.908Z: JOB_MESSAGE_DETAILED: Fusing consumer assert_that/Group/GroupByKey/MergeBuckets into assert_that/Group/GroupByKey/ReadStream
INFO:apache_beam.runners.dataflow.dataflow_runner:2020-08-21T00:59:33.944Z: JOB_MESSAGE_DETAILED: Fusing consumer assert_that/Group/Map(_merge_tagged_vals_under_key) into assert_that/Group/GroupByKey/MergeBuckets
INFO:apache_beam.runners.dataflow.dataflow_runner:2020-08-21T00:59:33.979Z: JOB_MESSAGE_DETAILED: Fusing consumer assert_that/Unkey into assert_that/Group/Map(_merge_tagged_vals_under_key)
INFO:apache_beam.runners.dataflow.dataflow_runner:2020-08-21T00:59:34.005Z: JOB_MESSAGE_DETAILED: Fusing consumer assert_that/Match into assert_that/Unkey
INFO:apache_beam.runners.dataflow.dataflow_runner:2020-08-21T00:59:34.029Z: JOB_MESSAGE_DETAILED: Fusing consumer Create/FlatMap(<lambda at core.py:2833>) into Create/Impulse
INFO:apache_beam.runners.dataflow.dataflow_runner:2020-08-21T00:59:34.067Z: JOB_MESSAGE_DETAILED: Fusing consumer assert_that/Create/FlatMap(<lambda at core.py:2833>) into assert_that/Create/Impulse
INFO:apache_beam.runners.dataflow.dataflow_runner:2020-08-21T00:59:34.117Z: JOB_MESSAGE_DETAILED: Fusing consumer assert_that/Create/Map(decode) into assert_that/Create/FlatMap(<lambda at core.py:2833>)
INFO:apache_beam.runners.dataflow.dataflow_runner:2020-08-21T00:59:34.177Z: JOB_MESSAGE_DETAILED: Fusing consumer assert_that/Group/pair_with_0 into assert_that/Create/Map(decode)
INFO:apache_beam.runners.dataflow.dataflow_runner:2020-08-21T00:59:34.278Z: JOB_MESSAGE_DETAILED: Fusing consumer Create/MaybeReshuffle/Reshuffle/AddRandomKeys into Create/FlatMap(<lambda at core.py:2833>)
INFO:apache_beam.runners.dataflow.dataflow_runner:2020-08-21T00:59:34.357Z: JOB_MESSAGE_DETAILED: Fusing consumer Create/MaybeReshuffle/Reshuffle/ReshufflePerKey/Map(reify_timestamps) into Create/MaybeReshuffle/Reshuffle/AddRandomKeys
INFO:apache_beam.runners.dataflow.dataflow_runner:2020-08-21T00:59:34.414Z: JOB_MESSAGE_DETAILED: Fusing consumer Create/MaybeReshuffle/Reshuffle/ReshufflePerKey/GroupByKey/WriteStream into Create/MaybeReshuffle/Reshuffle/ReshufflePerKey/Map(reify_timestamps)
INFO:apache_beam.runners.dataflow.dataflow_runner:2020-08-21T00:59:34.492Z: JOB_MESSAGE_DEBUG: Workflow config is missing a default resource spec.
INFO:apache_beam.runners.dataflow.dataflow_runner:2020-08-21T00:59:34.529Z: JOB_MESSAGE_DEBUG: Adding StepResource setup and teardown to workflow graph.
INFO:apache_beam.runners.dataflow.dataflow_runner:2020-08-21T00:59:34.565Z: JOB_MESSAGE_DEBUG: Adding workflow start and stop steps.
INFO:apache_beam.runners.dataflow.dataflow_runner:2020-08-21T00:59:34.600Z: JOB_MESSAGE_DEBUG: Assigning stage ids.
INFO:apache_beam.runners.dataflow.dataflow_runner:2020-08-21T00:59:36.898Z: JOB_MESSAGE_DEBUG: Starting worker pool setup.
INFO:apache_beam.runners.dataflow.dataflow_runner:2020-08-21T00:59:36.971Z: JOB_MESSAGE_DEBUG: Starting worker pool setup.
INFO:apache_beam.runners.dataflow.dataflow_runner:2020-08-21T00:59:37.023Z: JOB_MESSAGE_BASIC: Starting 1 workers in us-central1-a...
INFO:apache_beam.runners.dataflow.dataflow_runner:2020-08-21T01:00:00.648Z: JOB_MESSAGE_WARNING: Your project already contains 100 Dataflow-created metric descriptors and Stackdriver will not create new Dataflow custom metrics for this job. Each unique user-defined metric name (independent of the DoFn in which it is defined) produces a new metric descriptor. To delete old / unused metric descriptors see https://developers.google.com/apis-explorer/#p/monitoring/v3/monitoring.projects.metricDescriptors.list and https://developers.google.com/apis-explorer/#p/monitoring/v3/monitoring.projects.metricDescriptors.delete
INFO:apache_beam.runners.dataflow.dataflow_runner:2020-08-21T01:00:07.632Z: JOB_MESSAGE_DETAILED: Autoscaling: Raised the number of workers to 1 so that the pipeline can catch up with its backlog and keep up with its input rate.
INFO:apache_beam.runners.dataflow.dataflow_runner:2020-08-21T01:00:53.774Z: JOB_MESSAGE_DETAILED: Workers have started successfully.
INFO:apache_beam.runners.dataflow.dataflow_runner:2020-08-21T01:00:53.805Z: JOB_MESSAGE_DETAILED: Workers have started successfully.
INFO:apache_beam.runners.dataflow.dataflow_runner:2020-08-21T01:06:38.770Z: JOB_MESSAGE_DETAILED: Cleaning up.
INFO:apache_beam.runners.dataflow.dataflow_runner:2020-08-21T01:06:38.897Z: JOB_MESSAGE_DEBUG: Starting worker pool teardown.
INFO:apache_beam.runners.dataflow.dataflow_runner:2020-08-21T01:06:38.922Z: JOB_MESSAGE_BASIC: Stopping worker pool...
INFO:apache_beam.runners.dataflow.dataflow_runner:2020-08-21T01:06:38.960Z: JOB_MESSAGE_DEBUG: Starting worker pool teardown.
INFO:apache_beam.runners.dataflow.dataflow_runner:2020-08-21T01:06:39.066Z: JOB_MESSAGE_BASIC: Stopping worker pool...
INFO:apache_beam.runners.dataflow.dataflow_runner:2020-08-21T01:07:28.142Z: JOB_MESSAGE_DETAILED: Autoscaling: Reduced the number of workers to 0 based on low average worker CPU utilization, and the pipeline having sufficiently low backlog and keeping up with input rate.
INFO:apache_beam.runners.dataflow.dataflow_runner:2020-08-21T01:07:28.179Z: JOB_MESSAGE_BASIC: Worker pool stopped.
INFO:apache_beam.runners.dataflow.dataflow_runner:2020-08-21T01:07:28.205Z: JOB_MESSAGE_DEBUG: Tearing down pending resources...
INFO:apache_beam.runners.dataflow.dataflow_runner:Job 2020-08-20_17_59_28-8554732655575912405 is in state JOB_STATE_DONE
test_element_param (apache_beam.pipeline_test.DoFnTest) ... ok
test_key_param (apache_beam.pipeline_test.DoFnTest) ... ok
----------------------------------------------------------------------
XML: nosetests-validatesRunnerStreamingTests-df-py27.xml
----------------------------------------------------------------------
XML: <https://ci-beam.apache.org/job/beam_PostCommit_Py_VR_Dataflow_V2/ws/src/sdks/python/nosetests.xml>
----------------------------------------------------------------------
Ran 27 tests in 2127.069s
OK
Worker logs: https://console.cloud.google.com/dataflow/jobs/us-central1/2020-08-20_17_32_36-10552198768269404645?project=apache-beam-testing
Worker logs: https://console.cloud.google.com/dataflow/jobs/us-central1/2020-08-20_17_42_17-15016623793889673312?project=apache-beam-testing
Worker logs: https://console.cloud.google.com/dataflow/jobs/us-central1/2020-08-20_17_50_52-5509105271795832909?project=apache-beam-testing
Worker logs: https://console.cloud.google.com/dataflow/jobs/us-central1/2020-08-20_17_59_28-8554732655575912405?project=apache-beam-testing
Worker logs: https://console.cloud.google.com/dataflow/jobs/us-central1/2020-08-20_17_32_35-13733730632276318157?project=apache-beam-testing
Worker logs: https://console.cloud.google.com/dataflow/jobs/us-central1/2020-08-20_17_41_07-3937514595832069395?project=apache-beam-testing
Worker logs: https://console.cloud.google.com/dataflow/jobs/us-central1/2020-08-20_17_49_32-12019885076709819354?project=apache-beam-testing
Worker logs: https://console.cloud.google.com/dataflow/jobs/us-central1/2020-08-20_17_32_37-11267026274439930686?project=apache-beam-testing
Worker logs: https://console.cloud.google.com/dataflow/jobs/us-central1/2020-08-20_17_39_45-5582741583531532169?project=apache-beam-testing
Worker logs: https://console.cloud.google.com/dataflow/jobs/us-central1/2020-08-20_17_48_21-9977250161037711777?project=apache-beam-testing
Worker logs: https://console.cloud.google.com/dataflow/jobs/us-central1/2020-08-20_17_32_36-765125314190212483?project=apache-beam-testing
Worker logs: https://console.cloud.google.com/dataflow/jobs/us-central1/2020-08-20_17_42_02-12655081143190406709?project=apache-beam-testing
Worker logs: https://console.cloud.google.com/dataflow/jobs/us-central1/2020-08-20_17_32_36-2234888580744724698?project=apache-beam-testing
Worker logs: https://console.cloud.google.com/dataflow/jobs/us-central1/2020-08-20_17_41_13-12642499918606984346?project=apache-beam-testing
Worker logs: https://console.cloud.google.com/dataflow/jobs/us-central1/2020-08-20_17_49_43-5271862855945110075?project=apache-beam-testing
Worker logs: https://console.cloud.google.com/dataflow/jobs/us-central1/2020-08-20_17_32_34-2725408810261104309?project=apache-beam-testing
Worker logs: https://console.cloud.google.com/dataflow/jobs/us-central1/2020-08-20_17_41_01-6538715684737678224?project=apache-beam-testing
Worker logs: https://console.cloud.google.com/dataflow/jobs/us-central1/2020-08-20_17_49_32-13723004897870287763?project=apache-beam-testing
Worker logs: https://console.cloud.google.com/dataflow/jobs/us-central1/2020-08-20_17_32_37-5689809499637495126?project=apache-beam-testing
Worker logs: https://console.cloud.google.com/dataflow/jobs/us-central1/2020-08-20_17_41_15-9045433656113476080?project=apache-beam-testing
Worker logs: https://console.cloud.google.com/dataflow/jobs/us-central1/2020-08-20_17_49_46-14995218310028619138?project=apache-beam-testing
Worker logs: https://console.cloud.google.com/dataflow/jobs/us-central1/2020-08-20_17_32_36-1104204695665665837?project=apache-beam-testing
Worker logs: https://console.cloud.google.com/dataflow/jobs/us-central1/2020-08-20_17_41_08-6104061088026660137?project=apache-beam-testing
Worker logs: https://console.cloud.google.com/dataflow/jobs/us-central1/2020-08-20_17_49_37-15744436223094563510?project=apache-beam-testing
FAILURE: Build failed with an exception.
* Where:
Script '<https://ci-beam.apache.org/job/beam_PostCommit_Py_VR_Dataflow_V2/ws/src/sdks/python/test-suites/dataflow/common.gradle'> line: 146
* What went wrong:
Execution failed for task ':sdks:python:test-suites:dataflow:py2:validatesRunnerBatchTests'.
> Process 'command 'sh'' finished with non-zero exit value 1
* Try:
Run with --stacktrace option to get the stack trace. Run with --info or --debug option to get more log output. Run with --scan to get full insights.
* Get more help at https://help.gradle.org
Deprecated Gradle features were used in this build, making it incompatible with Gradle 6.0.
Use '--warning-mode all' to show the individual deprecation warnings.
See https://docs.gradle.org/5.2.1/userguide/command_line_interface.html#sec:command_line_warnings
BUILD FAILED in 1h 7m 20s
65 actionable tasks: 47 executed, 18 from cache
Publishing build scan...
https://gradle.com/s/crkxde5y3rady
Build step 'Invoke Gradle script' changed build result to FAILURE
Build step 'Invoke Gradle script' marked build as failure
---------------------------------------------------------------------
To unsubscribe, e-mail: builds-unsubscribe@beam.apache.org
For additional commands, e-mail: builds-help@beam.apache.org
Jenkins build is back to normal : beam_PostCommit_Py_VR_Dataflow_V2
#951
Posted by Apache Jenkins Server <je...@builds.apache.org>.
See <https://ci-beam.apache.org/job/beam_PostCommit_Py_VR_Dataflow_V2/951/display/redirect?page=changes>
---------------------------------------------------------------------
To unsubscribe, e-mail: builds-unsubscribe@beam.apache.org
For additional commands, e-mail: builds-help@beam.apache.org
Build failed in Jenkins: beam_PostCommit_Py_VR_Dataflow_V2 #950
Posted by Apache Jenkins Server <je...@builds.apache.org>.
See <https://ci-beam.apache.org/job/beam_PostCommit_Py_VR_Dataflow_V2/950/display/redirect?page=changes>
Changes:
[Udi Meiri] Color Jenkins logs support
[ningk] Added a whitespace lint precommit job.
[ningk] Removed trailing whitespaces from all markdown and gradle build files.
[ningk] Updated jenkins precommit job README, added comments of what needs to be
[ningk] Removed trailing whitespaces from HEAD changes
[Alan Myrvold] [BEAM-10049] Add licenses for go dependencies in python, java, and go
[noreply] Propagate BigQuery streaming insert throttled time to Dataflow worker in
------------------------------------------
[...truncated 5.77 MB...]
"pipeline_proto_coder_id": "ref_Coder_FastPrimitivesCoder_4"
}
],
"is_pair_like": true,
"pipeline_proto_coder_id": "ref_Coder_FastPrimitivesCoder_4"
},
{
"@type": "kind:global_window"
}
],
"is_wrapper": true
},
"output_name": "None",
"user_name": "assert_that/Group/Map(_merge_tagged_vals_under_key).out"
}
],
"parallel_input": {
"@type": "OutputReference",
"output_name": "out",
"step_name": "s18"
},
"serialized_fn": "ref_AppliedPTransform_assert_that/Group/Map(_merge_tagged_vals_under_key)_26",
"user_name": "assert_that/Group/Map(_merge_tagged_vals_under_key)"
}
},
{
"kind": "ParallelDo",
"name": "s20",
"properties": {
"display_data": [
{
"key": "fn",
"label": "Transform Function",
"namespace": "apache_beam.transforms.core.CallableWrapperDoFn",
"type": "STRING",
"value": "<lambda>"
},
{
"key": "fn",
"label": "Transform Function",
"namespace": "apache_beam.transforms.core.ParDo",
"shortValue": "CallableWrapperDoFn",
"type": "STRING",
"value": "apache_beam.transforms.core.CallableWrapperDoFn"
}
],
"non_parallel_inputs": {},
"output_info": [
{
"encoding": {
"@type": "kind:windowed_value",
"component_encodings": [
{
"@type": "FastPrimitivesCoder$<string of 176 bytes>",
"component_encodings": [
{
"@type": "FastPrimitivesCoder$<string of 176 bytes>",
"component_encodings": [],
"pipeline_proto_coder_id": "ref_Coder_FastPrimitivesCoder_4"
},
{
"@type": "FastPrimitivesCoder$<string of 176 bytes>",
"component_encodings": [],
"pipeline_proto_coder_id": "ref_Coder_FastPrimitivesCoder_4"
}
],
"is_pair_like": true,
"pipeline_proto_coder_id": "ref_Coder_FastPrimitivesCoder_4"
},
{
"@type": "kind:global_window"
}
],
"is_wrapper": true
},
"output_name": "None",
"user_name": "assert_that/Unkey.out"
}
],
"parallel_input": {
"@type": "OutputReference",
"output_name": "None",
"step_name": "s19"
},
"serialized_fn": "ref_AppliedPTransform_assert_that/Unkey_27",
"user_name": "assert_that/Unkey"
}
},
{
"kind": "ParallelDo",
"name": "s21",
"properties": {
"display_data": [
{
"key": "fn",
"label": "Transform Function",
"namespace": "apache_beam.transforms.core.CallableWrapperDoFn",
"type": "STRING",
"value": "match"
},
{
"key": "fn",
"label": "Transform Function",
"namespace": "apache_beam.transforms.core.ParDo",
"shortValue": "CallableWrapperDoFn",
"type": "STRING",
"value": "apache_beam.transforms.core.CallableWrapperDoFn"
}
],
"non_parallel_inputs": {},
"output_info": [
{
"encoding": {
"@type": "kind:windowed_value",
"component_encodings": [
{
"@type": "FastPrimitivesCoder$<string of 176 bytes>",
"component_encodings": [
{
"@type": "FastPrimitivesCoder$<string of 176 bytes>",
"component_encodings": [],
"pipeline_proto_coder_id": "ref_Coder_FastPrimitivesCoder_4"
},
{
"@type": "FastPrimitivesCoder$<string of 176 bytes>",
"component_encodings": [],
"pipeline_proto_coder_id": "ref_Coder_FastPrimitivesCoder_4"
}
],
"is_pair_like": true,
"pipeline_proto_coder_id": "ref_Coder_FastPrimitivesCoder_4"
},
{
"@type": "kind:global_window"
}
],
"is_wrapper": true
},
"output_name": "None",
"user_name": "assert_that/Match.out"
}
],
"parallel_input": {
"@type": "OutputReference",
"output_name": "None",
"step_name": "s20"
},
"serialized_fn": "ref_AppliedPTransform_assert_that/Match_28",
"user_name": "assert_that/Match"
}
}
],
"type": "JOB_TYPE_STREAMING"
}
apache_beam.runners.dataflow.internal.apiclient: INFO: Create job: <Job
createTime: u'2020-08-21T18:34:27.639164Z'
currentStateTime: u'1970-01-01T00:00:00Z'
id: u'2020-08-21_11_34_26-16324668767225275029'
location: u'us-central1'
name: u'beamapp-jenkins-0821183415-258282'
projectId: u'apache-beam-testing'
stageStates: []
startTime: u'2020-08-21T18:34:27.639164Z'
steps: []
tempFiles: []
type: TypeValueValuesEnum(JOB_TYPE_STREAMING, 2)>
apache_beam.runners.dataflow.internal.apiclient: INFO: Created job with id: [2020-08-21_11_34_26-16324668767225275029]
apache_beam.runners.dataflow.internal.apiclient: INFO: Submitted job: 2020-08-21_11_34_26-16324668767225275029
apache_beam.runners.dataflow.internal.apiclient: INFO: To access the Dataflow monitoring console, please navigate to https://console.cloud.google.com/dataflow/jobs/us-central1/2020-08-21_11_34_26-16324668767225275029?project=apache-beam-testing
apache_beam.runners.dataflow.test_dataflow_runner: WARNING: Waiting indefinitely for streaming job.
--------------------- >> end captured logging << ---------------------
----------------------------------------------------------------------
XML: nosetests-validatesRunnerStreamingTests-df-py27.xml
----------------------------------------------------------------------
XML: <https://ci-beam.apache.org/job/beam_PostCommit_Py_VR_Dataflow_V2/ws/src/sdks/python/nosetests.xml>
----------------------------------------------------------------------
Ran 27 tests in 2083.350s
FAILED (failures=1)
Worker logs: https://console.cloud.google.com/dataflow/jobs/us-central1/2020-08-21_11_25_34-695183393083332971?project=apache-beam-testing
Worker logs: https://console.cloud.google.com/dataflow/jobs/us-central1/2020-08-21_11_34_21-5274610954966680176?project=apache-beam-testing
Worker logs: https://console.cloud.google.com/dataflow/jobs/us-central1/2020-08-21_11_42_51-13006024719503308895?project=apache-beam-testing
Worker logs: https://console.cloud.google.com/dataflow/jobs/us-central1/2020-08-21_11_51_33-511337379043119159?project=apache-beam-testing
Worker logs: https://console.cloud.google.com/dataflow/jobs/us-central1/2020-08-21_11_25_31-14522272663744589924?project=apache-beam-testing
Worker logs: https://console.cloud.google.com/dataflow/jobs/us-central1/2020-08-21_11_34_18-8751612513754157441?project=apache-beam-testing
Worker logs: https://console.cloud.google.com/dataflow/jobs/us-central1/2020-08-21_11_42_49-16269255867688638441?project=apache-beam-testing
Worker logs: https://console.cloud.google.com/dataflow/jobs/us-central1/2020-08-21_11_25_31-7227308326562037465?project=apache-beam-testing
Worker logs: https://console.cloud.google.com/dataflow/jobs/us-central1/2020-08-21_11_33_02-14989422001831852468?project=apache-beam-testing
Worker logs: https://console.cloud.google.com/dataflow/jobs/us-central1/2020-08-21_11_40_26-17907591837233739234?project=apache-beam-testing
Worker logs: https://console.cloud.google.com/dataflow/jobs/us-central1/2020-08-21_11_25_33-3200171537583395043?project=apache-beam-testing
Worker logs: https://console.cloud.google.com/dataflow/jobs/us-central1/2020-08-21_11_34_15-10827121264618778846?project=apache-beam-testing
Worker logs: https://console.cloud.google.com/dataflow/jobs/us-central1/2020-08-21_11_42_45-12845612913759507292?project=apache-beam-testing
Worker logs: https://console.cloud.google.com/dataflow/jobs/us-central1/2020-08-21_11_25_29-1246924681971573292?project=apache-beam-testing
Worker logs: https://console.cloud.google.com/dataflow/jobs/us-central1/2020-08-21_11_34_22-9304742119864252484?project=apache-beam-testing
Worker logs: https://console.cloud.google.com/dataflow/jobs/us-central1/2020-08-21_11_25_35-6503342796731394641?project=apache-beam-testing
Worker logs: https://console.cloud.google.com/dataflow/jobs/us-central1/2020-08-21_11_33_26-8556328630840327625?project=apache-beam-testing
Worker logs: https://console.cloud.google.com/dataflow/jobs/us-central1/2020-08-21_11_41_50-765678531689232707?project=apache-beam-testing
Worker logs: https://console.cloud.google.com/dataflow/jobs/us-central1/2020-08-21_11_25_37-15551888633477716501?project=apache-beam-testing
Worker logs: https://console.cloud.google.com/dataflow/jobs/us-central1/2020-08-21_11_34_26-16324668767225275029?project=apache-beam-testing
Worker logs: https://console.cloud.google.com/dataflow/jobs/us-central1/2020-08-21_11_35_02-1082180112348075734?project=apache-beam-testing
Worker logs: https://console.cloud.google.com/dataflow/jobs/us-central1/2020-08-21_11_25_29-8639948315132085861?project=apache-beam-testing
Worker logs: https://console.cloud.google.com/dataflow/jobs/us-central1/2020-08-21_11_34_18-15147267432130124557?project=apache-beam-testing
Worker logs: https://console.cloud.google.com/dataflow/jobs/us-central1/2020-08-21_11_41_38-7504267566703773340?project=apache-beam-testing
> Task :sdks:python:test-suites:dataflow:py2:validatesRunnerStreamingTests FAILED
FAILURE: Build completed with 2 failures.
1: Task failed with an exception.
-----------
* Where:
Script '<https://ci-beam.apache.org/job/beam_PostCommit_Py_VR_Dataflow_V2/ws/src/sdks/python/test-suites/dataflow/common.gradle'> line: 146
* What went wrong:
Execution failed for task ':sdks:python:test-suites:dataflow:py2:validatesRunnerBatchTests'.
> Process 'command 'sh'' finished with non-zero exit value 1
* Try:
Run with --stacktrace option to get the stack trace. Run with --info or --debug option to get more log output. Run with --scan to get full insights.
==============================================================================
2: Task failed with an exception.
-----------
* Where:
Script '<https://ci-beam.apache.org/job/beam_PostCommit_Py_VR_Dataflow_V2/ws/src/sdks/python/test-suites/dataflow/common.gradle'> line: 175
* What went wrong:
Execution failed for task ':sdks:python:test-suites:dataflow:py2:validatesRunnerStreamingTests'.
> Process 'command 'sh'' finished with non-zero exit value 1
* Try:
Run with --stacktrace option to get the stack trace. Run with --info or --debug option to get more log output. Run with --scan to get full insights.
==============================================================================
* Get more help at https://help.gradle.org
Deprecated Gradle features were used in this build, making it incompatible with Gradle 6.0.
Use '--warning-mode all' to show the individual deprecation warnings.
See https://docs.gradle.org/5.2.1/userguide/command_line_interface.html#sec:command_line_warnings
BUILD FAILED in 59m 21s
65 actionable tasks: 47 executed, 18 from cache
Publishing build scan...
https://gradle.com/s/ezqwpqzw555nm
Build step 'Invoke Gradle script' changed build result to FAILURE
Build step 'Invoke Gradle script' marked build as failure
---------------------------------------------------------------------
To unsubscribe, e-mail: builds-unsubscribe@beam.apache.org
For additional commands, e-mail: builds-help@beam.apache.org
Build failed in Jenkins: beam_PostCommit_Py_VR_Dataflow_V2 #949
Posted by Apache Jenkins Server <je...@builds.apache.org>.
See <https://ci-beam.apache.org/job/beam_PostCommit_Py_VR_Dataflow_V2/949/display/redirect>
Changes:
------------------------------------------
[...truncated 5.76 MB...]
],
"non_parallel_inputs": {},
"output_info": [
{
"encoding": {
"@type": "kind:windowed_value",
"component_encodings": [
{
"@type": "FastPrimitivesCoder$<string of 176 bytes>",
"component_encodings": [
{
"@type": "FastPrimitivesCoder$<string of 176 bytes>",
"component_encodings": [],
"pipeline_proto_coder_id": "ref_Coder_FastPrimitivesCoder_4"
},
{
"@type": "FastPrimitivesCoder$<string of 176 bytes>",
"component_encodings": [],
"pipeline_proto_coder_id": "ref_Coder_FastPrimitivesCoder_4"
}
],
"is_pair_like": true,
"pipeline_proto_coder_id": "ref_Coder_FastPrimitivesCoder_4"
},
{
"@type": "kind:global_window"
}
],
"is_wrapper": true
},
"output_name": "None",
"user_name": "assert_that/Unkey.out"
}
],
"parallel_input": {
"@type": "OutputReference",
"output_name": "None",
"step_name": "s19"
},
"serialized_fn": "ref_AppliedPTransform_assert_that/Unkey_29",
"user_name": "assert_that/Unkey"
}
},
{
"kind": "ParallelDo",
"name": "s21",
"properties": {
"display_data": [
{
"key": "fn",
"label": "Transform Function",
"namespace": "apache_beam.transforms.core.CallableWrapperDoFn",
"type": "STRING",
"value": "_equal"
},
{
"key": "fn",
"label": "Transform Function",
"namespace": "apache_beam.transforms.core.ParDo",
"shortValue": "CallableWrapperDoFn",
"type": "STRING",
"value": "apache_beam.transforms.core.CallableWrapperDoFn"
}
],
"non_parallel_inputs": {},
"output_info": [
{
"encoding": {
"@type": "kind:windowed_value",
"component_encodings": [
{
"@type": "FastPrimitivesCoder$<string of 176 bytes>",
"component_encodings": [
{
"@type": "FastPrimitivesCoder$<string of 176 bytes>",
"component_encodings": [],
"pipeline_proto_coder_id": "ref_Coder_FastPrimitivesCoder_4"
},
{
"@type": "FastPrimitivesCoder$<string of 176 bytes>",
"component_encodings": [],
"pipeline_proto_coder_id": "ref_Coder_FastPrimitivesCoder_4"
}
],
"is_pair_like": true,
"pipeline_proto_coder_id": "ref_Coder_FastPrimitivesCoder_4"
},
{
"@type": "kind:global_window"
}
],
"is_wrapper": true
},
"output_name": "None",
"user_name": "assert_that/Match.out"
}
],
"parallel_input": {
"@type": "OutputReference",
"output_name": "None",
"step_name": "s20"
},
"serialized_fn": "ref_AppliedPTransform_assert_that/Match_30",
"user_name": "assert_that/Match"
}
}
],
"type": "JOB_TYPE_STREAMING"
}
INFO:apache_beam.runners.dataflow.internal.apiclient:Create job: <Job
createTime: u'2020-08-21T12:57:09.272819Z'
currentStateTime: u'1970-01-01T00:00:00Z'
id: u'2020-08-21_05_57_08-10312864123147351113'
location: u'us-central1'
name: u'beamapp-jenkins-0821125656-505638'
projectId: u'apache-beam-testing'
stageStates: []
startTime: u'2020-08-21T12:57:09.272819Z'
steps: []
tempFiles: []
type: TypeValueValuesEnum(JOB_TYPE_STREAMING, 2)>
INFO:apache_beam.runners.dataflow.internal.apiclient:Created job with id: [2020-08-21_05_57_08-10312864123147351113]
INFO:apache_beam.runners.dataflow.internal.apiclient:Submitted job: 2020-08-21_05_57_08-10312864123147351113
INFO:apache_beam.runners.dataflow.internal.apiclient:To access the Dataflow monitoring console, please navigate to https://console.cloud.google.com/dataflow/jobs/us-central1/2020-08-21_05_57_08-10312864123147351113?project=apache-beam-testing
WARNING:apache_beam.runners.dataflow.test_dataflow_runner:Waiting indefinitely for streaming job.
INFO:apache_beam.runners.dataflow.dataflow_runner:Job 2020-08-21_05_57_08-10312864123147351113 is in state JOB_STATE_RUNNING
INFO:apache_beam.runners.dataflow.dataflow_runner:2020-08-21T12:57:08.387Z: JOB_MESSAGE_WARNING: Autoscaling is enabled for Dataflow Streaming Engine. Workers will scale between 1 and 100 unless maxNumWorkers is specified.
INFO:apache_beam.runners.dataflow.dataflow_runner:2020-08-21T12:57:08.387Z: JOB_MESSAGE_DETAILED: Autoscaling is enabled for job 2020-08-21_05_57_08-10312864123147351113. The number of workers will be between 1 and 100.
INFO:apache_beam.runners.dataflow.dataflow_runner:2020-08-21T12:57:08.387Z: JOB_MESSAGE_DETAILED: Autoscaling was automatically enabled for job 2020-08-21_05_57_08-10312864123147351113.
INFO:apache_beam.runners.dataflow.dataflow_runner:2020-08-21T12:57:12.340Z: JOB_MESSAGE_BASIC: Worker configuration: n1-standard-2 in us-central1-f.
INFO:apache_beam.runners.dataflow.dataflow_runner:2020-08-21T12:57:13.075Z: JOB_MESSAGE_DETAILED: Expanding SplittableParDo operations into optimizable parts.
INFO:apache_beam.runners.dataflow.dataflow_runner:2020-08-21T12:57:13.109Z: JOB_MESSAGE_DETAILED: Expanding CollectionToSingleton operations into optimizable parts.
INFO:apache_beam.runners.dataflow.dataflow_runner:2020-08-21T12:57:13.193Z: JOB_MESSAGE_DETAILED: Expanding CoGroupByKey operations into optimizable parts.
INFO:apache_beam.runners.dataflow.dataflow_runner:2020-08-21T12:57:13.229Z: JOB_MESSAGE_DEBUG: Combiner lifting skipped for step assert_that/Group/GroupByKey: GroupByKey not followed by a combiner.
INFO:apache_beam.runners.dataflow.dataflow_runner:2020-08-21T12:57:13.330Z: JOB_MESSAGE_DEBUG: Combiner lifting skipped for step Create/MaybeReshuffle/Reshuffle/ReshufflePerKey/GroupByKey: GroupByKey not followed by a combiner.
INFO:apache_beam.runners.dataflow.dataflow_runner:2020-08-21T12:57:13.381Z: JOB_MESSAGE_DETAILED: Expanding SplittableProcessKeyed operations into optimizable parts.
INFO:apache_beam.runners.dataflow.dataflow_runner:2020-08-21T12:57:13.412Z: JOB_MESSAGE_DETAILED: Expanding GroupByKey operations into streaming Read/Write steps
INFO:apache_beam.runners.dataflow.dataflow_runner:2020-08-21T12:57:13.531Z: JOB_MESSAGE_DETAILED: Lifting ValueCombiningMappingFns into MergeBucketsMappingFns
INFO:apache_beam.runners.dataflow.dataflow_runner:2020-08-21T12:57:13.637Z: JOB_MESSAGE_DEBUG: Annotating graph with Autotuner information.
INFO:apache_beam.runners.dataflow.dataflow_runner:2020-08-21T12:57:13.692Z: JOB_MESSAGE_DETAILED: Fusing adjacent ParDo, Read, Write, and Flatten operations
INFO:apache_beam.runners.dataflow.dataflow_runner:2020-08-21T12:57:13.729Z: JOB_MESSAGE_DETAILED: Unzipping flatten s17 for input s15.None
INFO:apache_beam.runners.dataflow.dataflow_runner:2020-08-21T12:57:13.764Z: JOB_MESSAGE_DETAILED: Fusing unzipped copy of assert_that/Group/GroupByKey/WriteStream, through flatten assert_that/Group/Flatten, into producer assert_that/Group/pair_with_0
INFO:apache_beam.runners.dataflow.dataflow_runner:2020-08-21T12:57:13.799Z: JOB_MESSAGE_DETAILED: Fusing consumer assert_that/Group/GroupByKey/WriteStream into assert_that/Group/pair_with_1
INFO:apache_beam.runners.dataflow.dataflow_runner:2020-08-21T12:57:13.823Z: JOB_MESSAGE_DETAILED: Fusing consumer Create/MaybeReshuffle/Reshuffle/ReshufflePerKey/GroupByKey/MergeBuckets into Create/MaybeReshuffle/Reshuffle/ReshufflePerKey/GroupByKey/ReadStream
INFO:apache_beam.runners.dataflow.dataflow_runner:2020-08-21T12:57:13.845Z: JOB_MESSAGE_DETAILED: Fusing consumer Create/MaybeReshuffle/Reshuffle/ReshufflePerKey/FlatMap(restore_timestamps) into Create/MaybeReshuffle/Reshuffle/ReshufflePerKey/GroupByKey/MergeBuckets
INFO:apache_beam.runners.dataflow.dataflow_runner:2020-08-21T12:57:13.880Z: JOB_MESSAGE_DETAILED: Fusing consumer Create/MaybeReshuffle/Reshuffle/RemoveRandomKeys into Create/MaybeReshuffle/Reshuffle/ReshufflePerKey/FlatMap(restore_timestamps)
INFO:apache_beam.runners.dataflow.dataflow_runner:2020-08-21T12:57:13.919Z: JOB_MESSAGE_DETAILED: Fusing consumer Create/Map(decode) into Create/MaybeReshuffle/Reshuffle/RemoveRandomKeys
INFO:apache_beam.runners.dataflow.dataflow_runner:2020-08-21T12:57:13.947Z: JOB_MESSAGE_DETAILED: Fusing consumer Key param into Create/Map(decode)
INFO:apache_beam.runners.dataflow.dataflow_runner:2020-08-21T12:57:13.985Z: JOB_MESSAGE_DETAILED: Fusing consumer assert_that/WindowInto(WindowIntoFn) into Key param
INFO:apache_beam.runners.dataflow.dataflow_runner:2020-08-21T12:57:14.023Z: JOB_MESSAGE_DETAILED: Fusing consumer assert_that/ToVoidKey into assert_that/WindowInto(WindowIntoFn)
INFO:apache_beam.runners.dataflow.dataflow_runner:2020-08-21T12:57:14.062Z: JOB_MESSAGE_DETAILED: Fusing consumer assert_that/Group/pair_with_1 into assert_that/ToVoidKey
INFO:apache_beam.runners.dataflow.dataflow_runner:2020-08-21T12:57:14.089Z: JOB_MESSAGE_DETAILED: Fusing consumer assert_that/Group/GroupByKey/MergeBuckets into assert_that/Group/GroupByKey/ReadStream
INFO:apache_beam.runners.dataflow.dataflow_runner:2020-08-21T12:57:14.113Z: JOB_MESSAGE_DETAILED: Fusing consumer assert_that/Group/Map(_merge_tagged_vals_under_key) into assert_that/Group/GroupByKey/MergeBuckets
INFO:apache_beam.runners.dataflow.dataflow_runner:2020-08-21T12:57:14.144Z: JOB_MESSAGE_DETAILED: Fusing consumer assert_that/Unkey into assert_that/Group/Map(_merge_tagged_vals_under_key)
INFO:apache_beam.runners.dataflow.dataflow_runner:2020-08-21T12:57:14.179Z: JOB_MESSAGE_DETAILED: Fusing consumer assert_that/Match into assert_that/Unkey
INFO:apache_beam.runners.dataflow.dataflow_runner:2020-08-21T12:57:14.214Z: JOB_MESSAGE_DETAILED: Fusing consumer Create/FlatMap(<lambda at core.py:2833>) into Create/Impulse
INFO:apache_beam.runners.dataflow.dataflow_runner:2020-08-21T12:57:14.253Z: JOB_MESSAGE_DETAILED: Fusing consumer assert_that/Create/FlatMap(<lambda at core.py:2833>) into assert_that/Create/Impulse
INFO:apache_beam.runners.dataflow.dataflow_runner:2020-08-21T12:57:14.282Z: JOB_MESSAGE_DETAILED: Fusing consumer assert_that/Create/Map(decode) into assert_that/Create/FlatMap(<lambda at core.py:2833>)
INFO:apache_beam.runners.dataflow.dataflow_runner:2020-08-21T12:57:14.315Z: JOB_MESSAGE_DETAILED: Fusing consumer assert_that/Group/pair_with_0 into assert_that/Create/Map(decode)
INFO:apache_beam.runners.dataflow.dataflow_runner:2020-08-21T12:57:14.350Z: JOB_MESSAGE_DETAILED: Fusing consumer Create/MaybeReshuffle/Reshuffle/AddRandomKeys into Create/FlatMap(<lambda at core.py:2833>)
INFO:apache_beam.runners.dataflow.dataflow_runner:2020-08-21T12:57:14.394Z: JOB_MESSAGE_DETAILED: Fusing consumer Create/MaybeReshuffle/Reshuffle/ReshufflePerKey/Map(reify_timestamps) into Create/MaybeReshuffle/Reshuffle/AddRandomKeys
INFO:apache_beam.runners.dataflow.dataflow_runner:2020-08-21T12:57:14.426Z: JOB_MESSAGE_DETAILED: Fusing consumer Create/MaybeReshuffle/Reshuffle/ReshufflePerKey/GroupByKey/WriteStream into Create/MaybeReshuffle/Reshuffle/ReshufflePerKey/Map(reify_timestamps)
INFO:apache_beam.runners.dataflow.dataflow_runner:2020-08-21T12:57:14.466Z: JOB_MESSAGE_DEBUG: Workflow config is missing a default resource spec.
INFO:apache_beam.runners.dataflow.dataflow_runner:2020-08-21T12:57:14.491Z: JOB_MESSAGE_DEBUG: Adding StepResource setup and teardown to workflow graph.
INFO:apache_beam.runners.dataflow.dataflow_runner:2020-08-21T12:57:14.524Z: JOB_MESSAGE_DEBUG: Adding workflow start and stop steps.
INFO:apache_beam.runners.dataflow.dataflow_runner:2020-08-21T12:57:14.554Z: JOB_MESSAGE_DEBUG: Assigning stage ids.
INFO:apache_beam.runners.dataflow.dataflow_runner:2020-08-21T12:57:18.949Z: JOB_MESSAGE_DEBUG: Starting worker pool setup.
INFO:apache_beam.runners.dataflow.dataflow_runner:2020-08-21T12:57:18.985Z: JOB_MESSAGE_DEBUG: Starting worker pool setup.
INFO:apache_beam.runners.dataflow.dataflow_runner:2020-08-21T12:57:19.028Z: JOB_MESSAGE_BASIC: Starting 1 workers in us-central1-f...
INFO:apache_beam.runners.dataflow.dataflow_runner:2020-08-21T12:57:20.532Z: JOB_MESSAGE_DETAILED: Autoscaling: Reduced the number of workers to 0 based on low average worker CPU utilization, and the pipeline having sufficiently low backlog and keeping up with input rate.
INFO:apache_beam.runners.dataflow.dataflow_runner:2020-08-21T12:57:20.576Z: JOB_MESSAGE_BASIC: Worker pool stopped.
INFO:apache_beam.runners.dataflow.dataflow_runner:2020-08-21T12:57:20.604Z: JOB_MESSAGE_DEBUG: Tearing down pending resources...
INFO:apache_beam.runners.dataflow.dataflow_runner:Job 2020-08-21_05_47_32-18427808714567088474 is in state JOB_STATE_DONE
test_default_value_singleton_side_input (apache_beam.transforms.sideinputs_test.SideInputsTest) ... ok
INFO:apache_beam.runners.dataflow.dataflow_runner:2020-08-21T12:57:44.171Z: JOB_MESSAGE_WARNING: Your project already contains 100 Dataflow-created metric descriptors and Stackdriver will not create new Dataflow custom metrics for this job. Each unique user-defined metric name (independent of the DoFn in which it is defined) produces a new metric descriptor. To delete old / unused metric descriptors see https://developers.google.com/apis-explorer/#p/monitoring/v3/monitoring.projects.metricDescriptors.list and https://developers.google.com/apis-explorer/#p/monitoring/v3/monitoring.projects.metricDescriptors.delete
INFO:apache_beam.runners.dataflow.dataflow_runner:2020-08-21T12:57:48.755Z: JOB_MESSAGE_DETAILED: Autoscaling: Raised the number of workers to 1 so that the pipeline can catch up with its backlog and keep up with its input rate.
INFO:apache_beam.runners.dataflow.dataflow_runner:2020-08-21T12:58:30.981Z: JOB_MESSAGE_DETAILED: Workers have started successfully.
INFO:apache_beam.runners.dataflow.dataflow_runner:2020-08-21T12:58:31.025Z: JOB_MESSAGE_DETAILED: Workers have started successfully.
INFO:apache_beam.runners.dataflow.dataflow_runner:2020-08-21T13:04:20.575Z: JOB_MESSAGE_DETAILED: Cleaning up.
INFO:apache_beam.runners.dataflow.dataflow_runner:2020-08-21T13:04:20.626Z: JOB_MESSAGE_DEBUG: Starting worker pool teardown.
INFO:apache_beam.runners.dataflow.dataflow_runner:2020-08-21T13:04:20.665Z: JOB_MESSAGE_BASIC: Stopping worker pool...
INFO:apache_beam.runners.dataflow.dataflow_runner:2020-08-21T13:04:20.708Z: JOB_MESSAGE_DEBUG: Starting worker pool teardown.
INFO:apache_beam.runners.dataflow.dataflow_runner:2020-08-21T13:04:20.731Z: JOB_MESSAGE_BASIC: Stopping worker pool...
INFO:apache_beam.runners.dataflow.dataflow_runner:2020-08-21T13:05:15.048Z: JOB_MESSAGE_DETAILED: Autoscaling: Reduced the number of workers to 0 based on low average worker CPU utilization, and the pipeline having sufficiently low backlog and keeping up with input rate.
INFO:apache_beam.runners.dataflow.dataflow_runner:2020-08-21T13:05:15.093Z: JOB_MESSAGE_BASIC: Worker pool stopped.
INFO:apache_beam.runners.dataflow.dataflow_runner:2020-08-21T13:05:15.132Z: JOB_MESSAGE_DEBUG: Tearing down pending resources...
INFO:apache_beam.runners.dataflow.dataflow_runner:Job 2020-08-21_05_57_08-10312864123147351113 is in state JOB_STATE_DONE
test_element_param (apache_beam.pipeline_test.DoFnTest) ... ok
test_key_param (apache_beam.pipeline_test.DoFnTest) ... ok
----------------------------------------------------------------------
XML: nosetests-validatesRunnerStreamingTests-df-py27.xml
----------------------------------------------------------------------
XML: <https://ci-beam.apache.org/job/beam_PostCommit_Py_VR_Dataflow_V2/ws/src/sdks/python/nosetests.xml>
----------------------------------------------------------------------
Ran 27 tests in 2056.141s
OK
Worker logs: https://console.cloud.google.com/dataflow/jobs/us-central1/2020-08-21_05_31_30-15204012665230037301?project=apache-beam-testing
Worker logs: https://console.cloud.google.com/dataflow/jobs/us-central1/2020-08-21_05_40_08-4548734801226173568?project=apache-beam-testing
Worker logs: https://console.cloud.google.com/dataflow/jobs/us-central1/2020-08-21_05_48_34-3507310713189797049?project=apache-beam-testing
Worker logs: https://console.cloud.google.com/dataflow/jobs/us-central1/2020-08-21_05_57_08-10312864123147351113?project=apache-beam-testing
Worker logs: https://console.cloud.google.com/dataflow/jobs/us-central1/2020-08-21_05_31_29-3154555827492252034?project=apache-beam-testing
Worker logs: https://console.cloud.google.com/dataflow/jobs/us-central1/2020-08-21_05_38_52-4844559788962660304?project=apache-beam-testing
Worker logs: https://console.cloud.google.com/dataflow/jobs/us-central1/2020-08-21_05_47_24-17643420753938427321?project=apache-beam-testing
Worker logs: https://console.cloud.google.com/dataflow/jobs/us-central1/2020-08-21_05_31_31-2020812458812102854?project=apache-beam-testing
Worker logs: https://console.cloud.google.com/dataflow/jobs/us-central1/2020-08-21_05_40_06-6395398500310077689?project=apache-beam-testing
Worker logs: https://console.cloud.google.com/dataflow/jobs/us-central1/2020-08-21_05_48_35-5864306541223578216?project=apache-beam-testing
Worker logs: https://console.cloud.google.com/dataflow/jobs/us-central1/2020-08-21_05_31_32-6045523445187612345?project=apache-beam-testing
Worker logs: https://console.cloud.google.com/dataflow/jobs/us-central1/2020-08-21_05_40_05-12772738058387210991?project=apache-beam-testing
Worker logs: https://console.cloud.google.com/dataflow/jobs/us-central1/2020-08-21_05_31_29-3218648108341176662?project=apache-beam-testing
Worker logs: https://console.cloud.google.com/dataflow/jobs/us-central1/2020-08-21_05_39_53-8497507539594147029?project=apache-beam-testing
Worker logs: https://console.cloud.google.com/dataflow/jobs/us-central1/2020-08-21_05_48_31-9850396734633965568?project=apache-beam-testing
Worker logs: https://console.cloud.google.com/dataflow/jobs/us-central1/2020-08-21_05_31_31-18263098066554485281?project=apache-beam-testing
Worker logs: https://console.cloud.google.com/dataflow/jobs/us-central1/2020-08-21_05_39_10-17169612562666810457?project=apache-beam-testing
Worker logs: https://console.cloud.google.com/dataflow/jobs/us-central1/2020-08-21_05_47_47-1105994114373444158?project=apache-beam-testing
Worker logs: https://console.cloud.google.com/dataflow/jobs/us-central1/2020-08-21_05_31_31-6899741842650360734?project=apache-beam-testing
Worker logs: https://console.cloud.google.com/dataflow/jobs/us-central1/2020-08-21_05_39_59-11116100983806270449?project=apache-beam-testing
Worker logs: https://console.cloud.google.com/dataflow/jobs/us-central1/2020-08-21_05_47_32-18427808714567088474?project=apache-beam-testing
Worker logs: https://console.cloud.google.com/dataflow/jobs/us-central1/2020-08-21_05_31_29-6506985064383922600?project=apache-beam-testing
Worker logs: https://console.cloud.google.com/dataflow/jobs/us-central1/2020-08-21_05_39_59-11596918532017954193?project=apache-beam-testing
Worker logs: https://console.cloud.google.com/dataflow/jobs/us-central1/2020-08-21_05_48_21-9201832632744062617?project=apache-beam-testing
FAILURE: Build failed with an exception.
* Where:
Script '<https://ci-beam.apache.org/job/beam_PostCommit_Py_VR_Dataflow_V2/ws/src/sdks/python/test-suites/dataflow/common.gradle'> line: 146
* What went wrong:
Execution failed for task ':sdks:python:test-suites:dataflow:py2:validatesRunnerBatchTests'.
> Process 'command 'sh'' finished with non-zero exit value 1
* Try:
Run with --stacktrace option to get the stack trace. Run with --info or --debug option to get more log output. Run with --scan to get full insights.
* Get more help at https://help.gradle.org
Deprecated Gradle features were used in this build, making it incompatible with Gradle 6.0.
Use '--warning-mode all' to show the individual deprecation warnings.
See https://docs.gradle.org/5.2.1/userguide/command_line_interface.html#sec:command_line_warnings
BUILD FAILED in 1h 5m 3s
65 actionable tasks: 47 executed, 18 from cache
Publishing build scan...
https://gradle.com/s/bwpnvua4oogbe
Build step 'Invoke Gradle script' changed build result to FAILURE
Build step 'Invoke Gradle script' marked build as failure
---------------------------------------------------------------------
To unsubscribe, e-mail: builds-unsubscribe@beam.apache.org
For additional commands, e-mail: builds-help@beam.apache.org
Build failed in Jenkins: beam_PostCommit_Py_VR_Dataflow_V2 #948
Posted by Apache Jenkins Server <je...@builds.apache.org>.
See <https://ci-beam.apache.org/job/beam_PostCommit_Py_VR_Dataflow_V2/948/display/redirect>
Changes:
------------------------------------------
[...truncated 5.47 MB...]
"shortValue": "CallableWrapperDoFn",
"type": "STRING",
"value": "apache_beam.transforms.core.CallableWrapperDoFn"
}
],
"non_parallel_inputs": {},
"output_info": [
{
"encoding": {
"@type": "kind:windowed_value",
"component_encodings": [
{
"@type": "FastPrimitivesCoder$<string of 176 bytes>",
"component_encodings": [
{
"@type": "FastPrimitivesCoder$<string of 176 bytes>",
"component_encodings": [],
"pipeline_proto_coder_id": "ref_Coder_FastPrimitivesCoder_4"
},
{
"@type": "FastPrimitivesCoder$<string of 176 bytes>",
"component_encodings": [],
"pipeline_proto_coder_id": "ref_Coder_FastPrimitivesCoder_4"
}
],
"is_pair_like": true,
"pipeline_proto_coder_id": "ref_Coder_FastPrimitivesCoder_4"
},
{
"@type": "kind:global_window"
}
],
"is_wrapper": true
},
"output_name": "None",
"user_name": "assert_that/Unkey.out"
}
],
"parallel_input": {
"@type": "OutputReference",
"output_name": "None",
"step_name": "s19"
},
"serialized_fn": "ref_AppliedPTransform_assert_that/Unkey_29",
"user_name": "assert_that/Unkey"
}
},
{
"kind": "ParallelDo",
"name": "s21",
"properties": {
"display_data": [
{
"key": "fn",
"label": "Transform Function",
"namespace": "apache_beam.transforms.core.CallableWrapperDoFn",
"type": "STRING",
"value": "_equal"
},
{
"key": "fn",
"label": "Transform Function",
"namespace": "apache_beam.transforms.core.ParDo",
"shortValue": "CallableWrapperDoFn",
"type": "STRING",
"value": "apache_beam.transforms.core.CallableWrapperDoFn"
}
],
"non_parallel_inputs": {},
"output_info": [
{
"encoding": {
"@type": "kind:windowed_value",
"component_encodings": [
{
"@type": "FastPrimitivesCoder$<string of 176 bytes>",
"component_encodings": [
{
"@type": "FastPrimitivesCoder$<string of 176 bytes>",
"component_encodings": [],
"pipeline_proto_coder_id": "ref_Coder_FastPrimitivesCoder_4"
},
{
"@type": "FastPrimitivesCoder$<string of 176 bytes>",
"component_encodings": [],
"pipeline_proto_coder_id": "ref_Coder_FastPrimitivesCoder_4"
}
],
"is_pair_like": true,
"pipeline_proto_coder_id": "ref_Coder_FastPrimitivesCoder_4"
},
{
"@type": "kind:global_window"
}
],
"is_wrapper": true
},
"output_name": "None",
"user_name": "assert_that/Match.out"
}
],
"parallel_input": {
"@type": "OutputReference",
"output_name": "None",
"step_name": "s20"
},
"serialized_fn": "ref_AppliedPTransform_assert_that/Match_30",
"user_name": "assert_that/Match"
}
}
],
"type": "JOB_TYPE_STREAMING"
}
INFO:apache_beam.runners.dataflow.internal.apiclient:Create job: <Job
createTime: u'2020-08-21T06:58:27.283204Z'
currentStateTime: u'1970-01-01T00:00:00Z'
id: u'2020-08-20_23_58_26-2408556687225993915'
location: u'us-central1'
name: u'beamapp-jenkins-0821065815-216629'
projectId: u'apache-beam-testing'
stageStates: []
startTime: u'2020-08-21T06:58:27.283204Z'
steps: []
tempFiles: []
type: TypeValueValuesEnum(JOB_TYPE_STREAMING, 2)>
INFO:apache_beam.runners.dataflow.internal.apiclient:Created job with id: [2020-08-20_23_58_26-2408556687225993915]
INFO:apache_beam.runners.dataflow.internal.apiclient:Submitted job: 2020-08-20_23_58_26-2408556687225993915
INFO:apache_beam.runners.dataflow.internal.apiclient:To access the Dataflow monitoring console, please navigate to https://console.cloud.google.com/dataflow/jobs/us-central1/2020-08-20_23_58_26-2408556687225993915?project=apache-beam-testing
WARNING:apache_beam.runners.dataflow.test_dataflow_runner:Waiting indefinitely for streaming job.
INFO:apache_beam.runners.dataflow.dataflow_runner:Job 2020-08-20_23_58_26-2408556687225993915 is in state JOB_STATE_RUNNING
INFO:apache_beam.runners.dataflow.dataflow_runner:2020-08-21T06:58:26.264Z: JOB_MESSAGE_DETAILED: Autoscaling is enabled for job 2020-08-20_23_58_26-2408556687225993915. The number of workers will be between 1 and 100.
INFO:apache_beam.runners.dataflow.dataflow_runner:2020-08-21T06:58:26.264Z: JOB_MESSAGE_DETAILED: Autoscaling was automatically enabled for job 2020-08-20_23_58_26-2408556687225993915.
INFO:apache_beam.runners.dataflow.dataflow_runner:2020-08-21T06:58:26.264Z: JOB_MESSAGE_WARNING: Autoscaling is enabled for Dataflow Streaming Engine. Workers will scale between 1 and 100 unless maxNumWorkers is specified.
INFO:apache_beam.runners.dataflow.dataflow_runner:2020-08-21T06:58:31.609Z: JOB_MESSAGE_BASIC: Worker configuration: n1-standard-2 in us-central1-f.
INFO:apache_beam.runners.dataflow.dataflow_runner:2020-08-21T06:58:32.350Z: JOB_MESSAGE_DETAILED: Expanding SplittableParDo operations into optimizable parts.
INFO:apache_beam.runners.dataflow.dataflow_runner:2020-08-21T06:58:32.370Z: JOB_MESSAGE_DETAILED: Expanding CollectionToSingleton operations into optimizable parts.
INFO:apache_beam.runners.dataflow.dataflow_runner:2020-08-21T06:58:32.445Z: JOB_MESSAGE_DETAILED: Expanding CoGroupByKey operations into optimizable parts.
INFO:apache_beam.runners.dataflow.dataflow_runner:2020-08-21T06:58:32.482Z: JOB_MESSAGE_DEBUG: Combiner lifting skipped for step assert_that/Group/GroupByKey: GroupByKey not followed by a combiner.
INFO:apache_beam.runners.dataflow.dataflow_runner:2020-08-21T06:58:32.505Z: JOB_MESSAGE_DEBUG: Combiner lifting skipped for step Create/MaybeReshuffle/Reshuffle/ReshufflePerKey/GroupByKey: GroupByKey not followed by a combiner.
INFO:apache_beam.runners.dataflow.dataflow_runner:2020-08-21T06:58:32.532Z: JOB_MESSAGE_DETAILED: Expanding SplittableProcessKeyed operations into optimizable parts.
INFO:apache_beam.runners.dataflow.dataflow_runner:2020-08-21T06:58:32.564Z: JOB_MESSAGE_DETAILED: Expanding GroupByKey operations into streaming Read/Write steps
INFO:apache_beam.runners.dataflow.dataflow_runner:2020-08-21T06:58:32.668Z: JOB_MESSAGE_DETAILED: Lifting ValueCombiningMappingFns into MergeBucketsMappingFns
INFO:apache_beam.runners.dataflow.dataflow_runner:2020-08-21T06:58:32.750Z: JOB_MESSAGE_DEBUG: Annotating graph with Autotuner information.
INFO:apache_beam.runners.dataflow.dataflow_runner:2020-08-21T06:58:32.791Z: JOB_MESSAGE_DETAILED: Fusing adjacent ParDo, Read, Write, and Flatten operations
INFO:apache_beam.runners.dataflow.dataflow_runner:2020-08-21T06:58:32.821Z: JOB_MESSAGE_DETAILED: Unzipping flatten s17 for input s15.None
INFO:apache_beam.runners.dataflow.dataflow_runner:2020-08-21T06:58:32.857Z: JOB_MESSAGE_DETAILED: Fusing unzipped copy of assert_that/Group/GroupByKey/WriteStream, through flatten assert_that/Group/Flatten, into producer assert_that/Group/pair_with_0
INFO:apache_beam.runners.dataflow.dataflow_runner:2020-08-21T06:58:32.892Z: JOB_MESSAGE_DETAILED: Fusing consumer assert_that/Group/GroupByKey/WriteStream into assert_that/Group/pair_with_1
INFO:apache_beam.runners.dataflow.dataflow_runner:2020-08-21T06:58:32.927Z: JOB_MESSAGE_DETAILED: Fusing consumer Create/MaybeReshuffle/Reshuffle/ReshufflePerKey/GroupByKey/MergeBuckets into Create/MaybeReshuffle/Reshuffle/ReshufflePerKey/GroupByKey/ReadStream
INFO:apache_beam.runners.dataflow.dataflow_runner:2020-08-21T06:58:32.964Z: JOB_MESSAGE_DETAILED: Fusing consumer Create/MaybeReshuffle/Reshuffle/ReshufflePerKey/FlatMap(restore_timestamps) into Create/MaybeReshuffle/Reshuffle/ReshufflePerKey/GroupByKey/MergeBuckets
INFO:apache_beam.runners.dataflow.dataflow_runner:2020-08-21T06:58:32.989Z: JOB_MESSAGE_DETAILED: Fusing consumer Create/MaybeReshuffle/Reshuffle/RemoveRandomKeys into Create/MaybeReshuffle/Reshuffle/ReshufflePerKey/FlatMap(restore_timestamps)
INFO:apache_beam.runners.dataflow.dataflow_runner:2020-08-21T06:58:33.025Z: JOB_MESSAGE_DETAILED: Fusing consumer Create/Map(decode) into Create/MaybeReshuffle/Reshuffle/RemoveRandomKeys
INFO:apache_beam.runners.dataflow.dataflow_runner:2020-08-21T06:58:33.057Z: JOB_MESSAGE_DETAILED: Fusing consumer Key param into Create/Map(decode)
INFO:apache_beam.runners.dataflow.dataflow_runner:2020-08-21T06:58:33.159Z: JOB_MESSAGE_DETAILED: Fusing consumer assert_that/WindowInto(WindowIntoFn) into Key param
INFO:apache_beam.runners.dataflow.dataflow_runner:2020-08-21T06:58:33.217Z: JOB_MESSAGE_DETAILED: Fusing consumer assert_that/ToVoidKey into assert_that/WindowInto(WindowIntoFn)
INFO:apache_beam.runners.dataflow.dataflow_runner:2020-08-21T06:58:33.326Z: JOB_MESSAGE_DETAILED: Fusing consumer assert_that/Group/pair_with_1 into assert_that/ToVoidKey
INFO:apache_beam.runners.dataflow.dataflow_runner:2020-08-21T06:58:33.429Z: JOB_MESSAGE_DETAILED: Fusing consumer assert_that/Group/GroupByKey/MergeBuckets into assert_that/Group/GroupByKey/ReadStream
INFO:apache_beam.runners.dataflow.dataflow_runner:2020-08-21T06:58:33.458Z: JOB_MESSAGE_DETAILED: Fusing consumer assert_that/Group/Map(_merge_tagged_vals_under_key) into assert_that/Group/GroupByKey/MergeBuckets
INFO:apache_beam.runners.dataflow.dataflow_runner:2020-08-21T06:58:33.500Z: JOB_MESSAGE_DETAILED: Fusing consumer assert_that/Unkey into assert_that/Group/Map(_merge_tagged_vals_under_key)
INFO:apache_beam.runners.dataflow.dataflow_runner:2020-08-21T06:58:33.567Z: JOB_MESSAGE_DETAILED: Fusing consumer assert_that/Match into assert_that/Unkey
INFO:apache_beam.runners.dataflow.dataflow_runner:2020-08-21T06:58:33.620Z: JOB_MESSAGE_DETAILED: Fusing consumer Create/FlatMap(<lambda at core.py:2833>) into Create/Impulse
INFO:apache_beam.runners.dataflow.dataflow_runner:2020-08-21T06:58:33.676Z: JOB_MESSAGE_DETAILED: Fusing consumer assert_that/Create/FlatMap(<lambda at core.py:2833>) into assert_that/Create/Impulse
INFO:apache_beam.runners.dataflow.dataflow_runner:2020-08-21T06:58:33.723Z: JOB_MESSAGE_DETAILED: Fusing consumer assert_that/Create/Map(decode) into assert_that/Create/FlatMap(<lambda at core.py:2833>)
INFO:apache_beam.runners.dataflow.dataflow_runner:2020-08-21T06:58:33.765Z: JOB_MESSAGE_DETAILED: Fusing consumer assert_that/Group/pair_with_0 into assert_that/Create/Map(decode)
INFO:apache_beam.runners.dataflow.dataflow_runner:2020-08-21T06:58:33.814Z: JOB_MESSAGE_DETAILED: Fusing consumer Create/MaybeReshuffle/Reshuffle/AddRandomKeys into Create/FlatMap(<lambda at core.py:2833>)
INFO:apache_beam.runners.dataflow.dataflow_runner:2020-08-21T06:58:33.858Z: JOB_MESSAGE_DETAILED: Fusing consumer Create/MaybeReshuffle/Reshuffle/ReshufflePerKey/Map(reify_timestamps) into Create/MaybeReshuffle/Reshuffle/AddRandomKeys
INFO:apache_beam.runners.dataflow.dataflow_runner:2020-08-21T06:58:33.918Z: JOB_MESSAGE_DETAILED: Fusing consumer Create/MaybeReshuffle/Reshuffle/ReshufflePerKey/GroupByKey/WriteStream into Create/MaybeReshuffle/Reshuffle/ReshufflePerKey/Map(reify_timestamps)
INFO:apache_beam.runners.dataflow.dataflow_runner:2020-08-21T06:58:34.069Z: JOB_MESSAGE_DEBUG: Workflow config is missing a default resource spec.
INFO:apache_beam.runners.dataflow.dataflow_runner:2020-08-21T06:58:34.107Z: JOB_MESSAGE_DEBUG: Adding StepResource setup and teardown to workflow graph.
INFO:apache_beam.runners.dataflow.dataflow_runner:2020-08-21T06:58:34.132Z: JOB_MESSAGE_DEBUG: Adding workflow start and stop steps.
INFO:apache_beam.runners.dataflow.dataflow_runner:2020-08-21T06:58:34.165Z: JOB_MESSAGE_DEBUG: Assigning stage ids.
INFO:apache_beam.runners.dataflow.dataflow_runner:2020-08-21T06:58:36.451Z: JOB_MESSAGE_DEBUG: Starting worker pool setup.
INFO:apache_beam.runners.dataflow.dataflow_runner:2020-08-21T06:58:36.492Z: JOB_MESSAGE_DEBUG: Starting worker pool setup.
INFO:apache_beam.runners.dataflow.dataflow_runner:2020-08-21T06:58:36.528Z: JOB_MESSAGE_BASIC: Starting 1 workers in us-central1-f...
INFO:apache_beam.runners.dataflow.dataflow_runner:2020-08-21T06:58:43.478Z: JOB_MESSAGE_WARNING: Your project already contains 100 Dataflow-created metric descriptors and Stackdriver will not create new Dataflow custom metrics for this job. Each unique user-defined metric name (independent of the DoFn in which it is defined) produces a new metric descriptor. To delete old / unused metric descriptors see https://developers.google.com/apis-explorer/#p/monitoring/v3/monitoring.projects.metricDescriptors.list and https://developers.google.com/apis-explorer/#p/monitoring/v3/monitoring.projects.metricDescriptors.delete
INFO:apache_beam.runners.dataflow.dataflow_runner:2020-08-21T06:59:04.611Z: JOB_MESSAGE_DETAILED: Autoscaling: Raised the number of workers to 1 so that the pipeline can catch up with its backlog and keep up with its input rate.
INFO:apache_beam.runners.dataflow.dataflow_runner:2020-08-21T06:59:42.584Z: JOB_MESSAGE_DETAILED: Workers have started successfully.
INFO:apache_beam.runners.dataflow.dataflow_runner:2020-08-21T06:59:42.613Z: JOB_MESSAGE_DETAILED: Workers have started successfully.
INFO:apache_beam.runners.dataflow.dataflow_runner:2020-08-21T07:05:37.735Z: JOB_MESSAGE_DETAILED: Cleaning up.
INFO:apache_beam.runners.dataflow.dataflow_runner:2020-08-21T07:05:37.810Z: JOB_MESSAGE_DEBUG: Starting worker pool teardown.
INFO:apache_beam.runners.dataflow.dataflow_runner:2020-08-21T07:05:37.829Z: JOB_MESSAGE_BASIC: Stopping worker pool...
INFO:apache_beam.runners.dataflow.dataflow_runner:2020-08-21T07:05:37.868Z: JOB_MESSAGE_DEBUG: Starting worker pool teardown.
INFO:apache_beam.runners.dataflow.dataflow_runner:2020-08-21T07:05:37.895Z: JOB_MESSAGE_BASIC: Stopping worker pool...
INFO:oauth2client.transport:Refreshing due to a 401 (attempt 1/2)
INFO:apache_beam.runners.dataflow.dataflow_runner:2020-08-21T07:08:18.389Z: JOB_MESSAGE_DETAILED: Autoscaling: Reduced the number of workers to 0 based on low average worker CPU utilization, and the pipeline having sufficiently low backlog and keeping up with input rate.
INFO:apache_beam.runners.dataflow.dataflow_runner:2020-08-21T07:08:18.456Z: JOB_MESSAGE_BASIC: Worker pool stopped.
INFO:apache_beam.runners.dataflow.dataflow_runner:2020-08-21T07:08:18.499Z: JOB_MESSAGE_DEBUG: Tearing down pending resources...
INFO:apache_beam.runners.dataflow.dataflow_runner:Job 2020-08-20_23_58_26-2408556687225993915 is in state JOB_STATE_DONE
test_element_param (apache_beam.pipeline_test.DoFnTest) ... ok
test_key_param (apache_beam.pipeline_test.DoFnTest) ... ok
----------------------------------------------------------------------
XML: nosetests-validatesRunnerStreamingTests-df-py27.xml
----------------------------------------------------------------------
XML: <https://ci-beam.apache.org/job/beam_PostCommit_Py_VR_Dataflow_V2/ws/src/sdks/python/nosetests.xml>
----------------------------------------------------------------------
Ran 27 tests in 2153.289s
OK
Worker logs: https://console.cloud.google.com/dataflow/jobs/us-central1/2020-08-20_23_32_52-10041871182391422530?project=apache-beam-testing
Worker logs: https://console.cloud.google.com/dataflow/jobs/us-central1/2020-08-20_23_41_27-10674826513778929513?project=apache-beam-testing
Worker logs: https://console.cloud.google.com/dataflow/jobs/us-central1/2020-08-20_23_50_04-16007390779345214908?project=apache-beam-testing
Worker logs: https://console.cloud.google.com/dataflow/jobs/us-central1/2020-08-20_23_58_26-2408556687225993915?project=apache-beam-testing
Worker logs: https://console.cloud.google.com/dataflow/jobs/us-central1/2020-08-20_23_32_52-16258364926181268667?project=apache-beam-testing
Worker logs: https://console.cloud.google.com/dataflow/jobs/us-central1/2020-08-20_23_40_50-11741245695652826662?project=apache-beam-testing
Worker logs: https://console.cloud.google.com/dataflow/jobs/us-central1/2020-08-20_23_49_20-15418484345989943049?project=apache-beam-testing
Worker logs: https://console.cloud.google.com/dataflow/jobs/us-central1/2020-08-20_23_32_53-16887180914885061815?project=apache-beam-testing
Worker logs: https://console.cloud.google.com/dataflow/jobs/us-central1/2020-08-20_23_41_19-10937229069113077102?project=apache-beam-testing
Worker logs: https://console.cloud.google.com/dataflow/jobs/us-central1/2020-08-20_23_49_44-2827309117390622418?project=apache-beam-testing
Worker logs: https://console.cloud.google.com/dataflow/jobs/us-central1/2020-08-20_23_32_55-18415292603898094659?project=apache-beam-testing
Worker logs: https://console.cloud.google.com/dataflow/jobs/us-central1/2020-08-20_23_41_15-6010984705704079735?project=apache-beam-testing
Worker logs: https://console.cloud.google.com/dataflow/jobs/us-central1/2020-08-20_23_49_46-6864507978733586571?project=apache-beam-testing
Worker logs: https://console.cloud.google.com/dataflow/jobs/us-central1/2020-08-20_23_32_52-9452551402687658468?project=apache-beam-testing
Worker logs: https://console.cloud.google.com/dataflow/jobs/us-central1/2020-08-20_23_40_15-642647435871414057?project=apache-beam-testing
Worker logs: https://console.cloud.google.com/dataflow/jobs/us-central1/2020-08-20_23_48_40-10612820915169514648?project=apache-beam-testing
Worker logs: https://console.cloud.google.com/dataflow/jobs/us-central1/2020-08-20_23_32_54-116299305187468596?project=apache-beam-testing
Worker logs: https://console.cloud.google.com/dataflow/jobs/us-central1/2020-08-20_23_40_31-4201519600965593583?project=apache-beam-testing
Worker logs: https://console.cloud.google.com/dataflow/jobs/us-central1/2020-08-20_23_49_11-11928551283061118901?project=apache-beam-testing
Worker logs: https://console.cloud.google.com/dataflow/jobs/us-central1/2020-08-20_23_32_54-2707161415496562817?project=apache-beam-testing
Worker logs: https://console.cloud.google.com/dataflow/jobs/us-central1/2020-08-20_23_41_20-5526136291018248034?project=apache-beam-testing
Worker logs: https://console.cloud.google.com/dataflow/jobs/us-central1/2020-08-20_23_32_53-7043792490917967355?project=apache-beam-testing
Worker logs: https://console.cloud.google.com/dataflow/jobs/us-central1/2020-08-20_23_40_31-18161429543506156481?project=apache-beam-testing
Worker logs: https://console.cloud.google.com/dataflow/jobs/us-central1/2020-08-20_23_49_11-8240011428474698380?project=apache-beam-testing
FAILURE: Build failed with an exception.
* Where:
Script '<https://ci-beam.apache.org/job/beam_PostCommit_Py_VR_Dataflow_V2/ws/src/sdks/python/test-suites/dataflow/common.gradle'> line: 146
* What went wrong:
Execution failed for task ':sdks:python:test-suites:dataflow:py2:validatesRunnerBatchTests'.
> Process 'command 'sh'' finished with non-zero exit value 1
* Try:
Run with --stacktrace option to get the stack trace. Run with --info or --debug option to get more log output. Run with --scan to get full insights.
* Get more help at https://help.gradle.org
Deprecated Gradle features were used in this build, making it incompatible with Gradle 6.0.
Use '--warning-mode all' to show the individual deprecation warnings.
See https://docs.gradle.org/5.2.1/userguide/command_line_interface.html#sec:command_line_warnings
BUILD FAILED in 1h 7m 53s
65 actionable tasks: 47 executed, 18 from cache
Publishing build scan...
https://gradle.com/s/qfrimwunpabfu
Build step 'Invoke Gradle script' changed build result to FAILURE
Build step 'Invoke Gradle script' marked build as failure
---------------------------------------------------------------------
To unsubscribe, e-mail: builds-unsubscribe@beam.apache.org
For additional commands, e-mail: builds-help@beam.apache.org