You are viewing a plain text version of this content. The canonical link for it is here.
Posted to builds@cassandra.apache.org by Apache Jenkins Server <je...@builds.apache.org> on 2025/09/03 21:53:46 UTC

Build complete: Cassandra-trunk #2265 [UNSTABLE] 2f56702d308c454a91f56c7878bb3b68060d556e

-------------------------------------------------------------------------------
  Build Cassandra-trunk #2265 Still Unstable
  URL: https://ci-cassandra.apache.org/job/Cassandra-trunk/2265/
  -------------------------------------------------------------------------------
  Changes:
  [Stefan Miklosovic] bump version in build.xml to 4.1.11


  -------------------------------------------------------------------------------
  Failed Tests:
  47 tests failed.
FAILED:  dtest-latest.replace_address_test.TestReplaceAddress.Tests / dtest-latest jdk17 19/64 / test_fail_when_seed
FAILED:  dtest-novnode.disk_balance_test.TestDiskBalance.Tests / dtest-novnode jdk11 52/64 / test_disk_balance_after_boundary_change_stcs
FAILED:  dtest-upgrade-novnode.upgrade_tests.cql_tests.TestCQLNodes2RF1_Upgrade_current_4_1_x_To_indev_trunk.Tests / dtest-upgrade-novnode jdk11 5/160 / test_multi_in_compact
FAILED:  dtest-upgrade-novnode.upgrade_tests.cql_tests.TestCQLNodes3RF3_Upgrade_current_5_0_x_To_indev_trunk.Tests / dtest-upgrade-novnode jdk11 49/160 / test_indexes_composite
FAILED:  dtest-upgrade-novnode.upgrade_tests.cql_tests.TestCQLNodes3RF3_Upgrade_current_5_0_x_To_indev_trunk.Tests / dtest-upgrade-novnode jdk11 67/160 / test_large_clustering_in
FAILED:  dtest-upgrade-novnode.upgrade_tests.cql_tests.TestCQLNodes3RF3_Upgrade_current_5_0_x_To_indev_trunk.Tests / dtest-upgrade-novnode jdk11 5/160 / test_limit_multiget
FAILED:  dtest-upgrade-novnode.upgrade_tests.cql_tests.TestCQLNodes3RF3_Upgrade_indev_4_0_x_To_indev_trunk.Tests / dtest-upgrade-novnode jdk11 79/160 / test_select_distinct
FAILED:  dtest-upgrade-novnode.upgrade_tests.paging_test.TestPagingSizeNodes2RF1_Upgrade_indev_4_0_x_To_indev_trunk.Tests / dtest-upgrade-novnode jdk11 95/160 / test_with_equal_results_to_page_size
FAILED:  dtest-upgrade.upgrade_tests.cql_tests.TestCQLNodes2RF1_Upgrade_indev_4_0_x_To_indev_trunk.Tests / dtest-upgrade jdk11 143/160 / test_order_by
FAILED:  dtest-upgrade.upgrade_tests.cql_tests.TestCQLNodes3RF3_Upgrade_current_5_0_x_To_indev_trunk.Tests / dtest-upgrade jdk11 27/160 / test_compact_metadata
FAILED:  dtest-upgrade.upgrade_tests.cql_tests.TestCQLNodes3RF3_Upgrade_current_5_0_x_To_indev_trunk.Tests / dtest-upgrade jdk11 23/160 / test_multi_in_compact_non_composite
FAILED:  dtest-upgrade.upgrade_tests.cql_tests.TestCQLNodes3RF3_Upgrade_indev_4_0_x_To_indev_trunk.Tests / dtest-upgrade jdk11 47/160 / test_in_with_desc_order
FAILED:  org.apache.cassandra.db.compaction.CompactionsBytemanTest.Tests / test-oa jdk17 14/20 / testSSTableNotEnoughDiskSpaceForCompactionGetsDropped-oa_jdk17_x86_64
FAILED:  org.apache.cassandra.distributed.test.accord.MigrationToAccordWriteRaceTest.Tests / jvm-dtest jdk17 3/16 / testSplitAndRetryNonSerialLoggedBatchTwoTablesTwoPkey-_jdk17_x86_64
FAILED:  org.apache.cassandra.service.accord.AccordSyncPropagatorTest.Tests / test-latest jdk11 12/20 / burnTest-cassandra.testtag_IS_UNDEFINED
FAILED:  org.apache.cassandra.tools.nodetool.NodetoolHelpCommandsOutputTest.Tests / test-latest jdk17 13/20 / testCompareCommandHelpOutputBetweenTools[runner=shell, command=resetfullquerylog]-cassandra.testtag_IS_UNDEFINED
FAILED:  org.apache.cassandra.utils.binlog.BinLogTest.Tests / test-latest jdk17 13/20 / testTruncationReleasesLogSpace-latest_jdk17_x86_64
FAILED:  org.apache.cassandra.utils.btree.IntervalBTreeTest.Tests / test-compression jdk17 6/20 / testN-cassandra.testtag_IS_UNDEFINED
FAILED:  org.apache.cassandra.metrics.JmxVirtualTableMetricsTest.Tests / test jdk11 7/20 / testJmxEqualVirtualTableByMetricType-_jdk11_x86_64
FAILED:  org.apache.cassandra.metrics.JmxVirtualTableMetricsTest.Tests / test jdk17 7/20 / testJmxEqualVirtualTableByMetricType-_jdk17_x86_64
FAILED:  org.apache.cassandra.metrics.JmxVirtualTableMetricsTest.Tests / test-cdc jdk11 7/20 / testJmxEqualVirtualTableByMetricType-cdc_jdk11_x86_64
FAILED:  org.apache.cassandra.metrics.JmxVirtualTableMetricsTest.Tests / test-cdc jdk17 7/20 / testJmxEqualVirtualTableByMetricType-cdc_jdk17_x86_64
FAILED:  org.apache.cassandra.metrics.JmxVirtualTableMetricsTest.Tests / test-compression jdk11 7/20 / testJmxEqualVirtualTableByMetricType-compression_jdk11_x86_64
FAILED:  org.apache.cassandra.metrics.JmxVirtualTableMetricsTest.Tests / test-compression jdk17 7/20 / testJmxEqualVirtualTableByMetricType-compression_jdk17_x86_64
FAILED:  org.apache.cassandra.metrics.JmxVirtualTableMetricsTest.Tests / test-latest jdk11 7/20 / testJmxEqualVirtualTableByMetricType-latest_jdk11_x86_64
FAILED:  org.apache.cassandra.metrics.JmxVirtualTableMetricsTest.Tests / test-latest jdk17 7/20 / testJmxEqualVirtualTableByMetricType-latest_jdk17_x86_64
FAILED:  org.apache.cassandra.metrics.JmxVirtualTableMetricsTest.Tests / test-oa jdk11 7/20 / testJmxEqualVirtualTableByMetricType-oa_jdk11_x86_64
FAILED:  org.apache.cassandra.metrics.JmxVirtualTableMetricsTest.Tests / test-oa jdk17 7/20 / testJmxEqualVirtualTableByMetricType-oa_jdk17_x86_64
FAILED:  org.apache.cassandra.metrics.JmxVirtualTableMetricsTest.Tests / test-system-keyspace-directory jdk11 7/20 / testJmxEqualVirtualTableByMetricType-system_keyspace_directory_jdk11_x86_64
FAILED:  org.apache.cassandra.metrics.JmxVirtualTableMetricsTest.Tests / test-system-keyspace-directory jdk17 7/20 / testJmxEqualVirtualTableByMetricType-system_keyspace_directory_jdk17_x86_64
FAILED:  org.apache.cassandra.simulator.test.ShortAccordSimulationTest.Tests / simulator-dtest jdk11 / simulationTest-_jdk11_x86_64
FAILED:  org.apache.cassandra.fuzz.sai.AccordFullSingleNodeSAITest.Tests / jvm-dtest jdk11 13/16 / indexOnlySaiTest-cassandra.testtag_IS_UNDEFINED
FAILED:  org.apache.cassandra.service.accord.EpochSyncTest.Tests / test-oa jdk11 18/20 / test-oa_jdk11_x86_64
FAILED:  org.apache.cassandra.service.accord.EpochSyncTest.Tests / test jdk11 18/20 / test-_jdk11_x86_64
FAILED:  org.apache.cassandra.service.accord.EpochSyncTest.Tests / test jdk17 18/20 / test-_jdk17_x86_64
FAILED:  org.apache.cassandra.service.accord.EpochSyncTest.Tests / test-cdc jdk11 18/20 / test-cdc_jdk11_x86_64
FAILED:  org.apache.cassandra.service.accord.EpochSyncTest.Tests / test-cdc jdk17 18/20 / test-cdc_jdk17_x86_64
FAILED:  org.apache.cassandra.service.accord.EpochSyncTest.Tests / test-compression jdk11 18/20 / test-compression_jdk11_x86_64
FAILED:  org.apache.cassandra.service.accord.EpochSyncTest.Tests / test-compression jdk17 18/20 / test-compression_jdk17_x86_64
FAILED:  org.apache.cassandra.service.accord.EpochSyncTest.Tests / test-latest jdk11 18/20 / test-latest_jdk11_x86_64
FAILED:  org.apache.cassandra.service.accord.EpochSyncTest.Tests / test-latest jdk17 18/20 / test-latest_jdk17_x86_64
FAILED:  org.apache.cassandra.service.accord.EpochSyncTest.Tests / test-oa jdk17 18/20 / test-oa_jdk17_x86_64
FAILED:  org.apache.cassandra.service.accord.EpochSyncTest.Tests / test-system-keyspace-directory jdk11 18/20 / test-system_keyspace_directory_jdk11_x86_64
FAILED:  org.apache.cassandra.service.accord.EpochSyncTest.Tests / test-system-keyspace-directory jdk17 18/20 / test-system_keyspace_directory_jdk17_x86_64
FAILED:  org.apache.cassandra.db.marshal.AbstractTypeTest.Tests / test-latest jdk11 19/20 / testBackwardCompatibility-cassandra.testtag_IS_UNDEFINED
FAILED:  org.apache.cassandra.simulator.test.AccordHarrySimulationTest.Tests / simulator-dtest jdk11 / test-cassandra.testtag_IS_UNDEFINED
FAILED:  org.apache.cassandra.distributed.upgrade.ClusterMetadataUpgradeHarryTest.Tests / jvm-dtest-upgrade jdk11 6/6 / simpleUpgradeTest-cassandra.testtag_IS_UNDEFINED

  -------------------------------------------------------------------------------
  For complete test report and logs see https://nightlies.apache.org/cassandra/Cassandra-trunk/2265/