You are viewing a plain text version of this content. The canonical link for it is here.
Posted to builds@hbase.apache.org by Apache Jenkins Server <je...@builds.apache.org> on 2014/12/29 19:53:52 UTC

Build failed in Jenkins: HBase-0.98-on-Hadoop-1.1 #728

See <https://builds.apache.org/job/HBase-0.98-on-Hadoop-1.1/728/changes>

Changes:

[stack] HBASE-12762 Region with no hfiles will have the highest locality cost in LocalityCostFunction (cuijianwei)

------------------------------------------
[...truncated 2049 lines...]
Tests run: 9, Failures: 0, Errors: 0, Skipped: 0, Time elapsed: 24.236 sec - in org.apache.hadoop.hbase.rest.client.TestRemoteTable
Running org.apache.hadoop.hbase.rest.client.TestRemoteHTableRetries
Tests run: 7, Failures: 0, Errors: 0, Skipped: 0, Time elapsed: 1.607 sec - in org.apache.hadoop.hbase.rest.client.TestRemoteHTableRetries
Running org.apache.hadoop.hbase.rest.client.TestRemoteAdminRetries
Tests run: 7, Failures: 0, Errors: 0, Skipped: 0, Time elapsed: 1.593 sec - in org.apache.hadoop.hbase.rest.client.TestRemoteAdminRetries
Running org.apache.hadoop.hbase.rest.TestGetAndPutResource
Tests run: 18, Failures: 0, Errors: 0, Skipped: 0, Time elapsed: 29.224 sec - in org.apache.hadoop.hbase.rest.TestGetAndPutResource
Running org.apache.hadoop.hbase.rest.TestScannerResource
Tests run: 5, Failures: 0, Errors: 0, Skipped: 0, Time elapsed: 5.419 sec - in org.apache.hadoop.hbase.rest.TestScannerResource

Results :




Tests run: 169, Failures: 0, Errors: 0, Skipped: 0

[INFO] 
[INFO] --- maven-surefire-plugin:2.18:test (secondPartTestsExecution) @ hbase-rest ---
[INFO] Surefire report directory: <https://builds.apache.org/job/HBase-0.98-on-Hadoop-1.1/ws/hbase-rest/target/surefire-reports>
[INFO] Using configured provider org.apache.maven.surefire.junitcore.JUnitCoreProvider
[INFO] parallel='none', perCoreThreadCount=true, threadCount=0, useUnlimitedThreads=false, threadCountSuites=0, threadCountClasses=0, threadCountMethods=0, parallelOptimized=true

-------------------------------------------------------
 T E S T S
-------------------------------------------------------
Running org.apache.hadoop.hbase.rest.TestVersionResource
Running org.apache.hadoop.hbase.rest.TestScannersWithLabels
Tests run: 7, Failures: 0, Errors: 0, Skipped: 0, Time elapsed: 3.691 sec - in org.apache.hadoop.hbase.rest.TestVersionResource
Tests run: 2, Failures: 0, Errors: 0, Skipped: 0, Time elapsed: 4.011 sec - in org.apache.hadoop.hbase.rest.TestScannersWithLabels
Running org.apache.hadoop.hbase.rest.TestSchemaResource
Running org.apache.hadoop.hbase.rest.TestResourceFilter
Tests run: 1, Failures: 0, Errors: 0, Skipped: 0, Time elapsed: 3.271 sec - in org.apache.hadoop.hbase.rest.TestResourceFilter
Tests run: 2, Failures: 0, Errors: 0, Skipped: 0, Time elapsed: 6.979 sec - in org.apache.hadoop.hbase.rest.TestSchemaResource
Running org.apache.hadoop.hbase.rest.TestScannersWithFilters
Tests run: 10, Failures: 0, Errors: 0, Skipped: 0, Time elapsed: 8.641 sec - in org.apache.hadoop.hbase.rest.TestScannersWithFilters
Running org.apache.hadoop.hbase.rest.TestTableScan
Tests run: 6, Failures: 0, Errors: 0, Skipped: 0, Time elapsed: 10.892 sec - in org.apache.hadoop.hbase.rest.TestTableScan
Running org.apache.hadoop.hbase.rest.TestTableResource
Running org.apache.hadoop.hbase.rest.TestGzipFilter
Tests run: 8, Failures: 0, Errors: 0, Skipped: 0, Time elapsed: 6.729 sec - in org.apache.hadoop.hbase.rest.TestTableResource
Tests run: 2, Failures: 0, Errors: 0, Skipped: 0, Time elapsed: 4.277 sec - in org.apache.hadoop.hbase.rest.TestGzipFilter
Running org.apache.hadoop.hbase.rest.TestMultiRowResource
Tests run: 3, Failures: 0, Errors: 0, Skipped: 0, Time elapsed: 4.201 sec - in org.apache.hadoop.hbase.rest.TestMultiRowResource
Running org.apache.hadoop.hbase.rest.TestDeleteRow
Running org.apache.hadoop.hbase.rest.TestStatusResource
Tests run: 2, Failures: 0, Errors: 0, Skipped: 0, Time elapsed: 3.784 sec - in org.apache.hadoop.hbase.rest.TestStatusResource
Tests run: 2, Failures: 0, Errors: 0, Skipped: 0, Time elapsed: 7.767 sec - in org.apache.hadoop.hbase.rest.TestDeleteRow
Running org.apache.hadoop.hbase.rest.client.TestRemoteTable
Running org.apache.hadoop.hbase.rest.TestGetAndPutResource
Tests run: 9, Failures: 0, Errors: 0, Skipped: 0, Time elapsed: 23.181 sec - in org.apache.hadoop.hbase.rest.client.TestRemoteTable
Tests run: 18, Failures: 0, Errors: 0, Skipped: 0, Time elapsed: 28.792 sec - in org.apache.hadoop.hbase.rest.TestGetAndPutResource
Running org.apache.hadoop.hbase.rest.TestScannerResource
Tests run: 5, Failures: 0, Errors: 0, Skipped: 0, Time elapsed: 6.707 sec - in org.apache.hadoop.hbase.rest.TestScannerResource

Results :




Tests run: 77, Failures: 0, Errors: 0, Skipped: 0

[INFO] 
[INFO] --- jacoco-maven-plugin:0.6.2.201302030002:report (report) @ hbase-rest ---
[INFO] Skipping JaCoCo execution
[INFO] 
[INFO] --- maven-source-plugin:2.2.1:jar-no-fork (attach-sources) @ hbase-rest ---
[INFO] Building jar: <https://builds.apache.org/job/HBase-0.98-on-Hadoop-1.1/ws/hbase-rest/target/hbase-rest-0.98.10-SNAPSHOT-sources.jar>
[INFO] 
[INFO] --- maven-jar-plugin:2.4:test-jar (default) @ hbase-rest ---
[INFO] Building jar: <https://builds.apache.org/job/HBase-0.98-on-Hadoop-1.1/ws/hbase-rest/target/hbase-rest-0.98.10-SNAPSHOT-tests.jar>
[INFO] 
[INFO] --- maven-jar-plugin:2.4:jar (default-jar) @ hbase-rest ---
[INFO] Building jar: <https://builds.apache.org/job/HBase-0.98-on-Hadoop-1.1/ws/hbase-rest/target/hbase-rest-0.98.10-SNAPSHOT.jar>
[INFO] 
[INFO] --- maven-install-plugin:2.3.1:install (default-install) @ hbase-rest ---
[INFO] Installing <https://builds.apache.org/job/HBase-0.98-on-Hadoop-1.1/ws/hbase-rest/target/hbase-rest-0.98.10-SNAPSHOT.jar> to /home/jenkins/.m2/repository/org/apache/hbase/hbase-rest/0.98.10-SNAPSHOT/hbase-rest-0.98.10-SNAPSHOT.jar
[INFO] Installing <https://builds.apache.org/job/HBase-0.98-on-Hadoop-1.1/ws/hbase-rest/pom.xml> to /home/jenkins/.m2/repository/org/apache/hbase/hbase-rest/0.98.10-SNAPSHOT/hbase-rest-0.98.10-SNAPSHOT.pom
[INFO] Installing <https://builds.apache.org/job/HBase-0.98-on-Hadoop-1.1/ws/hbase-rest/target/hbase-rest-0.98.10-SNAPSHOT-sources.jar> to /home/jenkins/.m2/repository/org/apache/hbase/hbase-rest/0.98.10-SNAPSHOT/hbase-rest-0.98.10-SNAPSHOT-sources.jar
[INFO] Installing <https://builds.apache.org/job/HBase-0.98-on-Hadoop-1.1/ws/hbase-rest/target/hbase-rest-0.98.10-SNAPSHOT-tests.jar> to /home/jenkins/.m2/repository/org/apache/hbase/hbase-rest/0.98.10-SNAPSHOT/hbase-rest-0.98.10-SNAPSHOT-tests.jar
[INFO]                                                                         
[INFO] ------------------------------------------------------------------------
[INFO] Building HBase - Shell 0.98.10-SNAPSHOT
[INFO] ------------------------------------------------------------------------
[INFO] 
[INFO] --- maven-enforcer-plugin:1.0.1:enforce (enforce) @ hbase-shell ---
[INFO] 
[INFO] --- jacoco-maven-plugin:0.6.2.201302030002:prepare-agent (prepare-agent) @ hbase-shell ---
[INFO] Skipping JaCoCo execution
[INFO] argLine set to 
[INFO] 
[INFO] --- build-helper-maven-plugin:1.5:add-source (jspcSource-packageInfo-source) @ hbase-shell ---
[INFO] Source directory: <https://builds.apache.org/job/HBase-0.98-on-Hadoop-1.1/ws/hbase-shell/target/generated-jamon> added.
[INFO] Source directory: <https://builds.apache.org/job/HBase-0.98-on-Hadoop-1.1/ws/hbase-shell/target/generated-sources/java> added.
[INFO] 
[INFO] --- maven-remote-resources-plugin:1.4:process (default) @ hbase-shell ---
[INFO] 
[INFO] --- maven-resources-plugin:2.6:resources (default-resources) @ hbase-shell ---
[INFO] Using 'UTF-8' encoding to copy filtered resources.
[INFO] Copying 0 resource
[INFO] Copying 3 resources
[INFO] 
[INFO] --- maven-compiler-plugin:2.5.1:compile (default-compile) @ hbase-shell ---
[INFO] No sources to compile
[INFO] 
[INFO] --- maven-resources-plugin:2.6:testResources (default-testResources) @ hbase-shell ---
[INFO] Using 'UTF-8' encoding to copy filtered resources.
[INFO] skip non existing resourceDirectory <https://builds.apache.org/job/HBase-0.98-on-Hadoop-1.1/ws/hbase-shell/src/test/resources>
[INFO] Copying 3 resources
[INFO] 
[INFO] --- maven-compiler-plugin:2.5.1:testCompile (default-testCompile) @ hbase-shell ---
[INFO] Compiling 1 source file to <https://builds.apache.org/job/HBase-0.98-on-Hadoop-1.1/ws/hbase-shell/target/test-classes>
[INFO] 
[INFO] --- maven-surefire-plugin:2.18:test (default-test) @ hbase-shell ---
[INFO] Surefire report directory: <https://builds.apache.org/job/HBase-0.98-on-Hadoop-1.1/ws/hbase-shell/target/surefire-reports>
[INFO] Using configured provider org.apache.maven.surefire.junitcore.JUnitCoreProvider
[INFO] parallel='none', perCoreThreadCount=true, threadCount=0, useUnlimitedThreads=false, threadCountSuites=0, threadCountClasses=0, threadCountMethods=0, parallelOptimized=true

-------------------------------------------------------
 T E S T S
-------------------------------------------------------

Results :




Tests run: 0, Failures: 0, Errors: 0, Skipped: 0

[INFO] 
[INFO] --- maven-surefire-plugin:2.18:test (secondPartTestsExecution) @ hbase-shell ---
[INFO] Surefire report directory: <https://builds.apache.org/job/HBase-0.98-on-Hadoop-1.1/ws/hbase-shell/target/surefire-reports>
[INFO] Using configured provider org.apache.maven.surefire.junitcore.JUnitCoreProvider
[INFO] parallel='none', perCoreThreadCount=true, threadCount=0, useUnlimitedThreads=false, threadCountSuites=0, threadCountClasses=0, threadCountMethods=0, parallelOptimized=true

-------------------------------------------------------
 T E S T S
-------------------------------------------------------
Running org.apache.hadoop.hbase.client.TestShell
Tests run: 1, Failures: 0, Errors: 1, Skipped: 0, Time elapsed: 0.026 sec <<< FAILURE! - in org.apache.hadoop.hbase.client.TestShell
org.apache.hadoop.hbase.client.TestShell  Time elapsed: 0.026 sec  <<< ERROR!
java.io.IOException: Shutting down
	at org.apache.hadoop.hbase.util.JVMClusterUtil.startup(JVMClusterUtil.java:189)
	at org.apache.hadoop.hbase.LocalHBaseCluster.startup(LocalHBaseCluster.java:425)
	at org.apache.hadoop.hbase.MiniHBaseCluster.init(MiniHBaseCluster.java:224)
	at org.apache.hadoop.hbase.MiniHBaseCluster.<init>(MiniHBaseCluster.java:93)
	at org.apache.hadoop.hbase.HBaseTestingUtility.startMiniHBaseCluster(HBaseTestingUtility.java:924)
	at org.apache.hadoop.hbase.HBaseTestingUtility.startMiniCluster(HBaseTestingUtility.java:888)
	at org.apache.hadoop.hbase.HBaseTestingUtility.startMiniCluster(HBaseTestingUtility.java:805)
	at org.apache.hadoop.hbase.HBaseTestingUtility.startMiniCluster(HBaseTestingUtility.java:776)
	at org.apache.hadoop.hbase.HBaseTestingUtility.startMiniCluster(HBaseTestingUtility.java:745)
	at org.apache.hadoop.hbase.client.TestShell.setUpBeforeClass(TestShell.java:60)


Results :


Tests in error: 
  TestShell.setUpBeforeClass:60 ยป IO Shutting down


Tests run: 1, Failures: 0, Errors: 1, Skipped: 0

[INFO] ------------------------------------------------------------------------
[INFO] Reactor Summary:
[INFO] 
[INFO] HBase ............................................. SUCCESS [3.279s]
[INFO] HBase - Checkstyle ................................ SUCCESS [0.727s]
[INFO] HBase - Annotations ............................... SUCCESS [1.016s]
[INFO] HBase - Common .................................... SUCCESS [40.117s]
[INFO] HBase - Protocol .................................. SUCCESS [20.919s]
[INFO] HBase - Client .................................... SUCCESS [44.941s]
[INFO] HBase - Hadoop Compatibility ...................... SUCCESS [6.912s]
[INFO] HBase - Hadoop One Compatibility .................. SUCCESS [4.483s]
[INFO] HBase - Prefix Tree ............................... SUCCESS [7.712s]
[INFO] HBase - Server .................................... SUCCESS [2:20:08.603s]
[INFO] HBase - Testing Util .............................. SUCCESS [0.547s]
[INFO] HBase - Thrift .................................... SUCCESS [2:53.805s]
[INFO] HBase - Rest ...................................... SUCCESS [7:53.687s]
[INFO] HBase - Shell ..................................... FAILURE [37.116s]
[INFO] HBase - Integration Tests ......................... SKIPPED
[INFO] HBase - Examples .................................. SKIPPED
[INFO] HBase - Assembly .................................. SKIPPED
[INFO] ------------------------------------------------------------------------
[INFO] BUILD FAILURE
[INFO] ------------------------------------------------------------------------
[INFO] Total time: 2:33:44.762s
[INFO] Finished at: Mon Dec 29 18:52:09 UTC 2014
[INFO] Final Memory: 64M/891M
[INFO] ------------------------------------------------------------------------
[ERROR] Failed to execute goal org.apache.maven.plugins:maven-surefire-plugin:2.18:test (secondPartTestsExecution) on project hbase-shell: There are test failures.
[ERROR] 
[ERROR] Please refer to <https://builds.apache.org/job/HBase-0.98-on-Hadoop-1.1/ws/hbase-shell/target/surefire-reports> for the individual test results.
[ERROR] -> [Help 1]
[ERROR] 
[ERROR] To see the full stack trace of the errors, re-run Maven with the -e switch.
[ERROR] Re-run Maven using the -X switch to enable full debug logging.
[ERROR] 
[ERROR] For more information about the errors and possible solutions, please read the following articles:
[ERROR] [Help 1] http://cwiki.apache.org/confluence/display/MAVEN/MojoFailureException
[ERROR] 
[ERROR] After correcting the problems, you can resume the build with the command
[ERROR]   mvn <goals> -rf :hbase-shell
Build step 'Invoke top-level Maven targets' marked build as failure
Performing Post build task...
Match found for :.* : True
Logical operation result is TRUE
Running script  :   ZOMBIE_TESTS_COUNT=`jps | grep surefirebooter | wc -l`
  if [[ $ZOMBIE_TESTS_COUNT != 0 ]] ; then
    #It seems sometimes the tests are not dying immediately. Let's give them 10s
    echo "Suspicious java process found - waiting 10s to see if there are just slow to stop"
    sleep 10
    ZOMBIE_TESTS_COUNT=`jps | grep surefirebooter | wc -l`
    if [[ $ZOMBIE_TESTS_COUNT != 0 ]] ; then
      echo "There are $ZOMBIE_TESTS_COUNT zombie tests, they should have been killed by surefire but survived"
      echo "************ BEGIN zombies jstack extract"
      ZB_STACK=`jps | grep surefirebooter | cut -d ' ' -f 1 | xargs -n 1 jstack | grep ".test" | grep "\.java"`
      jps | grep surefirebooter | cut -d ' ' -f 1 | xargs -n 1 jstack
      echo "************ END  zombies jstack extract"
      JIRA_COMMENT="$JIRA_COMMENT

     {color:red}-1 core zombie tests{color}.  There are ${ZOMBIE_TESTS_COUNT} zombie test(s): ${ZB_STACK}"
      BAD=1
      jps | grep surefirebooter | cut -d ' ' -f 1 | xargs kill -9
    else
      echo "We're ok: there is no zombie test, but some tests took some time to stop"
    fi
  else
    echo "We're ok: there is no zombie test"
  fi
[HBase-0.98-on-Hadoop-1.1] $ /bin/bash -xe /tmp/hudson6927939423257939772.sh
++ jps
++ wc -l
++ grep surefirebooter
+ ZOMBIE_TESTS_COUNT=0
+ [[ 0 != 0 ]]
+ echo 'We'\''re ok: there is no zombie test'
We're ok: there is no zombie test
POST BUILD TASK : SUCCESS
END OF POST BUILD TASK : 0
Archiving artifacts
Sending artifact delta relative to HBase-0.98-on-Hadoop-1.1 #727
Archived 1774 artifacts
Archive block size is 32768
Received 7 blocks and 262936036 bytes
Compression is 0.1%
Took 1 min 16 sec
Recording test results
Updating HBASE-12762

Jenkins build is back to normal : HBase-0.98-on-Hadoop-1.1 #730

Posted by Apache Jenkins Server <je...@builds.apache.org>.
See <https://builds.apache.org/job/HBase-0.98-on-Hadoop-1.1/730/changes>


Build failed in Jenkins: HBase-0.98-on-Hadoop-1.1 #729

Posted by Apache Jenkins Server <je...@builds.apache.org>.
See <https://builds.apache.org/job/HBase-0.98-on-Hadoop-1.1/729/changes>

Changes:

[xieliang] HBASE-12767 Fix a StoreFileScanner NPE in reverse scan flow

[larsh] HBASE-12776 SpliTransaction: Log number of files to be split.

------------------------------------------
[...truncated 2405 lines...]

"AsyncDispatcher event handler" prio=10 tid=0x00007ffda408c800 nid=0x2519 waiting on condition [0x00007ffd906f5000]
   java.lang.Thread.State: WAITING (parking)
	at sun.misc.Unsafe.park(Native Method)
	- parking to wait for  <0x00000007b189dee0> (a java.util.concurrent.locks.AbstractQueuedSynchronizer$ConditionObject)
	at java.util.concurrent.locks.LockSupport.park(LockSupport.java:186)
	at java.util.concurrent.locks.AbstractQueuedSynchronizer$ConditionObject.await(AbstractQueuedSynchronizer.java:2043)
	at java.util.concurrent.LinkedBlockingQueue.take(LinkedBlockingQueue.java:442)
	at org.apache.hadoop.yarn.event.AsyncDispatcher$1.run(AsyncDispatcher.java:98)
	at java.lang.Thread.run(Thread.java:745)

"Ping Checker" prio=10 tid=0x00007ffda408b800 nid=0x2518 waiting on condition [0x00007ffd907f6000]
   java.lang.Thread.State: TIMED_WAITING (sleeping)
	at java.lang.Thread.sleep(Native Method)
	at org.apache.hadoop.yarn.util.AbstractLivelinessMonitor$PingChecker.run(AbstractLivelinessMonitor.java:125)
	at java.lang.Thread.run(Thread.java:745)

"ResourceManager Event Processor" prio=10 tid=0x00007ffda408a800 nid=0x2517 waiting on condition [0x00007ffd916bd000]
   java.lang.Thread.State: WAITING (parking)
	at sun.misc.Unsafe.park(Native Method)
	- parking to wait for  <0x00000007b1949a38> (a java.util.concurrent.locks.AbstractQueuedSynchronizer$ConditionObject)
	at java.util.concurrent.locks.LockSupport.park(LockSupport.java:186)
	at java.util.concurrent.locks.AbstractQueuedSynchronizer$ConditionObject.await(AbstractQueuedSynchronizer.java:2043)
	at java.util.concurrent.LinkedBlockingQueue.take(LinkedBlockingQueue.java:442)
	at org.apache.hadoop.yarn.server.resourcemanager.ResourceManager$SchedulerEventDispatcher$EventProcessor.run(ResourceManager.java:674)
	at java.lang.Thread.run(Thread.java:745)

"Ping Checker" prio=10 tid=0x00007ffda4089800 nid=0x2516 waiting on condition [0x00007ffd90f1a000]
   java.lang.Thread.State: TIMED_WAITING (sleeping)
	at java.lang.Thread.sleep(Native Method)
	at org.apache.hadoop.yarn.util.AbstractLivelinessMonitor$PingChecker.run(AbstractLivelinessMonitor.java:125)
	at java.lang.Thread.run(Thread.java:745)

"Ping Checker" prio=10 tid=0x00007ffda4088800 nid=0x2515 waiting on condition [0x00007ffd908f7000]
   java.lang.Thread.State: TIMED_WAITING (sleeping)
	at java.lang.Thread.sleep(Native Method)
	at org.apache.hadoop.yarn.util.AbstractLivelinessMonitor$PingChecker.run(AbstractLivelinessMonitor.java:125)
	at java.lang.Thread.run(Thread.java:745)

"Ping Checker" prio=10 tid=0x00007ffda4081800 nid=0x2514 waiting on condition [0x00007ffd909f8000]
   java.lang.Thread.State: TIMED_WAITING (sleeping)
	at java.lang.Thread.sleep(Native Method)
	at org.apache.hadoop.yarn.util.AbstractLivelinessMonitor$PingChecker.run(AbstractLivelinessMonitor.java:125)
	at java.lang.Thread.run(Thread.java:745)

"Thread[Thread-69,5,main]" daemon prio=10 tid=0x00007ffda4080800 nid=0x2513 waiting on condition [0x00007ffd919c0000]
   java.lang.Thread.State: TIMED_WAITING (sleeping)
	at java.lang.Thread.sleep(Native Method)
	at org.apache.hadoop.security.token.delegation.AbstractDelegationTokenSecretManager$ExpiredTokenRemover.run(AbstractDelegationTokenSecretManager.java:657)
	at java.lang.Thread.run(Thread.java:745)

"AsyncDispatcher event handler" prio=10 tid=0x00007ffda407f800 nid=0x2512 waiting on condition [0x00007ffd9101b000]
   java.lang.Thread.State: WAITING (parking)
	at sun.misc.Unsafe.park(Native Method)
	- parking to wait for  <0x00000007b190f3d0> (a java.util.concurrent.locks.AbstractQueuedSynchronizer$ConditionObject)
	at java.util.concurrent.locks.LockSupport.park(LockSupport.java:186)
	at java.util.concurrent.locks.AbstractQueuedSynchronizer$ConditionObject.await(AbstractQueuedSynchronizer.java:2043)
	at java.util.concurrent.LinkedBlockingQueue.take(LinkedBlockingQueue.java:442)
	at org.apache.hadoop.yarn.event.AsyncDispatcher$1.run(AsyncDispatcher.java:98)
	at java.lang.Thread.run(Thread.java:745)

"Timer-19" prio=10 tid=0x00007ffda407e800 nid=0x2511 in Object.wait() [0x00007ffd915bc000]
   java.lang.Thread.State: TIMED_WAITING (on object monitor)
	at java.lang.Object.wait(Native Method)
	- waiting on <0x00000007b1bb0d90> (a java.util.TaskQueue)
	at java.util.TimerThread.mainLoop(Timer.java:552)
	- locked <0x00000007b1bb0d90> (a java.util.TaskQueue)
	at java.util.TimerThread.run(Timer.java:505)

"Timer for 'ResourceManager' metrics system" daemon prio=10 tid=0x00007ffda407d800 nid=0x2510 in Object.wait() [0x00007ffd914bb000]
   java.lang.Thread.State: TIMED_WAITING (on object monitor)
	at java.lang.Object.wait(Native Method)
	- waiting on <0x00000007b1a495a0> (a java.util.TaskQueue)
	at java.util.TimerThread.mainLoop(Timer.java:552)
	- locked <0x00000007b1a495a0> (a java.util.TaskQueue)
	at java.util.TimerThread.run(Timer.java:505)

"Timer-18" prio=10 tid=0x00007ffda407d000 nid=0x250f in Object.wait() [0x00007ffd911b8000]
   java.lang.Thread.State: TIMED_WAITING (on object monitor)
	at java.lang.Object.wait(Native Method)
	- waiting on <0x00000007b18d4ff0> (a java.util.TaskQueue)
	at java.util.TimerThread.mainLoop(Timer.java:552)
	- locked <0x00000007b18d4ff0> (a java.util.TaskQueue)
	at java.util.TimerThread.run(Timer.java:505)

"Timer-17" prio=10 tid=0x00007ffda407c000 nid=0x250e in Object.wait() [0x00007ffda0235000]
   java.lang.Thread.State: TIMED_WAITING (on object monitor)
	at java.lang.Object.wait(Native Method)
	- waiting on <0x00000007b18cc820> (a java.util.TaskQueue)
	at java.util.TimerThread.mainLoop(Timer.java:552)
	- locked <0x00000007b18cc820> (a java.util.TaskQueue)
	at java.util.TimerThread.run(Timer.java:505)

"Timer-16" prio=10 tid=0x00007ffda407b000 nid=0x250d in Object.wait() [0x00007ffda0126000]
   java.lang.Thread.State: TIMED_WAITING (on object monitor)
	at java.lang.Object.wait(Native Method)
	- waiting on <0x00000007b18c1f10> (a java.util.TaskQueue)
	at java.util.TimerThread.mainLoop(Timer.java:552)
	- locked <0x00000007b18c1f10> (a java.util.TaskQueue)
	at java.util.TimerThread.run(Timer.java:505)

"Timer-15" prio=10 tid=0x00007ffd9c564000 nid=0x1dc1 in Object.wait() [0x00007ffd918bf000]
   java.lang.Thread.State: TIMED_WAITING (on object monitor)
	at java.lang.Object.wait(Native Method)
	- waiting on <0x00000007b61b0070> (a java.util.TaskQueue)
	at java.util.TimerThread.mainLoop(Timer.java:552)
	- locked <0x00000007b61b0070> (a java.util.TaskQueue)
	at java.util.TimerThread.run(Timer.java:505)

"Timer-11" prio=10 tid=0x00007ffdac984800 nid=0x19cc in Object.wait() [0x00007ffd912b9000]
   java.lang.Thread.State: TIMED_WAITING (on object monitor)
	at java.lang.Object.wait(Native Method)
	- waiting on <0x00000007b619b968> (a java.util.TaskQueue)
	at java.util.TimerThread.mainLoop(Timer.java:552)
	- locked <0x00000007b619b968> (a java.util.TaskQueue)
	at java.util.TimerThread.run(Timer.java:505)

"Timer-7" prio=10 tid=0x00007ffd9c5a1000 nid=0xb1d in Object.wait() [0x00007ffd913ba000]
   java.lang.Thread.State: TIMED_WAITING (on object monitor)
	at java.lang.Object.wait(Native Method)
	- waiting on <0x0000000700465ea0> (a java.util.TaskQueue)
	at java.util.TimerThread.mainLoop(Timer.java:552)
	- locked <0x0000000700465ea0> (a java.util.TaskQueue)
	at java.util.TimerThread.run(Timer.java:505)

"Timer-3" prio=10 tid=0x00007ffd9c819800 nid=0x7720 in Object.wait() [0x00007ffd917be000]
   java.lang.Thread.State: TIMED_WAITING (on object monitor)
	at java.lang.Object.wait(Native Method)
	- waiting on <0x0000000700086308> (a java.util.TaskQueue)
	at java.util.TimerThread.mainLoop(Timer.java:552)
	- locked <0x0000000700086308> (a java.util.TaskQueue)
	at java.util.TimerThread.run(Timer.java:505)

"Service Thread" daemon prio=10 tid=0x00007ffdac291000 nid=0x76ed runnable [0x0000000000000000]
   java.lang.Thread.State: RUNNABLE

"C2 CompilerThread1" daemon prio=10 tid=0x00007ffdac28f000 nid=0x76ec waiting on condition [0x0000000000000000]
   java.lang.Thread.State: RUNNABLE

"C2 CompilerThread0" daemon prio=10 tid=0x00007ffdac28c000 nid=0x76eb waiting on condition [0x0000000000000000]
   java.lang.Thread.State: RUNNABLE

"Signal Dispatcher" daemon prio=10 tid=0x00007ffdac281800 nid=0x76ea runnable [0x0000000000000000]
   java.lang.Thread.State: RUNNABLE

"Finalizer" daemon prio=10 tid=0x00007ffdac26b000 nid=0x76e9 in Object.wait() [0x00007ffda1214000]
   java.lang.Thread.State: WAITING (on object monitor)
	at java.lang.Object.wait(Native Method)
	- waiting on <0x000000070002e178> (a java.lang.ref.ReferenceQueue$Lock)
	at java.lang.ref.ReferenceQueue.remove(ReferenceQueue.java:135)
	- locked <0x000000070002e178> (a java.lang.ref.ReferenceQueue$Lock)
	at java.lang.ref.ReferenceQueue.remove(ReferenceQueue.java:151)
	at java.lang.ref.Finalizer$FinalizerThread.run(Finalizer.java:189)

"Reference Handler" daemon prio=10 tid=0x00007ffdac267000 nid=0x76e8 in Object.wait() [0x00007ffda1315000]
   java.lang.Thread.State: WAITING (on object monitor)
	at java.lang.Object.wait(Native Method)
	- waiting on <0x0000000700029c10> (a java.lang.ref.Reference$Lock)
	at java.lang.Object.wait(Object.java:503)
	at java.lang.ref.Reference$ReferenceHandler.run(Reference.java:133)
	- locked <0x0000000700029c10> (a java.lang.ref.Reference$Lock)

"main" prio=10 tid=0x00007ffdac00a800 nid=0x76d9 waiting on condition [0x00007ffdb4678000]
   java.lang.Thread.State: TIMED_WAITING (sleeping)
	at java.lang.Thread.sleep(Native Method)
	at org.apache.hadoop.yarn.server.resourcemanager.MockAM.waitForState(MockAM.java:83)
	at org.apache.hadoop.yarn.server.resourcemanager.MockRM.sendAMLaunched(MockRM.java:495)
	at org.apache.hadoop.yarn.server.resourcemanager.MockRM.launchAM(MockRM.java:660)
	at org.apache.hadoop.yarn.server.resourcemanager.MockRM.launchAndRegisterAM(MockRM.java:667)
	at org.apache.hadoop.yarn.server.resourcemanager.scheduler.capacity.TestContainerAllocation.testContainerTokenGeneratedOnPullRequest(TestContainerAllocation.java:163)
	at sun.reflect.NativeMethodAccessorImpl.invoke0(Native Method)
	at sun.reflect.NativeMethodAccessorImpl.invoke(NativeMethodAccessorImpl.java:57)
	at sun.reflect.DelegatingMethodAccessorImpl.invoke(DelegatingMethodAccessorImpl.java:43)
	at java.lang.reflect.Method.invoke(Method.java:606)
	at org.junit.runners.model.FrameworkMethod$1.runReflectiveCall(FrameworkMethod.java:47)
	at org.junit.internal.runners.model.ReflectiveCallable.run(ReflectiveCallable.java:12)
	at org.junit.runners.model.FrameworkMethod.invokeExplosively(FrameworkMethod.java:44)
	at org.junit.internal.runners.statements.InvokeMethod.evaluate(InvokeMethod.java:17)
	at org.junit.internal.runners.statements.RunBefores.evaluate(RunBefores.java:26)
	at org.junit.runners.ParentRunner.runLeaf(ParentRunner.java:271)
	at org.junit.runners.BlockJUnit4ClassRunner.runChild(BlockJUnit4ClassRunner.java:70)
	at org.junit.runners.BlockJUnit4ClassRunner.runChild(BlockJUnit4ClassRunner.java:50)
	at org.junit.runners.ParentRunner$3.run(ParentRunner.java:238)
	at org.junit.runners.ParentRunner$1.schedule(ParentRunner.java:63)
	at org.junit.runners.ParentRunner.runChildren(ParentRunner.java:236)
	at org.junit.runners.ParentRunner.access$000(ParentRunner.java:53)
	at org.junit.runners.ParentRunner$2.evaluate(ParentRunner.java:229)
	at org.junit.runners.ParentRunner.run(ParentRunner.java:309)
	at org.apache.maven.surefire.junit4.JUnit4Provider.execute(JUnit4Provider.java:264)
	at org.apache.maven.surefire.junit4.JUnit4Provider.executeTestSet(JUnit4Provider.java:153)
	at org.apache.maven.surefire.junit4.JUnit4Provider.invoke(JUnit4Provider.java:124)
	at org.apache.maven.surefire.booter.ForkedBooter.invokeProviderInSameClassLoader(ForkedBooter.java:200)
	at org.apache.maven.surefire.booter.ForkedBooter.runSuitesInProcess(ForkedBooter.java:153)
	at org.apache.maven.surefire.booter.ForkedBooter.main(ForkedBooter.java:103)

"VM Thread" prio=10 tid=0x00007ffdac264800 nid=0x76e7 runnable 

"GC task thread#0 (ParallelGC)" prio=10 tid=0x00007ffdac020000 nid=0x76da runnable 

"GC task thread#1 (ParallelGC)" prio=10 tid=0x00007ffdac022000 nid=0x76db runnable 

"GC task thread#2 (ParallelGC)" prio=10 tid=0x00007ffdac024000 nid=0x76dc runnable 

"GC task thread#3 (ParallelGC)" prio=10 tid=0x00007ffdac026000 nid=0x76dd runnable 

"GC task thread#4 (ParallelGC)" prio=10 tid=0x00007ffdac027800 nid=0x76de runnable 

"GC task thread#5 (ParallelGC)" prio=10 tid=0x00007ffdac029800 nid=0x76df runnable 

"GC task thread#6 (ParallelGC)" prio=10 tid=0x00007ffdac02b800 nid=0x76e0 runnable 

"GC task thread#7 (ParallelGC)" prio=10 tid=0x00007ffdac02d000 nid=0x76e1 runnable 

"GC task thread#8 (ParallelGC)" prio=10 tid=0x00007ffdac02f000 nid=0x76e2 runnable 

"GC task thread#9 (ParallelGC)" prio=10 tid=0x00007ffdac031000 nid=0x76e3 runnable 

"GC task thread#10 (ParallelGC)" prio=10 tid=0x00007ffdac032800 nid=0x76e4 runnable 

"GC task thread#11 (ParallelGC)" prio=10 tid=0x00007ffdac034800 nid=0x76e5 runnable 

"GC task thread#12 (ParallelGC)" prio=10 tid=0x00007ffdac036800 nid=0x76e6 runnable 

"VM Periodic Task Thread" prio=10 tid=0x00007ffdac29b800 nid=0x76ee waiting on condition 

JNI global references: 216

+ echo '************ END  zombies jstack extract'
************ END  zombies jstack extract
+ JIRA_COMMENT='

     {color:red}-1 core zombie tests{color}.  There are 1 zombie test(s): 	at org.apache.hadoop.yarn.server.resourcemanager.scheduler.capacity.TestContainerAllocation.testContainerTokenGeneratedOnPullRequest(TestContainerAllocation.java:163)'
+ BAD=1
+ jps
+ grep surefirebooter
+ cut -d ' ' -f 1
+ xargs kill -9
POST BUILD TASK : SUCCESS
END OF POST BUILD TASK : 0
Archiving artifacts
Sending artifact delta relative to HBase-0.98-on-Hadoop-1.1 #727
Archived 1774 artifacts
Archive block size is 32768
Received 7 blocks and 265889478 bytes
Compression is 0.1%
Took 1 min 8 sec
Recording test results
Updating HBASE-12776
Updating HBASE-12767