You are viewing a plain text version of this content. The canonical link for it is here.
Posted to builds@beam.apache.org by Apache Jenkins Server <je...@builds.apache.org> on 2023/07/06 22:30:15 UTC

Build failed in Jenkins: beam_PostCommit_Java_Nexmark_Dataflow_V2_Java17 #2245

See <https://ci-beam.apache.org/job/beam_PostCommit_Java_Nexmark_Dataflow_V2_Java17/2245/display/redirect>

Changes:


------------------------------------------
[...truncated 920.09 KB...]
  0004  *** not run ***
  0005  *** not run ***
  0006  *** not run ***
  0007  *** not run ***
  0008          -1.0                        -1.0                          -1              
        *** Job was unexpectedly updated ***
  0009  *** not run ***
  0010          44.0                    227210.8                         100              
  0011         313.2                     31923.5                     1839657              
  0012          13.4                    746435.8                      199929              
  0013          -1.0                        -1.0                          -1              
        *** Job was unexpectedly updated ***
  0014          -1.0                        -1.0                          -1              
        *** Job was unexpectedly updated ***
  0015  *** not run ***
  0016  *** not run ***
==========================================================================================

2023-07-06T22:28:17.668Z RUNNING Query5
Jul 06, 2023 10:28:17 PM org.apache.beam.sdk.testutils.metrics.MetricsReader getCounterMetric
SEVERE: Failed to get metric event.elements, from namespace Query5.Events
Jul 06, 2023 10:28:17 PM org.apache.beam.sdk.testutils.metrics.MetricsReader getCounterMetric
SEVERE: Failed to get metric event.bytes, from namespace Query5.Events
Jul 06, 2023 10:28:17 PM org.apache.beam.sdk.testutils.metrics.MetricsReader getCounterMetric
SEVERE: Failed to get metric result.elements, from namespace Query5.Results
Jul 06, 2023 10:28:17 PM org.apache.beam.sdk.testutils.metrics.MetricsReader getCounterMetric
SEVERE: Failed to get metric result.bytes, from namespace Query5.Results
2023-07-06T22:28:18.179Z no activity
2023-07-06T22:28:33.215Z RUNNING Query5
Jul 06, 2023 10:28:33 PM org.apache.beam.sdk.testutils.metrics.MetricsReader getCounterMetric
SEVERE: Failed to get metric event.elements, from namespace Query5.Events
Jul 06, 2023 10:28:33 PM org.apache.beam.sdk.testutils.metrics.MetricsReader getCounterMetric
SEVERE: Failed to get metric event.bytes, from namespace Query5.Events
Jul 06, 2023 10:28:33 PM org.apache.beam.sdk.testutils.metrics.MetricsReader getCounterMetric
SEVERE: Failed to get metric result.elements, from namespace Query5.Results
Jul 06, 2023 10:28:33 PM org.apache.beam.sdk.testutils.metrics.MetricsReader getCounterMetric
SEVERE: Failed to get metric result.bytes, from namespace Query5.Results
2023-07-06T22:28:33.725Z no activity
2023-07-06T22:28:48.766Z RUNNING Query5
Jul 06, 2023 10:28:48 PM org.apache.beam.sdk.testutils.metrics.MetricsReader getCounterMetric
SEVERE: Failed to get metric event.elements, from namespace Query5.Events
Jul 06, 2023 10:28:48 PM org.apache.beam.sdk.testutils.metrics.MetricsReader getCounterMetric
SEVERE: Failed to get metric event.bytes, from namespace Query5.Events
Jul 06, 2023 10:28:49 PM org.apache.beam.sdk.testutils.metrics.MetricsReader getCounterMetric
SEVERE: Failed to get metric result.elements, from namespace Query5.Results
Jul 06, 2023 10:28:49 PM org.apache.beam.sdk.testutils.metrics.MetricsReader getCounterMetric
SEVERE: Failed to get metric result.bytes, from namespace Query5.Results
2023-07-06T22:28:49.302Z no activity
2023-07-06T22:29:04.343Z RUNNING Query5
Jul 06, 2023 10:29:04 PM org.apache.beam.sdk.testutils.metrics.MetricsReader getCounterMetric
SEVERE: Failed to get metric event.elements, from namespace Query5.Events
Jul 06, 2023 10:29:04 PM org.apache.beam.sdk.testutils.metrics.MetricsReader getCounterMetric
SEVERE: Failed to get metric event.bytes, from namespace Query5.Events
Jul 06, 2023 10:29:04 PM org.apache.beam.sdk.testutils.metrics.MetricsReader getCounterMetric
SEVERE: Failed to get metric result.elements, from namespace Query5.Results
Jul 06, 2023 10:29:04 PM org.apache.beam.sdk.testutils.metrics.MetricsReader getCounterMetric
SEVERE: Failed to get metric result.bytes, from namespace Query5.Results
2023-07-06T22:29:04.828Z no activity
2023-07-06T22:29:19.869Z RUNNING Query5
Jul 06, 2023 10:29:19 PM org.apache.beam.sdk.testutils.metrics.MetricsReader getCounterMetric
SEVERE: Failed to get metric event.elements, from namespace Query5.Events
Jul 06, 2023 10:29:19 PM org.apache.beam.sdk.testutils.metrics.MetricsReader getCounterMetric
SEVERE: Failed to get metric event.bytes, from namespace Query5.Events
Jul 06, 2023 10:29:20 PM org.apache.beam.sdk.testutils.metrics.MetricsReader getCounterMetric
SEVERE: Failed to get metric result.elements, from namespace Query5.Results
Jul 06, 2023 10:29:20 PM org.apache.beam.sdk.testutils.metrics.MetricsReader getCounterMetric
SEVERE: Failed to get metric result.bytes, from namespace Query5.Results
2023-07-06T22:29:20.362Z no activity
2023-07-06T22:29:35.395Z RUNNING Query5
Jul 06, 2023 10:29:35 PM org.apache.beam.sdk.testutils.metrics.MetricsReader getCounterMetric
SEVERE: Failed to get metric event.elements, from namespace Query5.Events
Jul 06, 2023 10:29:35 PM org.apache.beam.sdk.testutils.metrics.MetricsReader getCounterMetric
SEVERE: Failed to get metric event.bytes, from namespace Query5.Events
Jul 06, 2023 10:29:35 PM org.apache.beam.sdk.testutils.metrics.MetricsReader getCounterMetric
SEVERE: Failed to get metric result.elements, from namespace Query5.Results
Jul 06, 2023 10:29:35 PM org.apache.beam.sdk.testutils.metrics.MetricsReader getCounterMetric
SEVERE: Failed to get metric result.bytes, from namespace Query5.Results
2023-07-06T22:29:35.912Z no activity
2023-07-06T22:29:50.946Z RUNNING Query5
Jul 06, 2023 10:29:50 PM org.apache.beam.sdk.testutils.metrics.MetricsReader getCounterMetric
SEVERE: Failed to get metric event.elements, from namespace Query5.Events
Jul 06, 2023 10:29:51 PM org.apache.beam.sdk.testutils.metrics.MetricsReader getCounterMetric
SEVERE: Failed to get metric event.bytes, from namespace Query5.Events
Jul 06, 2023 10:29:51 PM org.apache.beam.sdk.testutils.metrics.MetricsReader getCounterMetric
SEVERE: Failed to get metric result.elements, from namespace Query5.Results
Jul 06, 2023 10:29:51 PM org.apache.beam.sdk.testutils.metrics.MetricsReader getCounterMetric
SEVERE: Failed to get metric result.bytes, from namespace Query5.Results
2023-07-06T22:29:51.462Z no activity
2023-07-06T22:30:06.495Z FAILED Query5
Jul 06, 2023 10:30:06 PM org.apache.beam.sdk.testutils.metrics.MetricsReader getCounterMetric
SEVERE: Failed to get metric event.elements, from namespace Query5.Events
Jul 06, 2023 10:30:06 PM org.apache.beam.sdk.testutils.metrics.MetricsReader getCounterMetric
SEVERE: Failed to get metric event.bytes, from namespace Query5.Events
Jul 06, 2023 10:30:06 PM org.apache.beam.sdk.testutils.metrics.MetricsReader getCounterMetric
SEVERE: Failed to get metric result.elements, from namespace Query5.Results
Jul 06, 2023 10:30:06 PM org.apache.beam.sdk.testutils.metrics.MetricsReader getCounterMetric
SEVERE: Failed to get metric result.bytes, from namespace Query5.Results

==========================================================================================
Run started 2023-07-06T21:26:16.782Z and ran for PT3829.732S

Default configuration:
{"debug":true,"query":null,"sourceType":"DIRECT","generateEventFilePathPrefix":null,"sinkType":"DEVNULL","exportSummaryToBigQuery":false,"pubSubMode":"COMBINED","pubsubMessageSerializationMethod":"CODER","sideInputType":"DIRECT","sideInputRowCount":500,"sideInputNumShards":3,"sideInputUrl":null,"sessionGap":600000,"numEvents":100000,"numEventGenerators":100,"rateShape":"SINE","firstEventRate":10000,"nextEventRate":10000,"rateUnit":"PER_SECOND","ratePeriodSec":600,"preloadSeconds":0,"streamTimeout":240,"isRateLimited":false,"useWallclockEventTime":false,"avgPersonByteSize":200,"avgAuctionByteSize":500,"avgBidByteSize":100,"hotAuctionRatio":2,"hotSellersRatio":4,"hotBiddersRatio":4,"windowSizeSec":10,"windowPeriodSec":5,"watermarkHoldbackSec":0,"numInFlightAuctions":100,"numActivePeople":1000,"coderStrategy":"HAND","cpuDelayMs":0,"diskBusyBytes":0,"auctionSkip":123,"fanout":5,"maxAuctionsWaitingTime":600,"occasionalDelaySec":3,"probDelayedEvent":0.1,"maxLogEvents":100000,"usePubsubPublishTime":false,"outOfOrderGroupSize":1,"numKeyBuckets":20000,"pardoCPUFactor":1.0}

Configurations:
  Conf  Description
  0000  query:PASSTHROUGH; numEvents:10000000
  0001  query:CURRENCY_CONVERSION; numEvents:10000000
  0002  query:SELECTION; numEvents:10000000
  0003  query:LOCAL_ITEM_SUGGESTION; numEvents:10000000
  0004  query:AVERAGE_PRICE_FOR_CATEGORY; numEvents:1000000
  0005  query:HOT_ITEMS; numEvents:10000000
  0006  query:AVERAGE_SELLING_PRICE_BY_SELLER; numEvents:1000000
  0007  query:HIGHEST_BID; numEvents:10000000
  0008  query:MONITOR_NEW_USERS; numEvents:10000000
  0009  query:WINNING_BIDS; numEvents:1000000
  0010  query:LOG_TO_SHARDED_FILES; numEvents:10000000
  0011  query:USER_SESSIONS; numEvents:10000000
  0012  query:PROCESSING_TIME_WINDOWS; numEvents:10000000
  0013  query:PORTABILITY_BATCH; numEvents:10000000
  0014  query:RESHUFFLE; numEvents:10000000
  0015  query:BOUNDED_SIDE_INPUT_JOIN; numEvents:10000000
  0016  query:SESSION_SIDE_INPUT_JOIN; numEvents:10000000

Performance:
  Conf  Runtime(sec)    (Baseline)  Events(/sec)    (Baseline)       Results    (Baseline)
  0000          30.2                    331400.2                    10000000              
  0001          33.5                    298213.7                     9200000              
  0002          -1.0                        -1.0                          -1              
        *** Job was unexpectedly updated ***
  0003  *** not run ***
  0004  *** not run ***
  0005          -1.0                        -1.0                          -1              
        *** Job was unexpectedly updated ***
  0006  *** not run ***
  0007  *** not run ***
  0008          -1.0                        -1.0                          -1              
        *** Job was unexpectedly updated ***
  0009  *** not run ***
  0010          44.0                    227210.8                         100              
  0011         313.2                     31923.5                     1839657              
  0012          13.4                    746435.8                      199929              
  0013          -1.0                        -1.0                          -1              
        *** Job was unexpectedly updated ***
  0014          -1.0                        -1.0                          -1              
        *** Job was unexpectedly updated ***
  0015  *** not run ***
  0016  *** not run ***
==========================================================================================


==========================================================================================
Run started 2023-07-06T21:26:16.782Z and ran for PT3830.062S

Default configuration:
{"debug":true,"query":null,"sourceType":"DIRECT","generateEventFilePathPrefix":null,"sinkType":"DEVNULL","exportSummaryToBigQuery":false,"pubSubMode":"COMBINED","pubsubMessageSerializationMethod":"CODER","sideInputType":"DIRECT","sideInputRowCount":500,"sideInputNumShards":3,"sideInputUrl":null,"sessionGap":600000,"numEvents":100000,"numEventGenerators":100,"rateShape":"SINE","firstEventRate":10000,"nextEventRate":10000,"rateUnit":"PER_SECOND","ratePeriodSec":600,"preloadSeconds":0,"streamTimeout":240,"isRateLimited":false,"useWallclockEventTime":false,"avgPersonByteSize":200,"avgAuctionByteSize":500,"avgBidByteSize":100,"hotAuctionRatio":2,"hotSellersRatio":4,"hotBiddersRatio":4,"windowSizeSec":10,"windowPeriodSec":5,"watermarkHoldbackSec":0,"numInFlightAuctions":100,"numActivePeople":1000,"coderStrategy":"HAND","cpuDelayMs":0,"diskBusyBytes":0,"auctionSkip":123,"fanout":5,"maxAuctionsWaitingTime":600,"occasionalDelaySec":3,"probDelayedEvent":0.1,"maxLogEvents":100000,"usePubsubPublishTime":false,"outOfOrderGroupSize":1,"numKeyBuckets":20000,"pardoCPUFactor":1.0}

Configurations:
  Conf  Description
  0000  query:PASSTHROUGH; numEvents:10000000
  0001  query:CURRENCY_CONVERSION; numEvents:10000000
  0002  query:SELECTION; numEvents:10000000
  0003  query:LOCAL_ITEM_SUGGESTION; numEvents:10000000
  0004  query:AVERAGE_PRICE_FOR_CATEGORY; numEvents:1000000
  0005  query:HOT_ITEMS; numEvents:10000000
  0006  query:AVERAGE_SELLING_PRICE_BY_SELLER; numEvents:1000000
  0007  query:HIGHEST_BID; numEvents:10000000
  0008  query:MONITOR_NEW_USERS; numEvents:10000000
  0009  query:WINNING_BIDS; numEvents:1000000
  0010  query:LOG_TO_SHARDED_FILES; numEvents:10000000
  0011  query:USER_SESSIONS; numEvents:10000000
  0012  query:PROCESSING_TIME_WINDOWS; numEvents:10000000
  0013  query:PORTABILITY_BATCH; numEvents:10000000
  0014  query:RESHUFFLE; numEvents:10000000
  0015  query:BOUNDED_SIDE_INPUT_JOIN; numEvents:10000000
  0016  query:SESSION_SIDE_INPUT_JOIN; numEvents:10000000

Performance:
  Conf  Runtime(sec)    (Baseline)  Events(/sec)    (Baseline)       Results    (Baseline)
  0000          30.2                    331400.2                    10000000              
  0001          33.5                    298213.7                     9200000              
  0002          -1.0                        -1.0                          -1              
        *** Job was unexpectedly updated ***
  0003  *** not run ***
  0004  *** not run ***
  0005          -1.0                        -1.0                          -1              
        *** Job was unexpectedly updated ***
  0006  *** not run ***
  0007  *** not run ***
  0008          -1.0                        -1.0                          -1              
        *** Job was unexpectedly updated ***
  0009  *** not run ***
  0010          44.0                    227210.8                         100              
  0011         313.2                     31923.5                     1839657              
  0012          13.4                    746435.8                      199929              
  0013          -1.0                        -1.0                          -1              
        *** Job was unexpectedly updated ***
  0014          -1.0                        -1.0                          -1              
        *** Job was unexpectedly updated ***
  0015  *** not run ***
  0016  *** not run ***
==========================================================================================

Exception in thread "main" java.lang.RuntimeException: Execution was not successful
	at org.apache.beam.sdk.nexmark.Main.runAll(Main.java:169)
	at org.apache.beam.sdk.nexmark.Main.main(Main.java:441)

> Task :sdks:java:testing:nexmark:run FAILED

> Task :runners:google-cloud-dataflow-java:cleanUpDockerJavaImages
Untagged: us.gcr.io/apache-beam-testing/java-postcommit-it/java:20230706212439
Untagged: us.gcr.io/apache-beam-testing/java-postcommit-it/java@sha256:eb4ee79d48d693811a64003e41d6fbdc5216bdabb130cb466ee8efbc2cd71a77
WARNING: Successfully resolved tag to sha256, but it is recommended to use sha256 directly.
Tag: [us.gcr.io/apache-beam-testing/java-postcommit-it/java:20230706212439]
- referencing digest: [us.gcr.io/apache-beam-testing/java-postcommit-it/java@sha256:eb4ee79d48d693811a64003e41d6fbdc5216bdabb130cb466ee8efbc2cd71a77]

Deleted [[us.gcr.io/apache-beam-testing/java-postcommit-it/java:20230706212439] (referencing [us.gcr.io/apache-beam-testing/java-postcommit-it/java@sha256:eb4ee79d48d693811a64003e41d6fbdc5216bdabb130cb466ee8efbc2cd71a77])].
Removing untagged image us.gcr.io/apache-beam-testing/java-postcommit-it/java@sha256:eb4ee79d48d693811a64003e41d6fbdc5216bdabb130cb466ee8efbc2cd71a77

FAILURE: Build failed with an exception.

* What went wrong:
Execution failed for task ':sdks:java:testing:nexmark:run'.
> Process 'command '/usr/lib/jvm/java-8-openjdk-amd64/bin/java'' finished with non-zero exit value 1

* Try:
> Run with --stacktrace option to get the stack trace.
> Run with --info or --debug option to get more log output.

* Get more help at https://help.gradle.org

Deprecated Gradle features were used in this build, making it incompatible with Gradle 8.0.

You can use '--warning-mode all' to show the individual deprecation warnings and determine if they come from your own scripts or plugins.

See https://docs.gradle.org/7.5.1/userguide/command_line_interface.html#sec:command_line_warnings

Execution optimizations have been disabled for 1 invalid unit(s) of work during this build to ensure correctness.
Please consult deprecation warnings for more details.

BUILD FAILED in 1h 5m 48s
143 actionable tasks: 97 executed, 42 from cache, 4 up-to-date

Publishing build scan...
https://ge.apache.org/s/3zxyektsn6z5a

The remote build cache was disabled during the build due to errors.
Build step 'Invoke Gradle script' changed build result to FAILURE
Build step 'Invoke Gradle script' marked build as failure

---------------------------------------------------------------------
To unsubscribe, e-mail: builds-unsubscribe@beam.apache.org
For additional commands, e-mail: builds-help@beam.apache.org


Jenkins build is back to normal : beam_PostCommit_Java_Nexmark_Dataflow_V2_Java17 #2246

Posted by Apache Jenkins Server <je...@builds.apache.org>.
See <https://ci-beam.apache.org/job/beam_PostCommit_Java_Nexmark_Dataflow_V2_Java17/2246/display/redirect>


---------------------------------------------------------------------
To unsubscribe, e-mail: builds-unsubscribe@beam.apache.org
For additional commands, e-mail: builds-help@beam.apache.org