You are viewing a plain text version of this content. The canonical link for it is here.
Posted to dev@lucene.apache.org by Policeman Jenkins Server <je...@thetaphi.de> on 2014/02/16 20:53:29 UTC
[JENKINS] Lucene-Solr-4.x-Linux (64bit/ibm-j9-jdk7) - Build # 9391
- Still Failing!
Build: http://jenkins.thetaphi.de/job/Lucene-Solr-4.x-Linux/9391/
Java: 64bit/ibm-j9-jdk7 -Xjit:exclude={org/apache/lucene/util/fst/FST.pack(IIF)Lorg/apache/lucene/util/fst/FST;}
1 tests failed.
REGRESSION: org.apache.solr.update.processor.SignatureUpdateProcessorFactoryTest.testDupeDetection
Error Message:
expected:<1> but was:<2>
Stack Trace:
java.lang.AssertionError: expected:<1> but was:<2>
at __randomizedtesting.SeedInfo.seed([406CCC1BF787BBDA:1B5C37D3F4C018A6]:0)
at org.junit.Assert.fail(Assert.java:93)
at org.junit.Assert.failNotEquals(Assert.java:647)
at org.junit.Assert.assertEquals(Assert.java:128)
at org.junit.Assert.assertEquals(Assert.java:472)
at org.junit.Assert.assertEquals(Assert.java:456)
at org.apache.solr.update.processor.SignatureUpdateProcessorFactoryTest.checkNumDocs(SignatureUpdateProcessorFactoryTest.java:71)
at org.apache.solr.update.processor.SignatureUpdateProcessorFactoryTest.testDupeDetection(SignatureUpdateProcessorFactoryTest.java:119)
at sun.reflect.NativeMethodAccessorImpl.invoke0(Native Method)
at sun.reflect.NativeMethodAccessorImpl.invoke(NativeMethodAccessorImpl.java:88)
at sun.reflect.DelegatingMethodAccessorImpl.invoke(DelegatingMethodAccessorImpl.java:55)
at java.lang.reflect.Method.invoke(Method.java:613)
at com.carrotsearch.randomizedtesting.RandomizedRunner.invoke(RandomizedRunner.java:1559)
at com.carrotsearch.randomizedtesting.RandomizedRunner.access$600(RandomizedRunner.java:79)
at com.carrotsearch.randomizedtesting.RandomizedRunner$6.evaluate(RandomizedRunner.java:737)
at com.carrotsearch.randomizedtesting.RandomizedRunner$7.evaluate(RandomizedRunner.java:773)
at com.carrotsearch.randomizedtesting.RandomizedRunner$8.evaluate(RandomizedRunner.java:787)
at com.carrotsearch.randomizedtesting.rules.SystemPropertiesRestoreRule$1.evaluate(SystemPropertiesRestoreRule.java:53)
at org.apache.lucene.util.TestRuleSetupTeardownChained$1.evaluate(TestRuleSetupTeardownChained.java:50)
at org.apache.lucene.util.TestRuleFieldCacheSanity$1.evaluate(TestRuleFieldCacheSanity.java:51)
at org.apache.lucene.util.AbstractBeforeAfterRule$1.evaluate(AbstractBeforeAfterRule.java:46)
at com.carrotsearch.randomizedtesting.rules.SystemPropertiesInvariantRule$1.evaluate(SystemPropertiesInvariantRule.java:55)
at org.apache.lucene.util.TestRuleThreadAndTestName$1.evaluate(TestRuleThreadAndTestName.java:49)
at org.apache.lucene.util.TestRuleIgnoreAfterMaxFailures$1.evaluate(TestRuleIgnoreAfterMaxFailures.java:70)
at org.apache.lucene.util.TestRuleMarkFailure$1.evaluate(TestRuleMarkFailure.java:48)
at com.carrotsearch.randomizedtesting.rules.StatementAdapter.evaluate(StatementAdapter.java:36)
at com.carrotsearch.randomizedtesting.ThreadLeakControl$StatementRunner.run(ThreadLeakControl.java:358)
at com.carrotsearch.randomizedtesting.ThreadLeakControl.forkTimeoutingTask(ThreadLeakControl.java:782)
at com.carrotsearch.randomizedtesting.ThreadLeakControl$3.evaluate(ThreadLeakControl.java:442)
at com.carrotsearch.randomizedtesting.RandomizedRunner.runSingleTest(RandomizedRunner.java:746)
at com.carrotsearch.randomizedtesting.RandomizedRunner$3.evaluate(RandomizedRunner.java:648)
at com.carrotsearch.randomizedtesting.RandomizedRunner$4.evaluate(RandomizedRunner.java:682)
at com.carrotsearch.randomizedtesting.RandomizedRunner$5.evaluate(RandomizedRunner.java:693)
at com.carrotsearch.randomizedtesting.rules.StatementAdapter.evaluate(StatementAdapter.java:36)
at com.carrotsearch.randomizedtesting.rules.SystemPropertiesRestoreRule$1.evaluate(SystemPropertiesRestoreRule.java:53)
at org.apache.lucene.util.AbstractBeforeAfterRule$1.evaluate(AbstractBeforeAfterRule.java:46)
at org.apache.lucene.util.TestRuleStoreClassName$1.evaluate(TestRuleStoreClassName.java:42)
at com.carrotsearch.randomizedtesting.rules.SystemPropertiesInvariantRule$1.evaluate(SystemPropertiesInvariantRule.java:55)
at com.carrotsearch.randomizedtesting.rules.NoShadowingOrOverridesOnMethodsRule$1.evaluate(NoShadowingOrOverridesOnMethodsRule.java:39)
at com.carrotsearch.randomizedtesting.rules.NoShadowingOrOverridesOnMethodsRule$1.evaluate(NoShadowingOrOverridesOnMethodsRule.java:39)
at com.carrotsearch.randomizedtesting.rules.StatementAdapter.evaluate(StatementAdapter.java:36)
at org.apache.lucene.util.TestRuleAssertionsRequired$1.evaluate(TestRuleAssertionsRequired.java:43)
at org.apache.lucene.util.TestRuleMarkFailure$1.evaluate(TestRuleMarkFailure.java:48)
at org.apache.lucene.util.TestRuleIgnoreAfterMaxFailures$1.evaluate(TestRuleIgnoreAfterMaxFailures.java:70)
at org.apache.lucene.util.TestRuleIgnoreTestSuites$1.evaluate(TestRuleIgnoreTestSuites.java:55)
at com.carrotsearch.randomizedtesting.rules.StatementAdapter.evaluate(StatementAdapter.java:36)
at com.carrotsearch.randomizedtesting.ThreadLeakControl$StatementRunner.run(ThreadLeakControl.java:358)
at java.lang.Thread.run(Thread.java:780)
Build Log:
[...truncated 10594 lines...]
[junit4] Suite: org.apache.solr.update.processor.SignatureUpdateProcessorFactoryTest
[junit4] 2> 619072 T1911 oas.SolrTestCaseJ4.buildSSLConfig Randomized ssl (true) and clientAuth (true)
[junit4] 2> 619073 T1911 oas.SolrTestCaseJ4.initCore ####initCore
[junit4] 2> Creating dataDir: /mnt/ssd/jenkins/workspace/Lucene-Solr-4.x-Linux/solr/build/solr-core/test/J1/./solrtest-SignatureUpdateProcessorFactoryTest-1392580270368
[junit4] 2> 619074 T1911 oasc.SolrResourceLoader.<init> new SolrResourceLoader for directory: '/mnt/ssd/jenkins/workspace/Lucene-Solr-4.x-Linux/solr/build/solr-core/test-files/solr/collection1/'
[junit4] 2> 619075 T1911 oasc.SolrResourceLoader.replaceClassLoader Adding 'file:/mnt/ssd/jenkins/workspace/Lucene-Solr-4.x-Linux/solr/build/solr-core/test-files/solr/collection1/lib/classes/' to classloader
[junit4] 2> 619076 T1911 oasc.SolrResourceLoader.replaceClassLoader Adding 'file:/mnt/ssd/jenkins/workspace/Lucene-Solr-4.x-Linux/solr/build/solr-core/test-files/solr/collection1/lib/README' to classloader
[junit4] 2> 619127 T1911 oasc.SolrConfig.<init> Using Lucene MatchVersion: LUCENE_47
[junit4] 2> 619190 T1911 oasc.SolrConfig.<init> Loaded SolrConfig: solrconfig.xml
[junit4] 2> 619191 T1911 oass.IndexSchema.readSchema Reading Solr Schema from schema12.xml
[junit4] 2> 619197 T1911 oass.IndexSchema.readSchema [null] Schema name=test
[junit4] 2> 619485 T1911 oass.IndexSchema.readSchema default search field in schema is text
[junit4] 2> 619487 T1911 oass.IndexSchema.readSchema unique key field: id
[junit4] 2> 619488 T1911 oass.IndexSchema.readSchema WARN Field text is not multivalued and destination for multiple copyFields (2)
[junit4] 2> 619493 T1911 oass.FileExchangeRateProvider.reload Reloading exchange rates from file currency.xml
[junit4] 2> 619497 T1911 oass.FileExchangeRateProvider.reload Reloading exchange rates from file currency.xml
[junit4] 2> 619500 T1911 oasc.SolrResourceLoader.locateSolrHome JNDI not configured for solr (NoInitialContextEx)
[junit4] 2> 619500 T1911 oasc.SolrResourceLoader.locateSolrHome using system property solr.solr.home: /mnt/ssd/jenkins/workspace/Lucene-Solr-4.x-Linux/solr/build/solr-core/test-files/solr
[junit4] 2> 619501 T1911 oasc.SolrResourceLoader.<init> new SolrResourceLoader for directory: '/mnt/ssd/jenkins/workspace/Lucene-Solr-4.x-Linux/solr/build/solr-core/test-files/solr/'
[junit4] 2> 619537 T1911 oasc.CoreContainer.<init> New CoreContainer 18798139
[junit4] 2> 619538 T1911 oasc.CoreContainer.load Loading cores into CoreContainer [instanceDir=/mnt/ssd/jenkins/workspace/Lucene-Solr-4.x-Linux/solr/build/solr-core/test-files/solr/]
[junit4] 2> 619539 T1911 oashc.HttpShardHandlerFactory.getParameter Setting socketTimeout to: 0
[junit4] 2> 619539 T1911 oashc.HttpShardHandlerFactory.getParameter Setting urlScheme to: null
[junit4] 2> 619539 T1911 oashc.HttpShardHandlerFactory.getParameter Setting connTimeout to: 0
[junit4] 2> 619540 T1911 oashc.HttpShardHandlerFactory.getParameter Setting maxConnectionsPerHost to: 20
[junit4] 2> 619540 T1911 oashc.HttpShardHandlerFactory.getParameter Setting corePoolSize to: 0
[junit4] 2> 619540 T1911 oashc.HttpShardHandlerFactory.getParameter Setting maximumPoolSize to: 2147483647
[junit4] 2> 619540 T1911 oashc.HttpShardHandlerFactory.getParameter Setting maxThreadIdleTime to: 5
[junit4] 2> 619541 T1911 oashc.HttpShardHandlerFactory.getParameter Setting sizeOfQueue to: -1
[junit4] 2> 619541 T1911 oashc.HttpShardHandlerFactory.getParameter Setting fairnessPolicy to: false
[junit4] 2> 619545 T1911 oasl.LogWatcher.createWatcher SLF4J impl is org.slf4j.impl.Log4jLoggerFactory
[junit4] 2> 619546 T1911 oasl.LogWatcher.newRegisteredLogWatcher Registering Log Listener [Log4j (org.slf4j.impl.Log4jLoggerFactory)]
[junit4] 2> 619546 T1911 oasc.CoreContainer.load Host Name:
[junit4] 2> 619549 T1912 oasc.CoreContainer.create Creating SolrCore 'collection1' using instanceDir: /mnt/ssd/jenkins/workspace/Lucene-Solr-4.x-Linux/solr/build/solr-core/test-files/solr/collection1
[junit4] 2> 619550 T1912 oasc.SolrResourceLoader.<init> new SolrResourceLoader for directory: '/mnt/ssd/jenkins/workspace/Lucene-Solr-4.x-Linux/solr/build/solr-core/test-files/solr/collection1/'
[junit4] 2> 619550 T1912 oasc.SolrResourceLoader.replaceClassLoader Adding 'file:/mnt/ssd/jenkins/workspace/Lucene-Solr-4.x-Linux/solr/build/solr-core/test-files/solr/collection1/lib/classes/' to classloader
[junit4] 2> 619551 T1912 oasc.SolrResourceLoader.replaceClassLoader Adding 'file:/mnt/ssd/jenkins/workspace/Lucene-Solr-4.x-Linux/solr/build/solr-core/test-files/solr/collection1/lib/README' to classloader
[junit4] 2> 619595 T1912 oasc.SolrConfig.<init> Using Lucene MatchVersion: LUCENE_47
[junit4] 2> 619639 T1912 oasc.SolrConfig.<init> Loaded SolrConfig: solrconfig.xml
[junit4] 2> 619639 T1912 oass.IndexSchema.readSchema Reading Solr Schema from schema12.xml
[junit4] 2> 619645 T1912 oass.IndexSchema.readSchema [collection1] Schema name=test
[junit4] 2> 619924 T1912 oass.IndexSchema.readSchema default search field in schema is text
[junit4] 2> 619926 T1912 oass.IndexSchema.readSchema unique key field: id
[junit4] 2> 619928 T1912 oass.IndexSchema.readSchema WARN Field text is not multivalued and destination for multiple copyFields (2)
[junit4] 2> 619937 T1912 oass.FileExchangeRateProvider.reload Reloading exchange rates from file currency.xml
[junit4] 2> 619940 T1912 oass.FileExchangeRateProvider.reload Reloading exchange rates from file currency.xml
[junit4] 2> 619944 T1912 oasc.SolrCore.initDirectoryFactory org.apache.solr.core.MockDirectoryFactory
[junit4] 2> 619944 T1912 oasc.SolrCore.<init> [collection1] Opening new SolrCore at /mnt/ssd/jenkins/workspace/Lucene-Solr-4.x-Linux/solr/build/solr-core/test-files/solr/collection1/, dataDir=/mnt/ssd/jenkins/workspace/Lucene-Solr-4.x-Linux/solr/build/solr-core/test/J1/./solrtest-SignatureUpdateProcessorFactoryTest-1392580270368/
[junit4] 2> 619944 T1912 oasc.JmxMonitoredMap.<init> JMX monitoring is enabled. Adding Solr mbeans to JMX Server: com.sun.jmx.mbeanserver.JmxMBeanServer@163af2c
[junit4] 2> 619945 T1912 oasc.CachingDirectoryFactory.get return new directory for /mnt/ssd/jenkins/workspace/Lucene-Solr-4.x-Linux/solr/build/solr-core/test/J1/./solrtest-SignatureUpdateProcessorFactoryTest-1392580270368
[junit4] 2> 619945 T1912 oasc.SolrCore.getNewIndexDir New index directory detected: old=null new=/mnt/ssd/jenkins/workspace/Lucene-Solr-4.x-Linux/solr/build/solr-core/test/J1/./solrtest-SignatureUpdateProcessorFactoryTest-1392580270368/index/
[junit4] 2> 619946 T1912 oasc.SolrCore.initIndex WARN [collection1] Solr index directory '/mnt/ssd/jenkins/workspace/Lucene-Solr-4.x-Linux/solr/build/solr-core/test/J1/./solrtest-SignatureUpdateProcessorFactoryTest-1392580270368/index' doesn't exist. Creating new index...
[junit4] 2> 619946 T1912 oasc.CachingDirectoryFactory.get return new directory for /mnt/ssd/jenkins/workspace/Lucene-Solr-4.x-Linux/solr/build/solr-core/test/J1/./solrtest-SignatureUpdateProcessorFactoryTest-1392580270368/index
[junit4] 2> 619946 T1912 oasu.RandomMergePolicy.<init> RandomMergePolicy wrapping class org.apache.lucene.index.TieredMergePolicy: [TieredMergePolicy: maxMergeAtOnce=48, maxMergeAtOnceExplicit=31, maxMergedSegmentMB=17.5517578125, floorSegmentMB=2.056640625, forceMergeDeletesPctAllowed=13.11443158636604, segmentsPerTier=32.0, maxCFSSegmentSizeMB=8.796093022207999E12, noCFSRatio=0.0
[junit4] 2> 619947 T1912 oasc.SolrDeletionPolicy.onCommit SolrDeletionPolicy.onCommit: commits: num=1
[junit4] 2> commit{dir=RateLimitedDirectoryWrapper(MockDirectoryWrapper(RAMDirectory@4d4deeda lockFactory=org.apache.lucene.store.SingleInstanceLockFactory@eb91c9c2)),segFN=segments_1,generation=1}
[junit4] 2> 619947 T1912 oasc.SolrDeletionPolicy.updateCommits newest commit generation = 1
[junit4] 2> 619948 T1912 oasc.SolrCore.initWriters created xml: solr.XMLResponseWriter
[junit4] 2> 619949 T1912 oasup.UpdateRequestProcessorChain.init creating updateRequestProcessorChain "dedupe"
[junit4] 2> 619950 T1912 oasup.UpdateRequestProcessorChain.init inserting DistributedUpdateProcessorFactory into updateRequestProcessorChain "dedupe"
[junit4] 2> 619950 T1912 oasup.UpdateRequestProcessorChain.init creating updateRequestProcessorChain "dedupe-allfields"
[junit4] 2> 619950 T1912 oasup.UpdateRequestProcessorChain.init inserting DistributedUpdateProcessorFactory into updateRequestProcessorChain "dedupe-allfields"
[junit4] 2> 619951 T1912 oasup.UpdateRequestProcessorChain.init creating updateRequestProcessorChain "stored_sig"
[junit4] 2> 619951 T1912 oasup.UpdateRequestProcessorChain.init inserting DistributedUpdateProcessorFactory into updateRequestProcessorChain "stored_sig"
[junit4] 2> 619951 T1912 oasup.UpdateRequestProcessorChain.init creating updateRequestProcessorChain "uniq-fields"
[junit4] 2> 619952 T1912 oasup.UniqFieldsUpdateProcessorFactory.init WARN Use of the 'fields' init param in UniqFieldsUpdateProcessorFactory is deprecated, please use 'fieldName' (or another FieldMutatingUpdateProcessorFactory selector option) instead
[junit4] 2> 619952 T1912 oasup.UniqFieldsUpdateProcessorFactory.init Replacing 'fields' init param with (individual) 'fieldName' params
[junit4] 2> 619952 T1912 oasup.UpdateRequestProcessorChain.init inserting DistributedUpdateProcessorFactory into updateRequestProcessorChain "uniq-fields"
[junit4] 2> 619952 T1912 oasup.UpdateRequestProcessorChain.init creating updateRequestProcessorChain "distrib-dup-test-chain-explicit"
[junit4] 2> 619953 T1912 oasup.UpdateRequestProcessorChain.init creating updateRequestProcessorChain "distrib-dup-test-chain-implicit"
[junit4] 2> 619953 T1912 oasup.UpdateRequestProcessorChain.init inserting DistributedUpdateProcessorFactory into updateRequestProcessorChain "distrib-dup-test-chain-implicit"
[junit4] 2> 619953 T1912 oasc.SolrCore.loadUpdateProcessorChains no updateRequestProcessorChain defined as default, creating implicit default
[junit4] 2> 619954 T1912 oasc.RequestHandlers.initHandlersFromConfig adding lazy requestHandler: solr.ReplicationHandler
[junit4] 2> 619954 T1912 oasc.RequestHandlers.initHandlersFromConfig created /replication: solr.ReplicationHandler
[junit4] 2> 619954 T1912 oasc.RequestHandlers.initHandlersFromConfig created standard: solr.StandardRequestHandler
[junit4] 2> 619955 T1912 oasc.RequestHandlers.initHandlersFromConfig created /get: solr.RealTimeGetHandler
[junit4] 2> 619955 T1912 oasc.RequestHandlers.initHandlersFromConfig created dismax: solr.SearchHandler
[junit4] 2> 619956 T1912 oasc.RequestHandlers.initHandlersFromConfig created mock: org.apache.solr.core.MockQuerySenderListenerReqHandler
[junit4] 2> 619956 T1912 oasc.RequestHandlers.initHandlersFromConfig created /admin/: org.apache.solr.handler.admin.AdminHandlers
[junit4] 2> 619956 T1912 oasc.RequestHandlers.initHandlersFromConfig created /admin/file: solr.admin.ShowFileRequestHandler
[junit4] 2> 619957 T1912 oasc.RequestHandlers.initHandlersFromConfig created defaults: solr.StandardRequestHandler
[junit4] 2> 619957 T1912 oasc.RequestHandlers.initHandlersFromConfig adding lazy requestHandler: solr.StandardRequestHandler
[junit4] 2> 619957 T1912 oasc.RequestHandlers.initHandlersFromConfig created lazy: solr.StandardRequestHandler
[junit4] 2> 619957 T1912 oasc.RequestHandlers.initHandlersFromConfig created /update: solr.UpdateRequestHandler
[junit4] 2> 619958 T1912 oasc.RequestHandlers.initHandlersFromConfig created /terms: org.apache.solr.handler.component.SearchHandler
[junit4] 2> 619958 T1912 oasc.RequestHandlers.initHandlersFromConfig created spellCheckCompRH: org.apache.solr.handler.component.SearchHandler
[junit4] 2> 619959 T1912 oasc.RequestHandlers.initHandlersFromConfig created spellCheckCompRH_Direct: org.apache.solr.handler.component.SearchHandler
[junit4] 2> 619959 T1912 oasc.RequestHandlers.initHandlersFromConfig created spellCheckWithWordbreak: org.apache.solr.handler.component.SearchHandler
[junit4] 2> 619959 T1912 oasc.RequestHandlers.initHandlersFromConfig created spellCheckWithWordbreak_Direct: org.apache.solr.handler.component.SearchHandler
[junit4] 2> 619960 T1912 oasc.RequestHandlers.initHandlersFromConfig created spellCheckCompRH1: org.apache.solr.handler.component.SearchHandler
[junit4] 2> 619960 T1912 oasc.RequestHandlers.initHandlersFromConfig created mltrh: org.apache.solr.handler.component.SearchHandler
[junit4] 2> 619960 T1912 oasc.RequestHandlers.initHandlersFromConfig created tvrh: org.apache.solr.handler.component.SearchHandler
[junit4] 2> 619961 T1912 oasc.RequestHandlers.initHandlersFromConfig created /mlt: solr.MoreLikeThisHandler
[junit4] 2> 619961 T1912 oasc.RequestHandlers.initHandlersFromConfig created /debug/dump: solr.DumpRequestHandler
[junit4] 2> 619962 T1912 oashl.XMLLoader.init xsltCacheLifetimeSeconds=60
[junit4] 2> 619964 T1912 oasc.SolrCore.initDeprecatedSupport WARN solrconfig.xml uses deprecated <admin/gettableFiles>, Please update your config to use the ShowFileRequestHandler.
[junit4] 2> 619965 T1912 oasu.CommitTracker.<init> Hard AutoCommit: disabled
[junit4] 2> 619965 T1912 oasu.CommitTracker.<init> Soft AutoCommit: disabled
[junit4] 2> 619966 T1912 oasu.RandomMergePolicy.<init> RandomMergePolicy wrapping class org.apache.lucene.index.LogDocMergePolicy: [LogDocMergePolicy: minMergeSize=1000, mergeFactor=36, maxMergeSize=9223372036854775807, maxMergeSizeForForcedMerge=9223372036854775807, calibrateSizeByDeletes=false, maxMergeDocs=2147483647, maxCFSSegmentSizeMB=8.796093022207999E12, noCFSRatio=0.8132713125622723]
[junit4] 2> 619966 T1912 oasc.SolrDeletionPolicy.onInit SolrDeletionPolicy.onInit: commits: num=1
[junit4] 2> commit{dir=RateLimitedDirectoryWrapper(MockDirectoryWrapper(RAMDirectory@4d4deeda lockFactory=org.apache.lucene.store.SingleInstanceLockFactory@eb91c9c2)),segFN=segments_1,generation=1}
[junit4] 2> 619967 T1912 oasc.SolrDeletionPolicy.updateCommits newest commit generation = 1
[junit4] 2> 619967 T1912 oass.SolrIndexSearcher.<init> Opening Searcher@e5b5a50f[collection1] main
[junit4] 2> 619968 T1912 oashc.SpellCheckComponent.inform Initializing spell checkers
[junit4] 2> 620125 T1912 oass.DirectSolrSpellChecker.init init: {name=direct,classname=DirectSolrSpellChecker,field=lowerfilt,minQueryLength=3}
[junit4] 2> 620141 T1913 oasc.SolrCore.registerSearcher [collection1] Registered new searcher Searcher@e5b5a50f[collection1] main{StandardDirectoryReader(segments_1:1:nrt)}
[junit4] 2> 620144 T1912 oasc.CoreContainer.registerCore registering core: collection1
[junit4] 2> 620145 T1911 oas.SolrTestCaseJ4.initCore ####initCore end
[junit4] 2> 620148 T1911 oas.SolrTestCaseJ4.setUp ###Starting testMultiThreaded
[junit4] 2> ASYNC NEW_CORE C1113 name=collection1 org.apache.solr.core.SolrCore@c41398f6
[junit4] 2> 620148 T1911 C1113 oasu.DirectUpdateHandler2.deleteAll [collection1] REMOVING ALL DOCUMENTS FROM INDEX
[junit4] 2> 620149 T1911 C1113 oasup.LogUpdateProcessor.finish [collection1] webapp=null path=null params={} {deleteByQuery=*:*} 0 1
[junit4] 2> 620152 T1911 C1113 oasu.DirectUpdateHandler2.commit start commit{,optimize=false,openSearcher=true,waitSearcher=true,expungeDeletes=false,softCommit=false,prepareCommit=false}
[junit4] 2> 620153 T1911 C1113 oasc.SolrDeletionPolicy.onCommit SolrDeletionPolicy.onCommit: commits: num=2
[junit4] 2> commit{dir=RateLimitedDirectoryWrapper(MockDirectoryWrapper(RAMDirectory@4d4deeda lockFactory=org.apache.lucene.store.SingleInstanceLockFactory@eb91c9c2)),segFN=segments_1,generation=1}
[junit4] 2> commit{dir=RateLimitedDirectoryWrapper(MockDirectoryWrapper(RAMDirectory@4d4deeda lockFactory=org.apache.lucene.store.SingleInstanceLockFactory@eb91c9c2)),segFN=segments_2,generation=2}
[junit4] 2> 620153 T1911 C1113 oasc.SolrDeletionPolicy.updateCommits newest commit generation = 2
[junit4] 2> 620154 T1911 C1113 oass.SolrIndexSearcher.<init> Opening Searcher@5d91d59b[collection1] main
[junit4] 2> 620154 T1911 C1113 oasu.DirectUpdateHandler2.commit end_commit_flush
[junit4] 2> 620155 T1913 oasc.SolrCore.registerSearcher [collection1] Registered new searcher Searcher@5d91d59b[collection1] main{StandardDirectoryReader(segments_2:2:nrt)}
[junit4] 2> 620156 T1911 C1113 oasup.LogUpdateProcessor.finish [collection1] webapp=null path=null params={} {commit=} 0 4
[junit4] 2> 620163 T1923 oasu.DirectUpdateHandler2.commit start commit{,optimize=false,openSearcher=true,waitSearcher=true,expungeDeletes=false,softCommit=false,prepareCommit=false}
[junit4] 2> 620196 T1923 oasc.SolrDeletionPolicy.onCommit SolrDeletionPolicy.onCommit: commits: num=2
[junit4] 2> commit{dir=RateLimitedDirectoryWrapper(MockDirectoryWrapper(RAMDirectory@4d4deeda lockFactory=org.apache.lucene.store.SingleInstanceLockFactory@eb91c9c2)),segFN=segments_2,generation=2}
[junit4] 2> commit{dir=RateLimitedDirectoryWrapper(MockDirectoryWrapper(RAMDirectory@4d4deeda lockFactory=org.apache.lucene.store.SingleInstanceLockFactory@eb91c9c2)),segFN=segments_3,generation=3}
[junit4] 2> 620197 T1923 oasc.SolrDeletionPolicy.updateCommits newest commit generation = 3
[junit4] 2> 620265 T1923 oass.SolrIndexSearcher.<init> Opening Searcher@dcbd471e[collection1] main
[junit4] 2> 620266 T1923 oasu.DirectUpdateHandler2.commit end_commit_flush
[junit4] 2> 620268 T1913 oasc.SolrCore.registerSearcher [collection1] Registered new searcher Searcher@dcbd471e[collection1] main{StandardDirectoryReader(segments_3:26:nrt _7(4.7):c33/31:delGen=1 _5(4.7):c20/19:delGen=1)}
[junit4] 2> 620268 T1924 oasu.DirectUpdateHandler2.commit start commit{,optimize=false,openSearcher=true,waitSearcher=true,expungeDeletes=false,softCommit=false,prepareCommit=false}
[junit4] 2> 620291 T1924 oasc.SolrDeletionPolicy.onCommit SolrDeletionPolicy.onCommit: commits: num=2
[junit4] 2> commit{dir=RateLimitedDirectoryWrapper(MockDirectoryWrapper(RAMDirectory@4d4deeda lockFactory=org.apache.lucene.store.SingleInstanceLockFactory@eb91c9c2)),segFN=segments_3,generation=3}
[junit4] 2> commit{dir=RateLimitedDirectoryWrapper(MockDirectoryWrapper(RAMDirectory@4d4deeda lockFactory=org.apache.lucene.store.SingleInstanceLockFactory@eb91c9c2)),segFN=segments_4,generation=4}
[junit4] 2> 620292 T1924 oasc.SolrDeletionPolicy.updateCommits newest commit generation = 4
[junit4] 2> 620294 T1924 oass.SolrIndexSearcher.<init> Opening Searcher@54ff1f8e[collection1] main
[junit4] 2> 620294 T1924 oasu.DirectUpdateHandler2.commit end_commit_flush
[junit4] 2> 620296 T1913 oasc.SolrCore.registerSearcher [collection1] Registered new searcher Searcher@54ff1f8e[collection1] main{StandardDirectoryReader(segments_4:35:nrt _a(4.7):c82/79:delGen=1 _c(4.7):c1)}
[junit4] 2> 620297 T1922 oasu.DirectUpdateHandler2.commit start commit{,optimize=false,openSearcher=true,waitSearcher=true,expungeDeletes=false,softCommit=false,prepareCommit=false}
[junit4] 2> 620297 T1922 oasc.SolrDeletionPolicy.onCommit SolrDeletionPolicy.onCommit: commits: num=2
[junit4] 2> commit{dir=RateLimitedDirectoryWrapper(MockDirectoryWrapper(RAMDirectory@4d4deeda lockFactory=org.apache.lucene.store.SingleInstanceLockFactory@eb91c9c2)),segFN=segments_4,generation=4}
[junit4] 2> commit{dir=RateLimitedDirectoryWrapper(MockDirectoryWrapper(RAMDirectory@4d4deeda lockFactory=org.apache.lucene.store.SingleInstanceLockFactory@eb91c9c2)),segFN=segments_5,generation=5}
[junit4] 2> 620298 T1922 oasc.SolrDeletionPolicy.updateCommits newest commit generation = 5
[junit4] 2> 620298 T1922 oass.SolrIndexSearcher.<init> Opening Searcher@bca8913b[collection1] main
[junit4] 2> 620299 T1922 oasu.DirectUpdateHandler2.commit end_commit_flush
[junit4] 2> 620300 T1923 oasu.DirectUpdateHandler2.commit start commit{,optimize=false,openSearcher=true,waitSearcher=true,expungeDeletes=false,softCommit=false,prepareCommit=false}
[junit4] 2> 620301 T1913 oasc.SolrCore.registerSearcher [collection1] Registered new searcher Searcher@bca8913b[collection1] main{StandardDirectoryReader(segments_4:35:nrt _a(4.7):c82/79:delGen=2 _c(4.7):c1)}
[junit4] 2> 620302 T1923 oasc.SolrDeletionPolicy.onCommit SolrDeletionPolicy.onCommit: commits: num=2
[junit4] 2> commit{dir=RateLimitedDirectoryWrapper(MockDirectoryWrapper(RAMDirectory@4d4deeda lockFactory=org.apache.lucene.store.SingleInstanceLockFactory@eb91c9c2)),segFN=segments_5,generation=5}
[junit4] 2> commit{dir=RateLimitedDirectoryWrapper(MockDirectoryWrapper(RAMDirectory@4d4deeda lockFactory=org.apache.lucene.store.SingleInstanceLockFactory@eb91c9c2)),segFN=segments_6,generation=6}
[junit4] 2> 620303 T1923 oasc.SolrDeletionPolicy.updateCommits newest commit generation = 6
[junit4] 2> 620305 T1923 oass.SolrIndexSearcher.<init> Opening Searcher@516d60cd[collection1] main
[junit4] 2> 620306 T1923 oasu.DirectUpdateHandler2.commit end_commit_flush
[junit4] 2> 620306 T1924 oasu.DirectUpdateHandler2.commit start commit{,optimize=false,openSearcher=true,waitSearcher=true,expungeDeletes=false,softCommit=false,prepareCommit=false}
[junit4] 2> 620307 T1924 oasc.SolrDeletionPolicy.onCommit SolrDeletionPolicy.onCommit: commits: num=2
[junit4] 2> commit{dir=RateLimitedDirectoryWrapper(MockDirectoryWrapper(RAMDirectory@4d4deeda lockFactory=org.apache.lucene.store.SingleInstanceLockFactory@eb91c9c2)),segFN=segments_6,generation=6}
[junit4] 2> commit{dir=RateLimitedDirectoryWrapper(MockDirectoryWrapper(RAMDirectory@4d4deeda lockFactory=org.apache.lucene.store.SingleInstanceLockFactory@eb91c9c2)),segFN=segments_7,generation=7}
[junit4] 2> 620307 T1913 oasc.SolrCore.registerSearcher [collection1] Registered new searcher Searcher@516d60cd[collection1] main{StandardDirectoryReader(segments_6:43:nrt _a(4.7):c82/79:delGen=2 _e(4.7):c1)}
[junit4] 2> 620308 T1924 oasc.SolrDeletionPolicy.updateCommits newest commit generation = 7
[junit4] 2> 620309 T1924 oass.SolrIndexSearcher.<init> Opening Searcher@25d160f1[collection1] main
[junit4] 2> 620309 T1924 oasu.DirectUpdateHandler2.commit end_commit_flush
[junit4] 2> 620310 T1922 oasu.DirectUpdateHandler2.commit start commit{,optimize=false,openSearcher=true,waitSearcher=true,expungeDeletes=false,softCommit=false,prepareCommit=false}
[junit4] 2> 620310 T1922 oasu.DirectUpdateHandler2.commit No uncommitted changes. Skipping IW.commit.
[junit4] 2> 620311 T1913 oasc.SolrCore.registerSearcher [collection1] Registered new searcher Searcher@25d160f1[collection1] main{StandardDirectoryReader(segments_6:43:nrt _a(4.7):c82/79:delGen=2 _e(4.7):c1)}
[junit4] 2> 620312 T1922 oass.SolrIndexSearcher.<init> Opening Searcher@ce5841c7[collection1] main
[junit4] 2> 620312 T1922 oasu.DirectUpdateHandler2.commit end_commit_flush
[junit4] 2> 620314 T1923 oasu.DirectUpdateHandler2.commit start commit{,optimize=false,openSearcher=true,waitSearcher=true,expungeDeletes=false,softCommit=false,prepareCommit=false}
[junit4] 2> 620316 T1913 oasc.SolrCore.registerSearcher [collection1] Registered new searcher Searcher@ce5841c7[collection1] main{StandardDirectoryReader(segments_6:43:nrt _a(4.7):c82/79:delGen=2 _e(4.7):c1)}
[junit4] 2> 620319 T1923 oasc.SolrDeletionPolicy.onCommit SolrDeletionPolicy.onCommit: commits: num=2
[junit4] 2> commit{dir=RateLimitedDirectoryWrapper(MockDirectoryWrapper(RAMDirectory@4d4deeda lockFactory=org.apache.lucene.store.SingleInstanceLockFactory@eb91c9c2)),segFN=segments_7,generation=7}
[junit4] 2> commit{dir=RateLimitedDirectoryWrapper(MockDirectoryWrapper(RAMDirectory@4d4deeda lockFactory=org.apache.lucene.store.SingleInstanceLockFactory@eb91c9c2)),segFN=segments_8,generation=8}
[junit4] 2> 620320 T1923 oasc.SolrDeletionPolicy.updateCommits newest commit generation = 8
[junit4] 2> 620322 T1923 oass.SolrIndexSearcher.<init> Opening Searcher@b8ce2866[collection1] main
[junit4] 2> 620324 T1923 oasu.DirectUpdateHandler2.commit end_commit_flush
[junit4] 2> 620325 T1924 oasu.DirectUpdateHandler2.commit start commit{,optimize=false,openSearcher=true,waitSearcher=true,expungeDeletes=false,softCommit=false,prepareCommit=false}
[junit4] 2> 620326 T1924 oasc.SolrDeletionPolicy.onCommit SolrDeletionPolicy.onCommit: commits: num=2
[junit4] 2> commit{dir=RateLimitedDirectoryWrapper(MockDirectoryWrapper(RAMDirectory@4d4deeda lockFactory=org.apache.lucene.store.SingleInstanceLockFactory@eb91c9c2)),segFN=segments_8,generation=8}
[junit4] 2> commit{dir=RateLimitedDirectoryWrapper(MockDirectoryWrapper(RAMDirectory@4d4deeda lockFactory=org.apache.lucene.store.SingleInstanceLockFactory@eb91c9c2)),segFN=segments_9,generation=9}
[junit4] 2> 620325 T1913 oasc.SolrCore.registerSearcher [collection1] Registered new searcher Searcher@b8ce2866[collection1] main{StandardDirectoryReader(segments_8:53:nrt _a(4.7):c82/81:delGen=3 _e(4.7):c1 _h(4.7):c1)}
[junit4] 2> 620327 T1924 oasc.SolrDeletionPolicy.updateCommits newest commit generation = 9
[junit4] 2> 620329 T1924 oass.SolrIndexSearcher.<init> Opening Searcher@c45f6370[collection1] main
[junit4] 2> 620333 T1913 oasc.SolrCore.registerSearcher [collection1] Registered new searcher Searcher@c45f6370[collection1] main{StandardDirectoryReader(segments_8:53:nrt _a(4.7):c82/81:delGen=3 _e(4.7):c1 _h(4.7):c1)}
[junit4] 2> 620333 T1924 oasu.DirectUpdateHandler2.commit end_commit_flush
[junit4] 2> 620334 T1922 oasu.DirectUpdateHandler2.commit start commit{,optimize=false,openSearcher=true,waitSearcher=true,expungeDeletes=false,softCommit=false,prepareCommit=false}
[junit4] 2> 620336 T1922 oasc.SolrDeletionPolicy.onCommit SolrDeletionPolicy.onCommit: commits: num=2
[junit4] 2> commit{dir=RateLimitedDirectoryWrapper(MockDirectoryWrapper(RAMDirectory@4d4deeda lockFactory=org.apache.lucene.store.SingleInstanceLockFactory@eb91c9c2)),segFN=segments_9,generation=9}
[junit4] 2> commit{dir=RateLimitedDirectoryWrapper(MockDirectoryWrapper(RAMDirectory@4d4deeda lockFactory=org.apache.lucene.store.SingleInstanceLockFactory@eb91c9c2)),segFN=segments_a,generation=10}
[junit4] 2> 620337 T1922 oasc.SolrDeletionPolicy.updateCommits newest commit generation = 10
[junit4] 2> 620339 T1922 oass.SolrIndexSearcher.<init> Opening Searcher@b902026e[collection1] main
[junit4] 2> 620340 T1922 oasu.DirectUpdateHandler2.commit end_commit_flush
[junit4] 2> 620340 T1923 oasu.DirectUpdateHandler2.commit start commit{,optimize=false,openSearcher=true,waitSearcher=true,expungeDeletes=false,softCommit=false,prepareCommit=false}
[junit4] 2> 620341 T1923 oasc.SolrDeletionPolicy.onCommit SolrDeletionPolicy.onCommit: commits: num=2
[junit4] 2> commit{dir=RateLimitedDirectoryWrapper(MockDirectoryWrapper(RAMDirectory@4d4deeda lockFactory=org.apache.lucene.store.SingleInstanceLockFactory@eb91c9c2)),segFN=segments_a,generation=10}
[junit4] 2> commit{dir=RateLimitedDirectoryWrapper(MockDirectoryWrapper(RAMDirectory@4d4deeda lockFactory=org.apache.lucene.store.SingleInstanceLockFactory@eb91c9c2)),segFN=segments_b,generation=11}
[junit4] 2> 620341 T1913 oasc.SolrCore.registerSearcher [collection1] Registered new searcher Searcher@b902026e[collection1] main{StandardDirectoryReader(segments_a:61:nrt _a(4.7):c82/81:delGen=3 _j(4.7):c1)}
[junit4] 2> 620342 T1923 oasc.SolrDeletionPolicy.updateCommits newest commit generation = 11
[junit4] 2> 620343 T1923 oass.SolrIndexSearcher.<init> Opening Searcher@65e4bdf3[collection1] main
[junit4] 2> 620343 T1923 oasu.DirectUpdateHandler2.commit end_commit_flush
[junit4] 2> 620344 T1924 oasu.DirectUpdateHandler2.commit start commit{,optimize=false,openSearcher=true,waitSearcher=true,expungeDeletes=false,softCommit=false,prepareCommit=false}
[junit4] 2> 620344 T1924 oasu.DirectUpdateHandler2.commit No uncommitted changes. Skipping IW.commit.
[junit4] 2> 620345 T1913 oasc.SolrCore.registerSearcher [collection1] Registered new searcher Searcher@65e4bdf3[collection1] main{StandardDirectoryReader(segments_a:61:nrt _a(4.7):c82/81:delGen=3 _j(4.7):c1)}
[junit4] 2> 620347 T1924 oass.SolrIndexSearcher.<init> Opening Searcher@d9625f80[collection1] main
[junit4] 2> 620347 T1924 oasu.DirectUpdateHandler2.commit end_commit_flush
[junit4] 2> 620348 T1922 oasu.DirectUpdateHandler2.commit start commit{,optimize=false,openSearcher=true,waitSearcher=true,expungeDeletes=false,softCommit=false,prepareCommit=false}
[junit4] 2> 620349 T1913 oasc.SolrCore.registerSearcher [collection1] Registered new searcher Searcher@d9625f80[collection1] main{StandardDirectoryReader(segments_b:65:nrt _a(4.7):c82/81:delGen=3 _k(4.7):c1)}
[junit4] 2> 620350 T1922 oasc.SolrDeletionPolicy.onCommit SolrDeletionPolicy.onCommit: commits: num=2
[junit4] 2> commit{dir=RateLimitedDirectoryWrapper(MockDirectoryWrapper(RAMDirectory@4d4deeda lockFactory=org.apache.lucene.store.SingleInstanceLockFactory@eb91c9c2)),segFN=segments_b,generation=11}
[junit4] 2> commit{dir=RateLimitedDirectoryWrapper(MockDirectoryWrapper(RAMDirectory@4d4deeda lockFactory=org.apache.lucene.store.SingleInstanceLockFactory@eb91c9c2)),segFN=segments_c,generation=12}
[junit4] 2> 620351 T1922 oasc.SolrDeletionPolicy.updateCommits newest commit generation = 12
[junit4] 2> 620353 T1922 oass.SolrIndexSearcher.<init> Opening Searcher@7f028bb3[collection1] main
[junit4] 2> 620354 T1922 oasu.DirectUpdateHandler2.commit end_commit_flush
[junit4] 2> 620355 T1923 oasu.DirectUpdateHandler2.commit start commit{,optimize=false,openSearcher=true,waitSearcher=true,expungeDeletes=false,softCommit=false,prepareCommit=false}
[junit4] 2> 620355 T1913 oasc.SolrCore.registerSearcher [collection1] Registered new searcher Searcher@7f028bb3[collection1] main{StandardDirectoryReader(segments_c:71:nrt _a(4.7):c82/81:delGen=3 _l(4.7):c1 _m(4.7):c1)}
[junit4] 2> 620356 T1923 oasc.SolrDeletionPolicy.onCommit SolrDeletionPolicy.onCommit: commits: num=2
[junit4] 2> commit{dir=RateLimitedDirectoryWrapper(MockDirectoryWrapper(RAMDirectory@4d4deeda lockFactory=org.apache.lucene.store.SingleInstanceLockFactory@eb91c9c2)),segFN=segments_c,generation=12}
[junit4] 2> commit{dir=RateLimitedDirectoryWrapper(MockDirectoryWrapper(RAMDirectory@4d4deeda lockFactory=org.apache.lucene.store.SingleInstanceLockFactory@eb91c9c2)),segFN=segments_d,generation=13}
[junit4] 2> 620356 T1923 oasc.SolrDeletionPolicy.updateCommits newest commit generation = 13
[junit4] 2> 620357 T1923 oass.SolrIndexSearcher.<init> Opening Searcher@517678fd[collection1] main
[junit4] 2> 620358 T1923 oasu.DirectUpdateHandler2.commit end_commit_flush
[junit4] 2> 620358 T1924 oasu.DirectUpdateHandler2.commit start commit{,optimize=false,openSearcher=true,waitSearcher=true,expungeDeletes=false,softCommit=false,prepareCommit=false}
[junit4] 2> 620359 T1924 oasu.DirectUpdateHandler2.commit No uncommitted changes. Skipping IW.commit.
[junit4] 2> 620359 T1913 oasc.SolrCore.registerSearcher [collection1] Registered new searcher Searcher@517678fd[collection1] main{StandardDirectoryReader(segments_d:73:nrt _a(4.7):c82/81:delGen=3 _m(4.7):c1)}
[junit4] 2> 620361 T1924 oass.SolrIndexSearcher.<init> Opening Searcher@317dc546[collection1] main
[junit4] 2> 620361 T1924 oasu.DirectUpdateHandler2.commit end_commit_flush
[junit4] 2> 620362 T1922 oasu.DirectUpdateHandler2.commit start commit{,optimize=false,openSearcher=true,waitSearcher=true,expungeDeletes=false,softCommit=false,prepareCommit=false}
[junit4] 2> 620363 T1913 oasc.SolrCore.registerSearcher [collection1] Registered new searcher Searcher@317dc546[collection1] main{StandardDirectoryReader(segments_d:77:nrt _a(4.7):c82/81:delGen=3 _n(4.7):c1)}
[junit4] 2> 620364 T1922 oasc.SolrDeletionPolicy.onCommit SolrDeletionPolicy.onCommit: commits: num=2
[junit4] 2> commit{dir=RateLimitedDirectoryWrapper(MockDirectoryWrapper(RAMDirectory@4d4deeda lockFactory=org.apache.lucene.store.SingleInstanceLockFactory@eb91c9c2)),segFN=segments_d,generation=13}
[junit4] 2> commit{dir=RateLimitedDirectoryWrapper(MockDirectoryWrapper(RAMDirectory@4d4deeda lockFactory=org.apache.lucene.store.SingleInstanceLockFactory@eb91c9c2)),segFN=segments_e,generation=14}
[junit4] 2> 620364 T1922 oasc.SolrDeletionPolicy.updateCommits newest commit generation = 14
[junit4] 2> 620365 T1922 oass.SolrIndexSearcher.<init> Opening Searcher@9804e68b[collection1] main
[junit4] 2> 620366 T1922 oasu.DirectUpdateHandler2.commit end_commit_flush
[junit4] 2> 620367 T1924 oasu.DirectUpdateHandler2.commit start commit{,optimize=false,openSearcher=true,waitSearcher=true,expungeDeletes=false,softCommit=false,prepareCommit=false}
[junit4] 2> 620367 T1913 oasc.SolrCore.registerSearcher [collection1] Registered new searcher Searcher@9804e68b[collection1] main{StandardDirectoryReader(segments_e:79:nrt _a(4.7):c82/81:delGen=3 _n(4.7):c1 _o(4.7):c1)}
[junit4] 2> 620369 T1924 oasc.SolrDeletionPolicy.onCommit SolrDeletionPolicy.onCommit: commits: num=2
[junit4] 2> commit{dir=RateLimitedDirectoryWrapper(MockDirectoryWrapper(RAMDirectory@4d4deeda lockFactory=org.apache.lucene.store.SingleInstanceLockFactory@eb91c9c2)),segFN=segments_e,generation=14}
[junit4] 2> commit{dir=RateLimitedDirectoryWrapper(MockDirectoryWrapper(RAMDirectory@4d4deeda lockFactory=org.apache.lucene.store.SingleInstanceLockFactory@eb91c9c2)),segFN=segments_f,generation=15}
[junit4] 2> 620370 T1924 oasc.SolrDeletionPolicy.updateCommits newest commit generation = 15
[junit4] 2> 620371 T1924 oass.SolrIndexSearcher.<init> Opening Searcher@3e5b6a7f[collection1] main
[junit4] 2> 620372 T1924 oasu.DirectUpdateHandler2.commit end_commit_flush
[junit4] 2> 620372 T1923 oasu.DirectUpdateHandler2.commit start commit{,optimize=false,openSearcher=true,waitSearcher=true,expungeDeletes=false,softCommit=false,prepareCommit=false}
[junit4] 2> 620372 T1923 oasc.SolrDeletionPolicy.onCommit SolrDeletionPolicy.onCommit: commits: num=2
[junit4] 2> commit{dir=RateLimitedDirectoryWrapper(MockDirectoryWrapper(RAMDirectory@4d4deeda lockFactory=org.apache.lucene.store.SingleInstanceLockFactory@eb91c9c2)),segFN=segments_f,generation=15}
[junit4] 2> commit{dir=RateLimitedDirectoryWrapper(MockDirectoryWrapper(RAMDirectory@4d4deeda lockFactory=org.apache.lucene.store.SingleInstanceLockFactory@eb91c9c2)),segFN=segments_g,generation=16}
[junit4] 2> 620373 T1923 oasc.SolrDeletionPolicy.updateCommits newest commit generation = 16
[junit4] 2> 620373 T1913 oasc.SolrCore.registerSearcher [collection1] Registered new searcher Searcher@3e5b6a7f[collection1] main{StandardDirectoryReader(segments_f:87:nrt _a(4.7):c82/81:delGen=3 _n(4.7):c1 _q(4.7):c1)}
[junit4] 2> 620374 T1923 oass.SolrIndexSearcher.<init> Opening Searcher@2bcc1aa1[collection1] main
[junit4] 2> 620374 T1923 oasu.DirectUpdateHandler2.commit end_commit_flush
[junit4] 2> 620375 T1922 oasu.DirectUpdateHandler2.commit start commit{,optimize=false,openSearcher=true,waitSearcher=true,expungeDeletes=false,softCommit=false,prepareCommit=false}
[junit4] 2> 620375 T1922 oasu.DirectUpdateHandler2.commit No uncommitted changes. Skipping IW.commit.
[junit4] 2> 620376 T1922 oasc.SolrCore.getSearcher WARN [collection1] PERFORMANCE WARNING: Overlapping onDeckSearchers=2
[junit4] 2> 620378 T1922 oass.SolrIndexSearcher.<init> Opening Searcher@5f702e8d[collection1] main
[junit4] 2> 620379 T1913 oasc.SolrCore.registerSearcher [collection1] Registered new searcher Searcher@2bcc1aa1[collection1] main{StandardDirectoryReader(segments_f:87:nrt _a(4.7):c82/81:delGen=3 _n(4.7):c1 _q(4.7):c1)}
[junit4] 2> 620379 T1922 oasu.DirectUpdateHandler2.commit end_commit_flush
[junit4] 2> 620381 T1913 oasc.SolrCore.registerSearcher [collection1] Registered new searcher Searcher@5f702e8d[collection1] main{StandardDirectoryReader(segments_g:91:nrt _n(4.7):c1 _q(4.7):c1 _r(4.7):c1)}
[junit4] 2> 620387 T1924 oasu.DirectUpdateHandler2.commit start commit{,optimize=false,openSearcher=true,waitSearcher=true,expungeDeletes=false,softCommit=false,prepareCommit=false}
[junit4] 2> 620390 T1924 oasc.SolrDeletionPolicy.onCommit SolrDeletionPolicy.onCommit: commits: num=2
[junit4] 2> commit{dir=RateLimitedDirectoryWrapper(MockDirectoryWrapper(RAMDirectory@4d4deeda lockFactory=org.apache.lucene.store.SingleInstanceLockFactory@eb91c9c2)),segFN=segments_g,generation=16}
[junit4] 2> commit{dir=RateLimitedDirectoryWrapper(MockDirectoryWrapper(RAMDirectory@4d4deeda lockFactory=org.apache.lucene.store.SingleInstanceLockFactory@eb91c9c2)),segFN=segments_h,generation=17}
[junit4] 2> 620390 T1924 oasc.SolrDeletionPolicy.updateCommits newest commit generation = 17
[junit4] 2> 620392 T1924 oass.SolrIndexSearcher.<init> Opening Searcher@fdfc526c[collection1] main
[junit4] 2> 620393 T1924 oasu.DirectUpdateHandler2.commit end_commit_flush
[junit4] 2> 620394 T1923 oasu.DirectUpdateHandler2.commit start commit{,optimize=false,openSearcher=true,waitSearcher=true,expungeDeletes=false,softCommit=false,prepareCommit=false}
[junit4] 2> 620394 T1913 oasc.SolrCore.registerSearcher [collection1] Registered new searcher Searcher@fdfc526c[collection1] main{StandardDirectoryReader(segments_h:99:nrt _n(4.7):c1 _q(4.7):c1 _t(4.7):c1)}
[junit4] 2> 620394 T1923 oasc.SolrDeletionPolicy.onCommit SolrDeletionPolicy.onCommit: commits: num=2
[junit4] 2> commit{dir=RateLimitedDirectoryWrapper(MockDirectoryWrapper(RAMDirectory@4d4deeda lockFactory=org.apache.lucene.store.SingleInstanceLockFactory@eb91c9c2)),segFN=segments_h,generation=17}
[junit4] 2> commit{dir=RateLimitedDirectoryWrapper(MockDirectoryWrapper(RAMDirectory@4d4deeda lockFactory=org.apache.lucene.store.SingleInstanceLockFactory@eb91c9c2)),segFN=segments_i,generation=18}
[junit4] 2> 620395 T1923 oasc.SolrDeletionPolicy.updateCommits newest commit generation = 18
[junit4] 2> 620395 T1923 oass.SolrIndexSearcher.<init> Opening Searcher@4551cef9[collection1] main
[junit4] 2> 620396 T1923 oasu.DirectUpdateHandler2.commit end_commit_flush
[junit4] 2> 620396 T1922 oasu.DirectUpdateHandler2.commit start commit{,optimize=false,openSearcher=true,waitSearcher=true,expungeDeletes=false,softCommit=false,prepareCommit=false}
[junit4] 2> 620396 T1922 oasu.DirectUpdateHandler2.commit No uncommitted changes. Skipping IW.commit.
[junit4] 2> 620396 T1913 oasc.SolrCore.registerSearcher [collection1] Registered new searcher Searcher@4551cef9[collection1] main{StandardDirectoryReader(segments_h:99:nrt _n(4.7):c1 _q(4.7):c1 _t(4.7):c1)}
[junit4] 2> 620399 T1922 oass.SolrIndexSearcher.<init> Opening Searcher@5ea94891[collection1] main
[junit4] 2> 620399 T1922 oasu.DirectUpdateHandler2.commit end_commit_flush
[junit4] 2> 620400 T1924 oasu.DirectUpdateHandler2.commit start commit{,optimize=false,openSearcher=true,waitSearcher=true,expungeDeletes=false,softCommit=false,prepareCommit=false}
[junit4] 2> 620400 T1913 oasc.SolrCore.registerSearcher [collection1] Registered new searcher Searcher@5ea94891[collection1] main{StandardDirectoryReader(segments_i:101:nrt _n(4.7):c1 _q(4.7):c1 _t(4.7):c1 _u(4.7):c1)}
[junit4] 2> 620402 T1924 oasc.SolrDeletionPolicy.onCommit SolrDeletionPolicy.onCommit: commits: num=2
[junit4] 2> commit{dir=RateLimitedDirectoryWrapper(MockDirectoryWrapper(RAMDirectory@4d4deeda lockFactory=org.apache.lucene.store.SingleInstanceLockFactory@eb91c9c2)),segFN=segments_i,generation=18}
[junit4] 2> commit{dir=RateLimitedDirectoryWrapper(MockDirectoryWrapper(RAMDirectory@4d4deeda lockFactory=org.apache.lucene.store.SingleInstanceLockFactory@eb91c9c2)),segFN=segments_j,generation=19}
[junit4] 2> 620403 T1924 oasc.SolrDeletionPolicy.updateCommits newest commit generation = 19
[junit4] 2> 620405 T1924 oass.SolrIndexSearcher.<init> Opening Searcher@1abe912b[collection1] main
[junit4] 2> 620405 T1924 oasu.DirectUpdateHandler2.commit end_commit_flush
[junit4] 2> 620406 T1923 oasu.DirectUpdateHandler2.commit start commit{,optimize=false,openSearcher=true,waitSearcher=true,expungeDeletes=false,softCommit=false,prepareCommit=false}
[junit4] 2> 620407 T1923 oasc.SolrDeletionPolicy.onCommit SolrDeletionPolicy.onCommit: commits: num=2
[junit4] 2> commit{dir=RateLimitedDirectoryWrapper(MockDirectoryWrapper(RAMDirectory@4d4deeda lockFactory=org.apache.lucene.store.SingleInstanceLockFactory@eb91c9c2)),segFN=segments_j,generation=19}
[junit4] 2> commit{dir=RateLimitedDirectoryWrapper(MockDirectoryWrapper(RAMDirectory@4d4deeda lockFactory=org.apache.lucene.store.SingleInstanceLockFactory@eb91c9c2)),segFN=segments_k,generation=20}
[junit4] 2> 620407 T1913 oasc.SolrCore.registerSearcher [collection1] Registered new searcher Searcher@1abe912b[collection1] main{StandardDirectoryReader(segments_j:109:nrt _n(4.7):c1 _q(4.7):c1 _w(4.7):c1)}
[junit4] 2> 620407 T1923 oasc.SolrDeletionPolicy.updateCommits newest commit generation = 20
[junit4] 2> 620409 T1923 oass.SolrIndexSearcher.<init> Opening Searcher@e185c2f1[collection1] main
[junit4] 2> 620410 T1923 oasu.DirectUpdateHandler2.commit end_commit_flush
[junit4] 2> 620410 T1922 oasu.DirectUpdateHandler2.commit start commit{,optimize=false,openSearcher=true,waitSearcher=true,expungeDeletes=false,softCommit=false,prepareCommit=false}
[junit4] 2> 620411 T1913 oasc.SolrCore.registerSearcher [collection1] Registered new searcher Searcher@e185c2f1[collection1] main{StandardDirectoryReader(segments_j:109:nrt _n(4.7):c1 _q(4.7):c1 _w(4.7):c1)}
[junit4] 2> 620412 T1922 oasc.SolrDeletionPolicy.onCommit SolrDeletionPolicy.onCommit: commits: num=2
[junit4] 2> commit{dir=RateLimitedDirectoryWrapper(MockDirectoryWrapper(RAMDirectory@4d4deeda lockFactory=org.apache.lucene.store.SingleInstanceLockFactory@eb91c9c2)),segFN=segments_k,generation=20}
[junit4] 2> commit{dir=RateLimitedDirectoryWrapper(MockDirectoryWrapper(RAMDirectory@4d4deeda lockFactory=org.apache.lucene.store.SingleInstanceLockFactory@eb91c9c2)),segFN=segments_l,generation=21}
[junit4] 2> 620412 T1922 oasc.SolrDeletionPolicy.updateCommits newest commit generation = 21
[junit4] 2> 620414 T1922 oass.SolrIndexSearcher.<init> Opening Searcher@c93383ef[collection1] main
[junit4] 2> 620415 T1922 oasu.DirectUpdateHandler2.commit end_commit_flush
[junit4] 2> 620415 T1924 oasu.DirectUpdateHandler2.commit start commit{,optimize=false,openSearcher=true,waitSearcher=true,expungeDeletes=false,softCommit=false,prepareCommit=false}
[junit4] 2> 620416 T1913 oasc.SolrCore.registerSearcher [collection1] Registered new searcher Searcher@c93383ef[collection1] main{StandardDirectoryReader(segments_l:114:nrt _n(4.7):c1 _w(4.7):c1 _x(4.7):c1)}
[junit4] 2> 620417 T1924 oasc.SolrDeletionPolicy.onCommit SolrDeletionPolicy.onCommit: commits: num=2
[junit4] 2> commit{dir=RateLimitedDirectoryWrapper(MockDirectoryWrapper(RAMDirectory@4d4deeda lockFactory=org.apache.lucene.store.SingleInstanceLockFactory@eb91c9c2)),segFN=segments_l,generation=21}
[junit4] 2> commit{dir=RateLimitedDirectoryWrapper(MockDirectoryWrapper(RAMDirectory@4d4deeda lockFactory=org.apache.lucene.store.SingleInstanceLockFactory@eb91c9c2)),segFN=segments_m,generation=22}
[junit4] 2> 620418 T1924 oasc.SolrDeletionPolicy.updateCommits newest commit generation = 22
[junit4] 2> 620419 T1924 oass.SolrIndexSearcher.<init> Opening Searcher@53e095df[collection1] main
[junit4] 2> 620419 T1924 oasu.DirectUpdateHandler2.commit end_commit_flush
[junit4] 2> 620420 T1923 oasu.DirectUpdateHandler2.commit start commit{,optimize=false,openSearcher=true,waitSearcher=true,expungeDeletes=false,softCommit=false,prepareCommit=false}
[junit4] 2> 620421 T1913 oasc.SolrCore.registerSearcher [collection1] Registered new searcher Searcher@53e095df[collection1] main{StandardDirectoryReader(segments_m:117:nrt _w(4.7):c1 _y(4.7):c1)}
[junit4] 2> 620422 T1923 oasc.SolrDeletionPolicy.onCommit SolrDeletionPolicy.onCommit: commits: num=2
[junit4] 2> commit{dir=RateLimitedDirectoryWrapper(MockDirectoryWrapper(RAMDirectory@4d4deeda lockFactory=org.apache.lucene.store.SingleInstanceLockFactory@eb91c9c2)),segFN=segments_m,generation=22}
[junit4] 2> commit{dir=RateLimitedDirectoryWrapper(MockDirectoryWrapper(RAMDirectory@4d4deeda lockFactory=org.apache.lucene.store.SingleInstanceLockFactory@eb91c9c2)),segFN=segments_n,generation=23}
[junit4] 2> 620423 T1923 oasc.SolrDeletionPolicy.updateCommits newest commit generation = 23
[junit4] 2> 620424 T1923 oass.SolrIndexSearcher.<init> Opening Searcher@54d7ca41[collection1] main
[junit4] 2> 620424 T1923 oasu.DirectUpdateHandler2.commit end_commit_flush
[junit4] 2> 620425 T1922 oasu.DirectUpdateHandler2.commit start commit{,optimize=false,openSearcher=true,waitSearcher=true,expungeDeletes=false,softCommit=false,prepareCommit=false}
[junit4] 2> 620426 T1913 oasc.SolrCore.registerSearcher [collection1] Registered new searcher Searcher@54d7ca41[collection1] main{StandardDirectoryReader(segments_n:121:nrt _w(4.7):c1 _z(4.7):c1)}
[junit4] 2> 620427 T1922 oasc.SolrDeletionPolicy.onCommit SolrDeletionPolicy.onCommit: commits: num=2
[junit4] 2> commit{dir=RateLimitedDirectoryWrapper(MockDirectoryWrapper(RAMDirectory@4d4deeda lockFactory=org.apache.lucene.store.SingleInstanceLockFactory@eb91c9c2)),segFN=segments_n,generation=23}
[junit4] 2> commit{dir=RateLimitedDirectoryWrapper(MockDirectoryWrapper(RAMDirectory@4d4deeda lockFactory=org.apache.lucene.store.SingleInstanceLockFactory@eb91c9c2)),segFN=segments_o,generation=24}
[junit4] 2> 620428 T1922 oasc.SolrDeletionPolicy.updateCommits newest commit generation = 24
[junit4] 2> 620428 T1922 oass.SolrIndexSearcher.<init> Opening Searcher@289fa7ae[collection1] main
[junit4] 2> 620429 T1922 oasu.DirectUpdateHandler2.commit end_commit_flush
[junit4] 2> 620429 T1924 oasu.DirectUpdateHandler2.commit start commit{,optimize=false,openSearcher=true,waitSearcher=true,expungeDeletes=false,softCommit=false,prepareCommit=false}
[junit4] 2> 620431 T1913 oasc.SolrCore.registerSearcher [collection1] Registered new searcher Searcher@289fa7ae[collection1] main{StandardDirectoryReader(segments_o:125:nrt _z(4.7):c1 _10(4.7):c1)}
[junit4] 2> 620431 T1924 oasc.SolrDeletionPolicy.onCommit SolrDeletionPolicy.onCommit: commits: num=2
[junit4] 2> commit{dir=RateLimitedDirectoryWrapper(MockDirectoryWrapper(RAMDirectory@4d4deeda lockFactory=org.apache.lucene.store.SingleInstanceLockFactory@eb91c9c2)),segFN=segments_o,generation=24}
[junit4] 2> commit{dir=RateLimitedDirectoryWrapper(MockDirectoryWrapper(RAMDirectory@4d4deeda lockFactory=org.apache.lucene.store.SingleInstanceLockFactory@eb91c9c2)),segFN=segments_p,generation=25}
[junit4] 2> 620432 T1924 oasc.SolrDeletionPolicy.updateCommits newest commit generation = 25
[junit4] 2> 620432 T1924 oass.SolrIndexSearcher.<init> Opening Searcher@66281c42[collection1] main
[junit4] 2> 620433 T1924 oasu.DirectUpdateHandler2.commit end_commit_flush
[junit4] 2> 620433 T1923 oasu.DirectUpdateHandler2.commit start commit{,optimize=false,openSearcher=true,waitSearcher=true,expungeDeletes=false,softCommit=false,prepareCommit=false}
[junit4] 2> 620434 T1923 oasu.DirectUpdateHandler2.commit No uncommitted changes. Skipping IW.commit.
[junit4] 2> 620435 T1913 oasc.SolrCore.registerSearcher [collection1] Registered new searcher Searcher@66281c42[collection1] main{StandardDirectoryReader(segments_p:129:nrt _11(4.7):c1)}
[junit4] 2> 620437 T1923 oass.SolrIndexSearcher.<init> Opening Searcher@4e40b079[collection1] main
[junit4] 2> 620438 T1923 oasu.DirectUpdateHandler2.commit end_commit_flush
[junit4] 2> 620439 T1922 oasu.DirectUpdateHandler2.commit start commit{,optimize=false,openSearcher=true,waitSearcher=true,expungeDeletes=false,softCommit=false,prepareCommit=false}
[junit4] 2> 620439 T1913 oasc.SolrCore.registerSearcher [collection1] Registered new searcher Searcher@4e40b079[collection1] main{StandardDirectoryReader(segments_p:133:nrt _12(4.7):c1)}
[junit4] 2> 620439 T1922 oasc.SolrDeletionPolicy.onCommit SolrDeletionPolicy.onCommit: commits: num=2
[junit4] 2> commit{dir=RateLimitedDirectoryWrapper(MockDirectoryWrapper(RAMDirectory@4d4deeda lockFactory=org.apache.lucene.store.SingleInstanceLockFactory@eb91c9c2)),segFN=segments_p,generation=25}
[junit4] 2> commit{dir=RateLimitedDirectoryWrapper(MockDirectoryWrapper(RAMDirectory@4d4deeda lockFactory=org.apache.lucene.store.SingleInstanceLockFactory@eb91c9c2)),segFN=segments_q,generation=26}
[junit4] 2> 620440 T1922 oasc.SolrDeletionPolicy.updateCommits newest commit generation = 26
[junit4] 2> 620440 T1922 oass.SolrIndexSearcher.<init> Opening Searcher@11d8a25d[collection1] main
[junit4] 2> 620441 T1922 oasu.DirectUpdateHandler2.commit end_commit_flush
[junit4] 2> 620441 T1913 oasc.SolrCore.registerSearcher [collection1] Registered new searcher Searcher@11d8a25d[collection1] main{StandardDirectoryReader(segments_p:133:nrt _12(4.7):c1)}
[junit4] 2> ASYNC NEW_CORE C1114 name=collection1 org.apache.solr.core.SolrCore@c41398f6
[junit4] 2> 620442 T1911 C1114 oasu.DirectUpdateHandler2.commit start commit{,optimize=false,openSearcher=true,waitSearcher=true,expungeDeletes=false,softCommit=false,prepareCommit=false}
[junit4] 2> 620442 T1911 C1114 oasu.DirectUpdateHandler2.commit No uncommitted changes. Skipping IW.commit.
[junit4] 2> 620443 T1911 C1114 oass.SolrIndexSearcher.<init> Opening Searcher@ef7b8596[collection1] main
[junit4] 2> 620444 T1911 C1114 oasu.DirectUpdateHandler2.commit end_commit_flush
[junit4] 2> 620444 T1913 oasc.SolrCore.registerSearcher [collection1] Registered new searcher Searcher@ef7b8596[collection1] main{StandardDirectoryReader(segments_p:133:nrt _12(4.7):c1)}
[junit4] 2> 620445 T1911 C1114 oasup.LogUpdateProcessor.finish [collection1] webapp=null path=null params={} {commit=} 0 3
[junit4] 2> 620446 T1911 oas.SolrTestCaseJ4.tearDown ###Ending testMultiThreaded
[junit4] 2> 620450 T1911 oas.SolrTestCaseJ4.setUp ###Starting testNonStringFieldsValues
[junit4] 2> 620450 T1911 C1114 oasu.DirectUpdateHandler2.deleteAll [collection1] REMOVING ALL DOCUMENTS FROM INDEX
[junit4] 2> 620451 T1911 C1114 oasup.LogUpdateProcessor.finish [collection1] webapp=null path=null params={} {deleteByQuery=*:*} 0 1
[junit4] 2> 620452 T1911 C1114 oasu.DirectUpdateHandler2.commit start commit{,optimize=false,openSearcher=true,waitSearcher=true,expungeDeletes=false,softCommit=false,prepareCommit=false}
[junit4] 2> 620453 T1911 C1114 oasc.SolrDeletionPolicy.onCommit SolrDeletionPolicy.onCommit: commits: num=2
[junit4] 2> commit{dir=RateLimitedDirectoryWrapper(MockDirectoryWrapper(RAMDirectory@4d4deeda lockFactory=org.apache.lucene.store.SingleInstanceLockFactory@eb91c9c2)),segFN=segments_q,generation=26}
[junit4] 2> commit{dir=RateLimitedDirectoryWrapper(MockDirectoryWrapper(RAMDirectory@4d4deeda lockFactory=org.apache.lucene.store.SingleInstanceLockFactory@eb91c9c2)),segFN=segments_r,generation=27}
[junit4] 2> 620453 T1911 C1114 oasc.SolrDeletionPolicy.updateCommits newest commit generation = 27
[junit4] 2> 620454 T1911 C1114 oass.SolrIndexSearcher.<init> Opening Searcher@e2e1602[collection1] main
[junit4] 2> 620455 T1911 C1114 oasu.DirectUpdateHandler2.commit end_commit_flush
[junit4] 2> 620456 T1913 oasc.SolrCore.registerSearcher [collection1] Registered new searcher Searcher@e2e1602[collection1] main{StandardDirectoryReader(segments_r:134:nrt)}
[junit4] 2> 620457 T1911 C1114 oasup.LogUpdateProcessor.finish [collection1] webapp=null path=null params={} {commit=} 0 5
[junit4] 2> 620462 T1911 oashl.XMLLoader.init xsltCacheLifetimeSeconds=60
[junit4] 2> 620466 T1911 oasu.DirectUpdateHandler2.commit start commit{,optimize=false,openSearcher=true,waitSearcher=true,expungeDeletes=false,softCommit=false,prepareCommit=false}
[junit4] 2> 620468 T1911 oasc.SolrDeletionPolicy.onCommit SolrDeletionPolicy.onCommit: commits: num=2
[junit4] 2> commit{dir=RateLimitedDirectoryWrapper(MockDirectoryWrapper(RAMDirectory@4d4deeda lockFactory=org.apache.lucene.store.SingleInstanceLockFactory@eb91c9c2)),segFN=segments_r,generation=27}
[junit4] 2> commit{dir=RateLimitedDirectoryWrapper(MockDirectoryWrapper(RAMDirectory@4d4deeda lockFactory=org.apache.lucene.store.SingleInstanceLockFactory@eb91c9c2)),segFN=segments_s,generation=28}
[junit4] 2> 620468 T1911 oasc.SolrDeletionPolicy.updateCommits newest commit generation = 28
[junit4] 2> 620469 T1911 oass.SolrIndexSearcher.<init> Opening Searcher@d82b9cfc[collection1] main
[junit4] 2> 620470 T1911 oasu.DirectUpdateHandler2.commit end_commit_flush
[junit4] 2> 620471 T1913 oasc.SolrCore.registerSearcher [collection1] Registered new searcher Searcher@d82b9cfc[collection1] main{StandardDirectoryReader(segments_s:136:nrt _13(4.7):c5/1:delGen=1)}
[junit4] 2> 620472 T1911 oas.SolrTestCaseJ4.tearDown ###Ending testNonStringFieldsValues
[junit4] 2> 620475 T1911 oas.SolrTestCaseJ4.setUp ###Starting testDupeDetection
[junit4] 2> 620476 T1911 C1114 oasu.DirectUpdateHandler2.deleteAll [collection1] REMOVING ALL DOCUMENTS FROM INDEX
[junit4] 2> 620476 T1911 C1114 oasup.LogUpdateProcessor.finish [collection1] webapp=null path=null params={} {deleteByQuery=*:*} 0 0
[junit4] 2> 620477 T1911 C1114 oasu.DirectUpdateHandler2.commit start commit{,optimize=false,openSearcher=true,waitSearcher=true,expungeDeletes=false,softCommit=false,prepareCommit=false}
[junit4] 2> 620478 T1911 C1114 oasc.SolrDeletionPolicy.onCommit SolrDeletionPolicy.onCommit: commits: num=2
[junit4] 2> commit{dir=RateLimitedDirectoryWrapper(MockDirectoryWrapper(RAMDirectory@4d4deeda lockFactory=org.apache.lucene.store.SingleInstanceLockFactory@eb91c9c2)),segFN=segments_s,generation=28}
[junit4] 2> commit{dir=RateLimitedDirectoryWrapper(MockDirectoryWrapper(RAMDirectory@4d4deeda lockFactory=org.apache.lucene.store.SingleInstanceLockFactory@eb91c9c2)),segFN=segments_t,generation=29}
[junit4] 2> 620479 T1911 C1114 oasc.SolrDeletionPolicy.updateCommits newest commit generation = 29
[junit4] 2> 620479 T1911 C1114 oass.SolrIndexSearcher.<init> Opening Searcher@40fd14aa[collection1] main
[junit4] 2> 620480 T1911 C1114 oasu.DirectUpdateHandler2.commit end_commit_flush
[junit4] 2> 620481 T1913 oasc.SolrCore.registerSearcher [collection1] Registered new searcher Searcher@40fd14aa[collection1] main{StandardDirectoryReader(segments_t:137:nrt)}
[junit4] 2> 620481 T1911 C1114 oasup.LogUpdateProcessor.finish [collection1] webapp=null path=null params={} {commit=} 0 4
[junit4] 2> 620486 T1911 oasu.DirectUpdateHandler2.commit start commit{,optimize=false,openSearcher=true,waitSearcher=true,expungeDeletes=false,softCommit=false,prepareCommit=false}
[junit4] 2> 620487 T1911 oasc.SolrDeletionPolicy.onCommit SolrDeletionPolicy.onCommit: commits: num=2
[junit4] 2> commit{dir=RateLimitedDirectoryWrapper(MockDirectoryWrapper(RAMDirectory@4d4deeda lockFactory=org.apache.lucene.store.SingleInstanceLockFactory@eb91c9c2)),segFN=segments_t,generation=29}
[junit4] 2> commit{dir=RateLimitedDirectoryWrapper(MockDirectoryWrapper(RAMDirectory@4d4deeda lockFactory=org.apache.lucene.store.SingleInstanceLockFactory@eb91c9c2)),segFN=segments_u,generation=30}
[junit4] 2> 620488 T1911 oasc.SolrDeletionPolicy.updateCommits newest commit generation = 30
[junit4] 2> 620488 T1911 oass.SolrIndexSearcher.<init> Opening Searcher@6553f3cd[collection1] main
[junit4] 2> 620489 T1911 oasu.DirectUpdateHandler2.commit end_commit_flush
[junit4] 2> 620490 T1913 oasc.SolrCore.registerSearcher [collection1] Registered new searcher Searcher@6553f3cd[collection1] main{StandardDirectoryReader(segments_u:139:nrt _14(4.7):c2)}
[junit4] 2> 620493 T1911 oasu.DirectUpdateHandler2.commit start commit{,optimize=false,openSearcher=true,waitSearcher=true,expungeDeletes=false,softCommit=false,prepareCommit=false}
[junit4] 2> 620495 T1911 oasc.SolrDeletionPolicy.onCommit SolrDeletionPolicy.onCommit: commits: num=2
[junit4] 2> commit{dir=RateLimitedDirectoryWrapper(MockDirectoryWrapper(RAMDirectory@4d4deeda lockFactory=org.apache.lucene.store.SingleInstanceLockFactory@eb91c9c2)),segFN=segments_u,generation=30}
[junit4] 2> commit{dir=RateLimitedDirectoryWrapper(MockDirectoryWrapper(RAMDirectory@4d4deeda lockFactory=org.apache.lucene.store.SingleInstanceLockFactory@eb91c9c2)),segFN=segments_v,generation=31}
[junit4] 2> 620496 T1911 oasc.SolrDeletionPolicy.updateCommits newest commit generation = 31
[junit4] 2> 620496 T1911 oass.SolrIndexSearcher.<init> Opening Searcher@a66c752[collection1] main
[junit4] 2> 620497 T1911 oasu.DirectUpdateHandler2.commit end_commit_flush
[junit4] 2> 620498 T1913 oasc.SolrCore.registerSearcher [collection1] Registered new searcher Searcher@a66c752[collection1] main{StandardDirectoryReader(segments_v:142:nrt _14(4.7):c2/1:delGen=1 _15(4.7):c1)}
[junit4] 2> 620499 T1911 oas.SolrTestCaseJ4.tearDown ###Ending testDupeDetection
[junit4] 2> NOTE: reproduce with: ant test -Dtestcase=SignatureUpdateProcessorFactoryTest -Dtests.method=testDupeDetection -Dtests.seed=406CCC1BF787BBDA -Dtests.multiplier=3 -Dtests.slow=true -Dtests.locale=fi_FI -Dtests.timezone=America/Cuiaba -Dtests.file.encoding=ISO-8859-1
[junit4] FAILURE 0.03s J1 | SignatureUpdateProcessorFactoryTest.testDupeDetection <<<
[junit4] > Throwable #1: java.lang.AssertionError: expected:<1> but was:<2>
[junit4] > at __randomizedtesting.SeedInfo.seed([406CCC1BF787BBDA:1B5C37D3F4C018A6]:0)
[junit4] > at org.apache.solr.update.processor.SignatureUpdateProcessorFactoryTest.checkNumDocs(SignatureUpdateProcessorFactoryTest.java:71)
[junit4] > at org.apache.solr.update.processor.SignatureUpdateProcessorFactoryTest.testDupeDetection(SignatureUpdateProcessorFactoryTest.java:119)
[junit4] > at java.lang.Thread.run(Thread.java:780)
[junit4] 2> 620507 T1911 oas.SolrTestCaseJ4.setUp ###Starting testNonIndexedSignatureField
[junit4] 2> 620507 T1911 C1114 oasu.DirectUpdateHandler2.deleteAll [collection1] REMOVING ALL DOCUMENTS FROM INDEX
[junit4] 2> 620508 T1911 C1114 oasup.LogUpdateProcessor.finish [collection1] webapp=null path=null params={} {deleteByQuery=*:*} 0 1
[junit4] 2> 620509 T1911 C1114 oasu.DirectUpdateHandler2.commit start commit{,optimize=false,openSearcher=true,waitSearcher=true,expungeDeletes=false,softCommit=false,prepareCommit=false}
[junit4] 2> 620510 T1911 C1114 oasc.SolrDeletionPolicy.onCommit SolrDeletionPolicy.onCommit: commits: num=2
[junit4] 2> commit{dir=RateLimitedDirectoryWrapper(MockDirectoryWrapper(RAMDirectory@4d4deeda lockFactory=org.apache.lucene.store.SingleInstanceLockFactory@eb91c9c2)),segFN=segments_v,generation=31}
[junit4] 2> commit{dir=RateLimitedDirectoryWrapper(MockDirectoryWrapper(RAMDirectory@4d4deeda lockFactory=org.apache.lucene.store.SingleInstanceLockFactory@eb91c9c2)),segFN=segments_w,generation=32}
[junit4] 2> 620510 T1911 C1114 oasc.SolrDeletionPolicy.updateCommits newest commit generation = 32
[junit4] 2> 620511 T1911 C1114 oass.SolrIndexSearcher.<init> Opening Searcher@b1dc36a6[collection1] main
[junit4] 2> 620511 T1911 C1114 oasu.DirectUpdateHandler2.commit end_commit_flush
[junit4] 2> 620513 T1913 oasc.SolrCore.registerSearcher [collection1] Registered new searcher Searcher@b1dc36a6[collection1] main{StandardDirectoryReader(segments_w:143:nrt)}
[junit4] 2> 620513 T1911 C1114 oasup.LogUpdateProcessor.finish [collection1] webapp=null path=null params={} {commit=} 0 4
[junit4] 2> 620517 T1911 oasu.DirectUpdateHandler2.commit start commit{,optimize=false,openSearcher=true,waitSearcher=true,expungeDeletes=false,softCommit=false,prepareCommit=false}
[junit4] 2> 620519 T1911 oasc.SolrDeletionPolicy.onCommit SolrDeletionPolicy.onCommit: commits: num=2
[junit4] 2> commit{dir=RateLimitedDirectoryWrapper(MockDirectoryWrapper(RAMDirectory@4d4deeda lockFactory=org.apache.lucene.store.SingleInstanceLockFactory@eb91c9c2)),segFN=segments_w,generation=32}
[junit4] 2> commit{dir=RateLimitedDirectoryWrapper(MockDirectoryWrapper(RAMDirectory@4d4deeda lockFactory=org.apache.lucene.store.SingleInstanceLockFactory@eb91c9c2)),segFN=segments_x,generation=33}
[junit4] 2> 620519 T1911 oasc.SolrDeletionPolicy.updateCommits newest commit generation = 33
[junit4] 2> 620520 T1911 oass.SolrIndexSearcher.<init> Opening Searcher@65c566a0[collection1] main
[junit4] 2> 620521 T1911 oasu.DirectUpdateHandler2.commit end_commit_flush
[junit4] 2> 620522 T1913 oasc.SolrCore.registerSearcher [collection1] Registered new searcher Searcher@65c566a0[collection1] main{StandardDirectoryReader(segments_x:145:nrt _16(4.7):c2)}
[junit4] 2> 620522 T1911 oas.SolrTestCaseJ4.tearDown ###Ending testNonIndexedSignatureField
[junit4] 2> 620526 T1911 oas.SolrTestCaseJ4.setUp ###Starting testFailNonIndexedSigWithOverwriteDupes
[junit4] 2> 620527 T1911 C1114 oasu.DirectUpdateHandler2.deleteAll [collection1] REMOVING ALL DOCUMENTS FROM INDEX
[junit4] 2> 620527 T1911 C1114 oasup.LogUpdateProcessor.finish [collection1] webapp=null path=null params={} {deleteByQuery=*:*} 0 0
[junit4] 2> 620529 T1911 C1114 oasu.DirectUpdateHandler2.commit start commit{,optimize=false,openSearcher=true,waitSearcher=true,expungeDeletes=false,softCommit=false,prepareCommit=false}
[junit4] 2> 620529 T1911 C1114 oasc.SolrDeletionPolicy.onCommit SolrDeletionPolicy.onCommit: commits: num=2
[junit4] 2> commit{dir=RateLimitedDirectoryWrapper(MockDirectoryWrapper(RAMDirectory@4d4deeda lockFactory=org.apache.lucene.store.SingleInstanceLockFactory@eb91c9c2)),segFN=segments_x,generation=33}
[junit4] 2> commit{dir=RateLimitedDirectoryWrapper(MockDirectoryWrapper(RAMDirectory@4d4deeda lockFactory=org.apache.lucene.store.SingleInstanceLockFactory@eb91c9c2)),segFN=segments_y,generation=34}
[junit4] 2> 620530 T1911 C1114 oasc.SolrDeletionPolicy.updateCommits newest commit generation = 34
[junit4] 2> 620530 T1911 C1114 oass.SolrIndexSearcher.<init> Opening Searcher@5591fa73[collection1] main
[junit4] 2> 620531 T1911 C1114 oasu.DirectUpdateHandler2.commit end_commit_flush
[junit4] 2> 620532 T1913 oasc.SolrCore.registerSearcher [collection1] Registered new searcher Searcher@5591fa73[collection1] main{StandardDirectoryReader(segments_y:146:nrt)}
[junit4] 2> 620533 T1911 C1114 oasup.LogUpdateProcessor.finish [collection1] webapp=null path=null params={} {commit=} 0 4
[junit4] 2> 620534 T1911 oas.SolrTestCaseJ4.tearDown ###Ending testFailNonIndexedSigWithOverwriteDupes
[junit4] 2> 620538 T1911 oas.SolrTestCaseJ4.setUp ###Starting testDupeAllFieldsDetection
[junit4] 2> 620538 T1911 C1114 oasu.DirectUpdateHandler2.deleteAll [collection1] REMOVING ALL DOCUMENTS FROM INDEX
[junit4] 2> 620539 T1911 C1114 oasup.LogUpdateProcessor.finish [collection1] webapp=null path=null params={} {deleteByQuery=*:*} 0 1
[junit4] 2> 620540 T1911 C1114 oasu.DirectUpdateHandler2.commit start commit{,optimize=false,openSearcher=true,waitSearcher=true,expungeDeletes=false,softCommit=false,prepareCommit=false}
[junit4] 2> 620541 T1911 C1114 oasc.SolrDeletionPolicy.onCommit SolrDeletionPolicy.onCommit: commits: num=2
[junit4] 2> commit{dir=RateLimitedDirectoryWrapper(MockDirectoryWrapper(RAMDirectory@4d4deeda lockFactory=org.apache.lucene.store.SingleInstanceLockFactory@eb91c9c2)),segFN=segments_y,generation=34}
[junit4] 2> commit{dir=RateLimitedDirectoryWrapper(MockDirectoryWrapper(RAMDirectory@4d4deeda lockFactory=org.apache.lucene.store.SingleInstanceLockFactory@eb91c9c2)),segFN=segments_z,generation=35}
[junit4] 2> 620542 T1911 C1114 oasc.SolrDeletionPolicy.updateCommits newest commit generation = 35
[junit4] 2> 620542 T1911 C1114 oass.SolrIndexSearcher.<init> Opening Searcher@c26beb32[collection1] main
[junit4] 2> 620543 T1911 C1114 oasu.DirectUpdateHandler2.commit end_commit_flush
[junit4] 2> 620544 T1913 oasc.SolrCore.registerSearcher [collection1] Registered new searcher Searcher@c26beb32[collection1] main{StandardDirectoryReader(segments_z:147:nrt)}
[junit4] 2> 620544 T1911 C1114 oasup.LogUpdateProcessor.finish [collection1] webapp=null path=null params={} {commit=} 0 4
[junit4] 2> 620550 T1911 oasu.DirectUpdateHandler2.commit start commit{,optimize=false,openSearcher=true,waitSearcher=true,expungeDeletes=false,softCommit=false,prepareCommit=false}
[junit4] 2> 620551 T1911 oasc.SolrDeletionPolicy.onCommit SolrDeletionPolicy.onCommit: commits: num=2
[junit4] 2> commit{dir=RateLimitedDirectoryWrapper(MockDirectoryWrapper(RAMDirectory@4d4deeda lockFactory=org.apache.lucene.store.SingleInstanceLockFactory@eb91c9c2)),segFN=segments_z,generation=35}
[junit4] 2> commit{dir=RateLimitedDirectoryWrapper(MockDirectoryWrapper(RAMDirectory@4d4deeda lockFactory=org.apache.lucene.store.SingleInstanceLockFactory@eb91c9c2)),segFN=segments_10,generation=36}
[junit4] 2> 620552 T1911 oasc.SolrDeletionPolicy.updateCommits newest commit generation = 36
[junit4] 2> 620553 T1911 oass.SolrIndexSearcher.<init> Opening Searcher@2a831485[collection1] main
[junit4] 2> 620553 T1911 oasu.DirectUpdateHandler2.commit end_commit_flush
[junit4] 2> 620555 T1913 oasc.SolrCore.registerSearcher [collection1] Registered new searcher Searcher@2a831485[collection1] main{StandardDirectoryReader(segments_10:149:nrt _17(4.7):c3)}
[junit4] 2> 620555 T1911 oas.SolrTestCaseJ4.tearDown ###Ending testDupeAllFieldsDetection
[junit4] 2> 620557 T1911 oas.SolrTestCaseJ4.deleteCore ###deleteCore
[junit4] 2> 620557 T1911 oasc.CoreContainer.shutdown Shutting down CoreContainer instance=18798139
[junit4] 2> 620557 T1911 oasc.SolrCore.close [collection1] CLOSING SolrCore org.apache.solr.core.SolrCore@c41398f6
[junit4] 2> 620565 T1911 oasu.DirectUpdateHandler2.close closing DirectUpdateHandler2{commits=42,autocommits=0,soft autocommits=0,optimizes=0,rollbacks=0,expungeDeletes=0,docsPending=0,adds=0,deletesById=0,deletesByQuery=0,errors=0,cumulative_adds=253,cumulative_deletesById=0,cumulative_deletesByQuery=6,cumulative_errors=0}
[junit4] 2> 620565 T1911 oasu.SolrCoreState.decrefSolrCoreState Closing SolrCoreState
[junit4] 2> 620566 T1911 oasu.DefaultSolrCoreState.closeIndexWriter SolrCoreState ref count has reached 0 - closing IndexWriter
[junit4] 2> 620566 T1911 oasu.DefaultSolrCoreState.closeIndexWriter closing IndexWriter with IndexWriterCloser
[junit4] 2> 620566 T1911 oasc.SolrCore.closeSearcher [collection1] Closing main searcher on request.
[junit4] 2> 620567 T1911 oasc.CachingDirectoryFactory.close Closing MockDirectoryFactory - 2 directories currently being tracked
[junit4] 2> 620567 T1911 oasc.CachingDirectoryFactory.closeCacheValue looking to close /mnt/ssd/jenkins/workspace/Lucene-Solr-4.x-Linux/solr/build/solr-core/test/J1/./solrtest-SignatureUpdateProcessorFactoryTest-1392580270368 [CachedDir<<refCount=0;path=/mnt/ssd/jenkins/workspace/Lucene-Solr-4.x-Linux/solr/build/solr-core/test/J1/./solrtest-SignatureUpdateProcessorFactoryTest-1392580270368;done=false>>]
[junit4] 2> 620567 T1911 oasc.CachingDirectoryFactory.close Closing directory: /mnt/ssd/jenkins/workspace/Lucene-Solr-4.x-Linux/solr/build/solr-core/test/J1/./solrtest-SignatureUpdateProcessorFactoryTest-1392580270368
[junit4] 2> 620568 T1911 oasc.CachingDirectoryFactory.closeCacheValue looking to close /mnt/ssd/jenkins/workspace/Lucene-Solr-4.x-Linux/solr/build/solr-core/test/J1/./solrtest-SignatureUpdateProcessorFactoryTest-1392580270368/index [CachedDir<<refCount=0;path=/mnt/ssd/jenkins/workspace/Lucene-Solr-4.x-Linux/solr/build/solr-core/test/J1/./solrtest-SignatureUpdateProcessorFactoryTest-1392580270368/index;done=false>>]
[junit4] 2> 620568 T1911 oasc.CachingDirectoryFactory.close Closing directory: /mnt/ssd/jenkins/workspace/Lucene-Solr-4.x-Linux/solr/build/solr-core/test/J1/./solrtest-SignatureUpdateProcessorFactoryTest-1392580270368/index
[junit4] 2> NOTE: test params are: codec=Asserting, sim=DefaultSimilarity, locale=fi_FI, timezone=America/Cuiaba
[junit4] 2> NOTE: Linux 3.8.0-35-generic amd64/IBM Corporation 1.7.0 (64-bit)/cpus=8,threads=1,free=83417208,total=236847104
[junit4] 2> NOTE: All tests run in this JVM: [TestWordDelimiterFilterFactory, TestRTGBase, DateFieldTest, StandardRequestHandlerTest, TestHashPartitioner, RequestHandlersTest, BJQParserTest, TestCSVLoader, TestRangeQuery, TestLazyCores, TestBlendedInfixSuggestions, TestFuzzyAnalyzedSuggestions, TestClassNameShortening, BadIndexSchemaTest, TestFiltering, CursorMarkTest, NoCacheHeaderTest, DisMaxRequestHandlerTest, SolrCmdDistributorTest, TestMultiCoreConfBootstrap, UniqFieldsUpdateProcessorFactoryTest, TestFieldTypeResource, HighlighterTest, TestDFRSimilarityFactory, TestManagedSchema, TestReload, NumericFieldsTest, SpellingQueryConverterTest, PrimUtilsTest, TestIBSimilarityFactory, TestBinaryField, TestAnalyzedSuggestions, SuggestComponentTest, IndexSchemaRuntimeFieldTest, ChaosMonkeyNothingIsSafeTest, TestSolrJ, CurrencyFieldOpenExchangeTest, BasicDistributedZk2Test, TestNRTOpen, TestDynamicFieldResource, TestSolrCoreProperties, OpenCloseCoreStressTest, TestSolr4Spatial, StatsComponentTest, TestFreeTextSuggestions, AddBlockUpdateTest, ConvertedLegacyTest, XmlUpdateRequestHandlerTest, TestJmxIntegration, TestUpdate, SuggesterTSTTest, TestSimpleQParserPlugin, TestHighlightDedupGrouping, TestFastLRUCache, TestStressReorder, DefaultValueUpdateProcessorTest, RAMDirectoryFactoryTest, TestQuerySenderNoQuery, LeaderElectionIntegrationTest, TestComponentsName, TestRecovery, TestCoreDiscovery, CurrencyFieldXmlFileTest, TestCopyFieldCollectionResource, DeleteReplicaTest, RequiredFieldsTest, CursorPagingTest, SpellCheckCollatorTest, SolrCoreCheckLockOnStartupTest, HardAutoCommitTest, SuggesterWFSTTest, TestFastOutputStream, AssignTest, TestDistributedGrouping, TestFileDictionaryLookup, TestNonDefinedSimilarityFactory, TestCloudManagedSchema, TestPartialUpdateDeduplication, TestPhraseSuggestions, SolrRequestParserTest, IndexBasedSpellCheckerTest, RemoteQueryErrorTest, TestNumberUtils, FullSolrCloudDistribCmdsTest, FieldAnalysisRequestHandlerTest, TestIndexSearcher, TestDocBasedVersionConstraints, TestXIncludeConfig, TestRandomFaceting, ZkCLITest, DistributedTermsComponentTest, TestCoreContainer, SolrCoreTest, SpellCheckComponentTest, DirectUpdateHandlerTest, ShowFileRequestHandlerTest, DistributedQueryElevationComponentTest, SolrIndexSplitterTest, SimplePostToolTest, SignatureUpdateProcessorFactoryTest]
[junit4] Completed on J1 in 1.53s, 6 tests, 1 failure <<< FAILURES!
[...truncated 459 lines...]
BUILD FAILED
/mnt/ssd/jenkins/workspace/Lucene-Solr-4.x-Linux/build.xml:459: The following error occurred while executing this line:
/mnt/ssd/jenkins/workspace/Lucene-Solr-4.x-Linux/build.xml:452: The following error occurred while executing this line:
/mnt/ssd/jenkins/workspace/Lucene-Solr-4.x-Linux/build.xml:39: The following error occurred while executing this line:
/mnt/ssd/jenkins/workspace/Lucene-Solr-4.x-Linux/extra-targets.xml:37: The following error occurred while executing this line:
/mnt/ssd/jenkins/workspace/Lucene-Solr-4.x-Linux/solr/build.xml:189: The following error occurred while executing this line:
/mnt/ssd/jenkins/workspace/Lucene-Solr-4.x-Linux/solr/common-build.xml:491: The following error occurred while executing this line:
/mnt/ssd/jenkins/workspace/Lucene-Solr-4.x-Linux/lucene/common-build.xml:1308: The following error occurred while executing this line:
/mnt/ssd/jenkins/workspace/Lucene-Solr-4.x-Linux/lucene/common-build.xml:941: There were test failures: 362 suites, 1563 tests, 1 failure, 71 ignored (7 assumptions)
Total time: 41 minutes 17 seconds
Build step 'Invoke Ant' marked build as failure
Description set: Java: 64bit/ibm-j9-jdk7 -Xjit:exclude={org/apache/lucene/util/fst/FST.pack(IIF)Lorg/apache/lucene/util/fst/FST;}
Archiving artifacts
Recording test results
Email was triggered for: Failure
Sending email for trigger: Failure
[JENKINS] Lucene-Solr-4.x-Linux (64bit/jdk1.8.0-fcs-b129) - Build #
9392 - Still Failing!
Posted by Policeman Jenkins Server <je...@thetaphi.de>.
Build: http://jenkins.thetaphi.de/job/Lucene-Solr-4.x-Linux/9392/
Java: 64bit/jdk1.8.0-fcs-b129 -XX:-UseCompressedOops -XX:+UseG1GC
5 tests failed.
FAILED: org.apache.solr.cloud.DistribCursorPagingTest.testDistribSearch
Error Message:
No live SolrServers available to handle this request:[http://127.0.0.1:46270/collection1, http://127.0.0.1:54420/collection1]
Stack Trace:
org.apache.solr.client.solrj.SolrServerException: No live SolrServers available to handle this request:[http://127.0.0.1:46270/collection1, http://127.0.0.1:54420/collection1]
at __randomizedtesting.SeedInfo.seed([B8AAAD58FF4DF506:394C23408812953A]:0)
at org.apache.solr.client.solrj.impl.LBHttpSolrServer.request(LBHttpSolrServer.java:362)
at org.apache.solr.client.solrj.impl.CloudSolrServer.request(CloudSolrServer.java:635)
at org.apache.solr.client.solrj.request.QueryRequest.process(QueryRequest.java:90)
at org.apache.solr.client.solrj.SolrServer.query(SolrServer.java:301)
at org.apache.solr.cloud.AbstractFullDistribZkTestBase.queryServer(AbstractFullDistribZkTestBase.java:1356)
at org.apache.solr.BaseDistributedSearchTestCase.query(BaseDistributedSearchTestCase.java:563)
at org.apache.solr.BaseDistributedSearchTestCase.query(BaseDistributedSearchTestCase.java:532)
at org.apache.solr.cloud.DistribCursorPagingTest.doSimpleTest(DistribCursorPagingTest.java:257)
at org.apache.solr.cloud.DistribCursorPagingTest.doTest(DistribCursorPagingTest.java:89)
at org.apache.solr.BaseDistributedSearchTestCase.testDistribSearch(BaseDistributedSearchTestCase.java:870)
at sun.reflect.NativeMethodAccessorImpl.invoke0(Native Method)
at sun.reflect.NativeMethodAccessorImpl.invoke(NativeMethodAccessorImpl.java:62)
at sun.reflect.DelegatingMethodAccessorImpl.invoke(DelegatingMethodAccessorImpl.java:43)
at java.lang.reflect.Method.invoke(Method.java:483)
at com.carrotsearch.randomizedtesting.RandomizedRunner.invoke(RandomizedRunner.java:1559)
at com.carrotsearch.randomizedtesting.RandomizedRunner.access$600(RandomizedRunner.java:79)
at com.carrotsearch.randomizedtesting.RandomizedRunner$6.evaluate(RandomizedRunner.java:737)
at com.carrotsearch.randomizedtesting.RandomizedRunner$7.evaluate(RandomizedRunner.java:773)
at com.carrotsearch.randomizedtesting.RandomizedRunner$8.evaluate(RandomizedRunner.java:787)
at com.carrotsearch.randomizedtesting.rules.SystemPropertiesRestoreRule$1.evaluate(SystemPropertiesRestoreRule.java:53)
at org.apache.lucene.util.TestRuleSetupTeardownChained$1.evaluate(TestRuleSetupTeardownChained.java:50)
at org.apache.lucene.util.TestRuleFieldCacheSanity$1.evaluate(TestRuleFieldCacheSanity.java:51)
at org.apache.lucene.util.AbstractBeforeAfterRule$1.evaluate(AbstractBeforeAfterRule.java:46)
at com.carrotsearch.randomizedtesting.rules.SystemPropertiesInvariantRule$1.evaluate(SystemPropertiesInvariantRule.java:55)
at org.apache.lucene.util.TestRuleThreadAndTestName$1.evaluate(TestRuleThreadAndTestName.java:49)
at org.apache.lucene.util.TestRuleIgnoreAfterMaxFailures$1.evaluate(TestRuleIgnoreAfterMaxFailures.java:70)
at org.apache.lucene.util.TestRuleMarkFailure$1.evaluate(TestRuleMarkFailure.java:48)
at com.carrotsearch.randomizedtesting.rules.StatementAdapter.evaluate(StatementAdapter.java:36)
at com.carrotsearch.randomizedtesting.ThreadLeakControl$StatementRunner.run(ThreadLeakControl.java:358)
at com.carrotsearch.randomizedtesting.ThreadLeakControl.forkTimeoutingTask(ThreadLeakControl.java:782)
at com.carrotsearch.randomizedtesting.ThreadLeakControl$3.evaluate(ThreadLeakControl.java:442)
at com.carrotsearch.randomizedtesting.RandomizedRunner.runSingleTest(RandomizedRunner.java:746)
at com.carrotsearch.randomizedtesting.RandomizedRunner$3.evaluate(RandomizedRunner.java:648)
at com.carrotsearch.randomizedtesting.RandomizedRunner$4.evaluate(RandomizedRunner.java:682)
at com.carrotsearch.randomizedtesting.RandomizedRunner$5.evaluate(RandomizedRunner.java:693)
at com.carrotsearch.randomizedtesting.rules.StatementAdapter.evaluate(StatementAdapter.java:36)
at com.carrotsearch.randomizedtesting.rules.SystemPropertiesRestoreRule$1.evaluate(SystemPropertiesRestoreRule.java:53)
at org.apache.lucene.util.AbstractBeforeAfterRule$1.evaluate(AbstractBeforeAfterRule.java:46)
at org.apache.lucene.util.TestRuleStoreClassName$1.evaluate(TestRuleStoreClassName.java:42)
at com.carrotsearch.randomizedtesting.rules.SystemPropertiesInvariantRule$1.evaluate(SystemPropertiesInvariantRule.java:55)
at com.carrotsearch.randomizedtesting.rules.NoShadowingOrOverridesOnMethodsRule$1.evaluate(NoShadowingOrOverridesOnMethodsRule.java:39)
at com.carrotsearch.randomizedtesting.rules.NoShadowingOrOverridesOnMethodsRule$1.evaluate(NoShadowingOrOverridesOnMethodsRule.java:39)
at com.carrotsearch.randomizedtesting.rules.StatementAdapter.evaluate(StatementAdapter.java:36)
at org.apache.lucene.util.TestRuleAssertionsRequired$1.evaluate(TestRuleAssertionsRequired.java:43)
at org.apache.lucene.util.TestRuleMarkFailure$1.evaluate(TestRuleMarkFailure.java:48)
at org.apache.lucene.util.TestRuleIgnoreAfterMaxFailures$1.evaluate(TestRuleIgnoreAfterMaxFailures.java:70)
at org.apache.lucene.util.TestRuleIgnoreTestSuites$1.evaluate(TestRuleIgnoreTestSuites.java:55)
at com.carrotsearch.randomizedtesting.rules.StatementAdapter.evaluate(StatementAdapter.java:36)
at com.carrotsearch.randomizedtesting.ThreadLeakControl$StatementRunner.run(ThreadLeakControl.java:358)
at java.lang.Thread.run(Thread.java:744)
Caused by: org.apache.solr.client.solrj.impl.HttpSolrServer$RemoteSolrException: Expected mime type application/octet-stream but got text/html. <html>
<head>
<meta http-equiv="Content-Type" content="text/html;charset=ISO-8859-1"/>
<title>Error 500 Server Error</title>
</head>
<body>
<h2>HTTP ERROR: 500</h2>
<p>Problem accessing /collection1/select. Reason:
<pre> Server Error</pre></p>
<hr /><i><small>Powered by Jetty://</small></i>
</body>
</html>
at org.apache.solr.client.solrj.impl.HttpSolrServer.request(HttpSolrServer.java:459)
at org.apache.solr.client.solrj.impl.HttpSolrServer.request(HttpSolrServer.java:199)
at org.apache.solr.client.solrj.impl.LBHttpSolrServer.request(LBHttpSolrServer.java:293)
... 49 more
FAILED: org.apache.solr.TestDistributedGrouping.testDistribSearch
Error Message:
Expected mime type application/octet-stream but got text/html. <html> <head> <meta http-equiv="Content-Type" content="text/html;charset=ISO-8859-1"/> <title>Error 500 Server Error</title> </head> <body> <h2>HTTP ERROR: 500</h2> <p>Problem accessing /select. Reason: <pre> Server Error</pre></p> <hr /><i><small>Powered by Jetty://</small></i> </body> </html>
Stack Trace:
org.apache.solr.client.solrj.impl.HttpSolrServer$RemoteSolrException: Expected mime type application/octet-stream but got text/html. <html>
<head>
<meta http-equiv="Content-Type" content="text/html;charset=ISO-8859-1"/>
<title>Error 500 Server Error</title>
</head>
<body>
<h2>HTTP ERROR: 500</h2>
<p>Problem accessing /select. Reason:
<pre> Server Error</pre></p>
<hr /><i><small>Powered by Jetty://</small></i>
</body>
</html>
at __randomizedtesting.SeedInfo.seed([B8AAAD58FF4DF506:394C23408812953A]:0)
at org.apache.solr.client.solrj.impl.HttpSolrServer.request(HttpSolrServer.java:459)
at org.apache.solr.client.solrj.impl.HttpSolrServer.request(HttpSolrServer.java:199)
at org.apache.solr.client.solrj.request.QueryRequest.process(QueryRequest.java:90)
at org.apache.solr.client.solrj.SolrServer.query(SolrServer.java:301)
at org.apache.solr.BaseDistributedSearchTestCase.queryServer(BaseDistributedSearchTestCase.java:515)
at org.apache.solr.BaseDistributedSearchTestCase.query(BaseDistributedSearchTestCase.java:563)
at org.apache.solr.BaseDistributedSearchTestCase.query(BaseDistributedSearchTestCase.java:545)
at org.apache.solr.BaseDistributedSearchTestCase.query(BaseDistributedSearchTestCase.java:524)
at org.apache.solr.TestDistributedGrouping.doTest(TestDistributedGrouping.java:156)
at org.apache.solr.BaseDistributedSearchTestCase.testDistribSearch(BaseDistributedSearchTestCase.java:876)
at sun.reflect.NativeMethodAccessorImpl.invoke0(Native Method)
at sun.reflect.NativeMethodAccessorImpl.invoke(NativeMethodAccessorImpl.java:62)
at sun.reflect.DelegatingMethodAccessorImpl.invoke(DelegatingMethodAccessorImpl.java:43)
at java.lang.reflect.Method.invoke(Method.java:483)
at com.carrotsearch.randomizedtesting.RandomizedRunner.invoke(RandomizedRunner.java:1559)
at com.carrotsearch.randomizedtesting.RandomizedRunner.access$600(RandomizedRunner.java:79)
at com.carrotsearch.randomizedtesting.RandomizedRunner$6.evaluate(RandomizedRunner.java:737)
at com.carrotsearch.randomizedtesting.RandomizedRunner$7.evaluate(RandomizedRunner.java:773)
at com.carrotsearch.randomizedtesting.RandomizedRunner$8.evaluate(RandomizedRunner.java:787)
at com.carrotsearch.randomizedtesting.rules.SystemPropertiesRestoreRule$1.evaluate(SystemPropertiesRestoreRule.java:53)
at org.apache.lucene.util.TestRuleSetupTeardownChained$1.evaluate(TestRuleSetupTeardownChained.java:50)
at org.apache.lucene.util.TestRuleFieldCacheSanity$1.evaluate(TestRuleFieldCacheSanity.java:51)
at org.apache.lucene.util.AbstractBeforeAfterRule$1.evaluate(AbstractBeforeAfterRule.java:46)
at com.carrotsearch.randomizedtesting.rules.SystemPropertiesInvariantRule$1.evaluate(SystemPropertiesInvariantRule.java:55)
at org.apache.lucene.util.TestRuleThreadAndTestName$1.evaluate(TestRuleThreadAndTestName.java:49)
at org.apache.lucene.util.TestRuleIgnoreAfterMaxFailures$1.evaluate(TestRuleIgnoreAfterMaxFailures.java:70)
at org.apache.lucene.util.TestRuleMarkFailure$1.evaluate(TestRuleMarkFailure.java:48)
at com.carrotsearch.randomizedtesting.rules.StatementAdapter.evaluate(StatementAdapter.java:36)
at com.carrotsearch.randomizedtesting.ThreadLeakControl$StatementRunner.run(ThreadLeakControl.java:358)
at com.carrotsearch.randomizedtesting.ThreadLeakControl.forkTimeoutingTask(ThreadLeakControl.java:782)
at com.carrotsearch.randomizedtesting.ThreadLeakControl$3.evaluate(ThreadLeakControl.java:442)
at com.carrotsearch.randomizedtesting.RandomizedRunner.runSingleTest(RandomizedRunner.java:746)
at com.carrotsearch.randomizedtesting.RandomizedRunner$3.evaluate(RandomizedRunner.java:648)
at com.carrotsearch.randomizedtesting.RandomizedRunner$4.evaluate(RandomizedRunner.java:682)
at com.carrotsearch.randomizedtesting.RandomizedRunner$5.evaluate(RandomizedRunner.java:693)
at com.carrotsearch.randomizedtesting.rules.StatementAdapter.evaluate(StatementAdapter.java:36)
at com.carrotsearch.randomizedtesting.rules.SystemPropertiesRestoreRule$1.evaluate(SystemPropertiesRestoreRule.java:53)
at org.apache.lucene.util.AbstractBeforeAfterRule$1.evaluate(AbstractBeforeAfterRule.java:46)
at org.apache.lucene.util.TestRuleStoreClassName$1.evaluate(TestRuleStoreClassName.java:42)
at com.carrotsearch.randomizedtesting.rules.SystemPropertiesInvariantRule$1.evaluate(SystemPropertiesInvariantRule.java:55)
at com.carrotsearch.randomizedtesting.rules.NoShadowingOrOverridesOnMethodsRule$1.evaluate(NoShadowingOrOverridesOnMethodsRule.java:39)
at com.carrotsearch.randomizedtesting.rules.NoShadowingOrOverridesOnMethodsRule$1.evaluate(NoShadowingOrOverridesOnMethodsRule.java:39)
at com.carrotsearch.randomizedtesting.rules.StatementAdapter.evaluate(StatementAdapter.java:36)
at org.apache.lucene.util.TestRuleAssertionsRequired$1.evaluate(TestRuleAssertionsRequired.java:43)
at org.apache.lucene.util.TestRuleMarkFailure$1.evaluate(TestRuleMarkFailure.java:48)
at org.apache.lucene.util.TestRuleIgnoreAfterMaxFailures$1.evaluate(TestRuleIgnoreAfterMaxFailures.java:70)
at org.apache.lucene.util.TestRuleIgnoreTestSuites$1.evaluate(TestRuleIgnoreTestSuites.java:55)
at com.carrotsearch.randomizedtesting.rules.StatementAdapter.evaluate(StatementAdapter.java:36)
at com.carrotsearch.randomizedtesting.ThreadLeakControl$StatementRunner.run(ThreadLeakControl.java:358)
at java.lang.Thread.run(Thread.java:744)
FAILED: org.apache.solr.TestDistributedSearch.testDistribSearch
Error Message:
Expected mime type application/octet-stream but got text/html. <html> <head> <meta http-equiv="Content-Type" content="text/html;charset=ISO-8859-1"/> <title>Error 500 Server Error</title> </head> <body> <h2>HTTP ERROR: 500</h2> <p>Problem accessing /phjqd/select. Reason: <pre> Server Error</pre></p> <hr /><i><small>Powered by Jetty://</small></i> </body> </html>
Stack Trace:
org.apache.solr.client.solrj.impl.HttpSolrServer$RemoteSolrException: Expected mime type application/octet-stream but got text/html. <html>
<head>
<meta http-equiv="Content-Type" content="text/html;charset=ISO-8859-1"/>
<title>Error 500 Server Error</title>
</head>
<body>
<h2>HTTP ERROR: 500</h2>
<p>Problem accessing /phjqd/select. Reason:
<pre> Server Error</pre></p>
<hr /><i><small>Powered by Jetty://</small></i>
</body>
</html>
at __randomizedtesting.SeedInfo.seed([B8AAAD58FF4DF506:394C23408812953A]:0)
at org.apache.solr.client.solrj.impl.HttpSolrServer.request(HttpSolrServer.java:459)
at org.apache.solr.client.solrj.impl.HttpSolrServer.request(HttpSolrServer.java:199)
at org.apache.solr.client.solrj.request.QueryRequest.process(QueryRequest.java:90)
at org.apache.solr.client.solrj.SolrServer.query(SolrServer.java:301)
at org.apache.solr.BaseDistributedSearchTestCase.queryServer(BaseDistributedSearchTestCase.java:515)
at org.apache.solr.BaseDistributedSearchTestCase.query(BaseDistributedSearchTestCase.java:563)
at org.apache.solr.BaseDistributedSearchTestCase.query(BaseDistributedSearchTestCase.java:545)
at org.apache.solr.BaseDistributedSearchTestCase.query(BaseDistributedSearchTestCase.java:524)
at org.apache.solr.TestDistributedSearch.doTest(TestDistributedSearch.java:177)
at org.apache.solr.BaseDistributedSearchTestCase.testDistribSearch(BaseDistributedSearchTestCase.java:876)
at sun.reflect.NativeMethodAccessorImpl.invoke0(Native Method)
at sun.reflect.NativeMethodAccessorImpl.invoke(NativeMethodAccessorImpl.java:62)
at sun.reflect.DelegatingMethodAccessorImpl.invoke(DelegatingMethodAccessorImpl.java:43)
at java.lang.reflect.Method.invoke(Method.java:483)
at com.carrotsearch.randomizedtesting.RandomizedRunner.invoke(RandomizedRunner.java:1559)
at com.carrotsearch.randomizedtesting.RandomizedRunner.access$600(RandomizedRunner.java:79)
at com.carrotsearch.randomizedtesting.RandomizedRunner$6.evaluate(RandomizedRunner.java:737)
at com.carrotsearch.randomizedtesting.RandomizedRunner$7.evaluate(RandomizedRunner.java:773)
at com.carrotsearch.randomizedtesting.RandomizedRunner$8.evaluate(RandomizedRunner.java:787)
at com.carrotsearch.randomizedtesting.rules.SystemPropertiesRestoreRule$1.evaluate(SystemPropertiesRestoreRule.java:53)
at org.apache.lucene.util.TestRuleSetupTeardownChained$1.evaluate(TestRuleSetupTeardownChained.java:50)
at org.apache.lucene.util.TestRuleFieldCacheSanity$1.evaluate(TestRuleFieldCacheSanity.java:51)
at org.apache.lucene.util.AbstractBeforeAfterRule$1.evaluate(AbstractBeforeAfterRule.java:46)
at com.carrotsearch.randomizedtesting.rules.SystemPropertiesInvariantRule$1.evaluate(SystemPropertiesInvariantRule.java:55)
at org.apache.lucene.util.TestRuleThreadAndTestName$1.evaluate(TestRuleThreadAndTestName.java:49)
at org.apache.lucene.util.TestRuleIgnoreAfterMaxFailures$1.evaluate(TestRuleIgnoreAfterMaxFailures.java:70)
at org.apache.lucene.util.TestRuleMarkFailure$1.evaluate(TestRuleMarkFailure.java:48)
at com.carrotsearch.randomizedtesting.rules.StatementAdapter.evaluate(StatementAdapter.java:36)
at com.carrotsearch.randomizedtesting.ThreadLeakControl$StatementRunner.run(ThreadLeakControl.java:358)
at com.carrotsearch.randomizedtesting.ThreadLeakControl.forkTimeoutingTask(ThreadLeakControl.java:782)
at com.carrotsearch.randomizedtesting.ThreadLeakControl$3.evaluate(ThreadLeakControl.java:442)
at com.carrotsearch.randomizedtesting.RandomizedRunner.runSingleTest(RandomizedRunner.java:746)
at com.carrotsearch.randomizedtesting.RandomizedRunner$3.evaluate(RandomizedRunner.java:648)
at com.carrotsearch.randomizedtesting.RandomizedRunner$4.evaluate(RandomizedRunner.java:682)
at com.carrotsearch.randomizedtesting.RandomizedRunner$5.evaluate(RandomizedRunner.java:693)
at com.carrotsearch.randomizedtesting.rules.StatementAdapter.evaluate(StatementAdapter.java:36)
at com.carrotsearch.randomizedtesting.rules.SystemPropertiesRestoreRule$1.evaluate(SystemPropertiesRestoreRule.java:53)
at org.apache.lucene.util.AbstractBeforeAfterRule$1.evaluate(AbstractBeforeAfterRule.java:46)
at org.apache.lucene.util.TestRuleStoreClassName$1.evaluate(TestRuleStoreClassName.java:42)
at com.carrotsearch.randomizedtesting.rules.SystemPropertiesInvariantRule$1.evaluate(SystemPropertiesInvariantRule.java:55)
at com.carrotsearch.randomizedtesting.rules.NoShadowingOrOverridesOnMethodsRule$1.evaluate(NoShadowingOrOverridesOnMethodsRule.java:39)
at com.carrotsearch.randomizedtesting.rules.NoShadowingOrOverridesOnMethodsRule$1.evaluate(NoShadowingOrOverridesOnMethodsRule.java:39)
at com.carrotsearch.randomizedtesting.rules.StatementAdapter.evaluate(StatementAdapter.java:36)
at org.apache.lucene.util.TestRuleAssertionsRequired$1.evaluate(TestRuleAssertionsRequired.java:43)
at org.apache.lucene.util.TestRuleMarkFailure$1.evaluate(TestRuleMarkFailure.java:48)
at org.apache.lucene.util.TestRuleIgnoreAfterMaxFailures$1.evaluate(TestRuleIgnoreAfterMaxFailures.java:70)
at org.apache.lucene.util.TestRuleIgnoreTestSuites$1.evaluate(TestRuleIgnoreTestSuites.java:55)
at com.carrotsearch.randomizedtesting.rules.StatementAdapter.evaluate(StatementAdapter.java:36)
at com.carrotsearch.randomizedtesting.ThreadLeakControl$StatementRunner.run(ThreadLeakControl.java:358)
at java.lang.Thread.run(Thread.java:744)
FAILED: org.apache.solr.cloud.BasicDistributedZk2Test.testDistribSearch
Error Message:
No live SolrServers available to handle this request:[https://127.0.0.1:59585/b/collection1, https://127.0.0.1:36116/b/collection1, https://127.0.0.1:33794/b/collection1, https://127.0.0.1:41327/b/collection1]
Stack Trace:
org.apache.solr.client.solrj.SolrServerException: No live SolrServers available to handle this request:[https://127.0.0.1:59585/b/collection1, https://127.0.0.1:36116/b/collection1, https://127.0.0.1:33794/b/collection1, https://127.0.0.1:41327/b/collection1]
at __randomizedtesting.SeedInfo.seed([B8AAAD58FF4DF506:394C23408812953A]:0)
at org.apache.solr.client.solrj.impl.LBHttpSolrServer.request(LBHttpSolrServer.java:362)
at org.apache.solr.client.solrj.impl.CloudSolrServer.request(CloudSolrServer.java:635)
at org.apache.solr.client.solrj.request.QueryRequest.process(QueryRequest.java:90)
at org.apache.solr.client.solrj.SolrServer.query(SolrServer.java:301)
at org.apache.solr.cloud.AbstractFullDistribZkTestBase.queryServer(AbstractFullDistribZkTestBase.java:1356)
at org.apache.solr.BaseDistributedSearchTestCase.query(BaseDistributedSearchTestCase.java:563)
at org.apache.solr.BaseDistributedSearchTestCase.query(BaseDistributedSearchTestCase.java:545)
at org.apache.solr.BaseDistributedSearchTestCase.query(BaseDistributedSearchTestCase.java:524)
at org.apache.solr.cloud.AbstractFullDistribZkTestBase.checkQueries(AbstractFullDistribZkTestBase.java:797)
at org.apache.solr.cloud.BasicDistributedZk2Test.doTest(BasicDistributedZk2Test.java:101)
at org.apache.solr.BaseDistributedSearchTestCase.testDistribSearch(BaseDistributedSearchTestCase.java:870)
at sun.reflect.NativeMethodAccessorImpl.invoke0(Native Method)
at sun.reflect.NativeMethodAccessorImpl.invoke(NativeMethodAccessorImpl.java:62)
at sun.reflect.DelegatingMethodAccessorImpl.invoke(DelegatingMethodAccessorImpl.java:43)
at java.lang.reflect.Method.invoke(Method.java:483)
at com.carrotsearch.randomizedtesting.RandomizedRunner.invoke(RandomizedRunner.java:1559)
at com.carrotsearch.randomizedtesting.RandomizedRunner.access$600(RandomizedRunner.java:79)
at com.carrotsearch.randomizedtesting.RandomizedRunner$6.evaluate(RandomizedRunner.java:737)
at com.carrotsearch.randomizedtesting.RandomizedRunner$7.evaluate(RandomizedRunner.java:773)
at com.carrotsearch.randomizedtesting.RandomizedRunner$8.evaluate(RandomizedRunner.java:787)
at com.carrotsearch.randomizedtesting.rules.SystemPropertiesRestoreRule$1.evaluate(SystemPropertiesRestoreRule.java:53)
at org.apache.lucene.util.TestRuleSetupTeardownChained$1.evaluate(TestRuleSetupTeardownChained.java:50)
at org.apache.lucene.util.TestRuleFieldCacheSanity$1.evaluate(TestRuleFieldCacheSanity.java:51)
at org.apache.lucene.util.AbstractBeforeAfterRule$1.evaluate(AbstractBeforeAfterRule.java:46)
at com.carrotsearch.randomizedtesting.rules.SystemPropertiesInvariantRule$1.evaluate(SystemPropertiesInvariantRule.java:55)
at org.apache.lucene.util.TestRuleThreadAndTestName$1.evaluate(TestRuleThreadAndTestName.java:49)
at org.apache.lucene.util.TestRuleIgnoreAfterMaxFailures$1.evaluate(TestRuleIgnoreAfterMaxFailures.java:70)
at org.apache.lucene.util.TestRuleMarkFailure$1.evaluate(TestRuleMarkFailure.java:48)
at com.carrotsearch.randomizedtesting.rules.StatementAdapter.evaluate(StatementAdapter.java:36)
at com.carrotsearch.randomizedtesting.ThreadLeakControl$StatementRunner.run(ThreadLeakControl.java:358)
at com.carrotsearch.randomizedtesting.ThreadLeakControl.forkTimeoutingTask(ThreadLeakControl.java:782)
at com.carrotsearch.randomizedtesting.ThreadLeakControl$3.evaluate(ThreadLeakControl.java:442)
at com.carrotsearch.randomizedtesting.RandomizedRunner.runSingleTest(RandomizedRunner.java:746)
at com.carrotsearch.randomizedtesting.RandomizedRunner$3.evaluate(RandomizedRunner.java:648)
at com.carrotsearch.randomizedtesting.RandomizedRunner$4.evaluate(RandomizedRunner.java:682)
at com.carrotsearch.randomizedtesting.RandomizedRunner$5.evaluate(RandomizedRunner.java:693)
at com.carrotsearch.randomizedtesting.rules.StatementAdapter.evaluate(StatementAdapter.java:36)
at com.carrotsearch.randomizedtesting.rules.SystemPropertiesRestoreRule$1.evaluate(SystemPropertiesRestoreRule.java:53)
at org.apache.lucene.util.AbstractBeforeAfterRule$1.evaluate(AbstractBeforeAfterRule.java:46)
at org.apache.lucene.util.TestRuleStoreClassName$1.evaluate(TestRuleStoreClassName.java:42)
at com.carrotsearch.randomizedtesting.rules.SystemPropertiesInvariantRule$1.evaluate(SystemPropertiesInvariantRule.java:55)
at com.carrotsearch.randomizedtesting.rules.NoShadowingOrOverridesOnMethodsRule$1.evaluate(NoShadowingOrOverridesOnMethodsRule.java:39)
at com.carrotsearch.randomizedtesting.rules.NoShadowingOrOverridesOnMethodsRule$1.evaluate(NoShadowingOrOverridesOnMethodsRule.java:39)
at com.carrotsearch.randomizedtesting.rules.StatementAdapter.evaluate(StatementAdapter.java:36)
at org.apache.lucene.util.TestRuleAssertionsRequired$1.evaluate(TestRuleAssertionsRequired.java:43)
at org.apache.lucene.util.TestRuleMarkFailure$1.evaluate(TestRuleMarkFailure.java:48)
at org.apache.lucene.util.TestRuleIgnoreAfterMaxFailures$1.evaluate(TestRuleIgnoreAfterMaxFailures.java:70)
at org.apache.lucene.util.TestRuleIgnoreTestSuites$1.evaluate(TestRuleIgnoreTestSuites.java:55)
at com.carrotsearch.randomizedtesting.rules.StatementAdapter.evaluate(StatementAdapter.java:36)
at com.carrotsearch.randomizedtesting.ThreadLeakControl$StatementRunner.run(ThreadLeakControl.java:358)
at java.lang.Thread.run(Thread.java:744)
Caused by: org.apache.solr.client.solrj.impl.HttpSolrServer$RemoteSolrException: Expected mime type application/octet-stream but got text/html. <html>
<head>
<meta http-equiv="Content-Type" content="text/html;charset=ISO-8859-1"/>
<title>Error 500 Server Error</title>
</head>
<body>
<h2>HTTP ERROR: 500</h2>
<p>Problem accessing /b/collection1/select. Reason:
<pre> Server Error</pre></p>
<hr /><i><small>Powered by Jetty://</small></i>
</body>
</html>
at org.apache.solr.client.solrj.impl.HttpSolrServer.request(HttpSolrServer.java:459)
at org.apache.solr.client.solrj.impl.HttpSolrServer.request(HttpSolrServer.java:199)
at org.apache.solr.client.solrj.impl.LBHttpSolrServer.request(LBHttpSolrServer.java:293)
... 50 more
FAILED: org.apache.solr.cloud.BasicDistributedZkTest.testDistribSearch
Error Message:
No live SolrServers available to handle this request:[https://127.0.0.1:58846/collection1, https://127.0.0.1:42790/collection1, https://127.0.0.1:42030/collection1, https://127.0.0.1:59292/collection1]
Stack Trace:
org.apache.solr.client.solrj.SolrServerException: No live SolrServers available to handle this request:[https://127.0.0.1:58846/collection1, https://127.0.0.1:42790/collection1, https://127.0.0.1:42030/collection1, https://127.0.0.1:59292/collection1]
at __randomizedtesting.SeedInfo.seed([B8AAAD58FF4DF506:394C23408812953A]:0)
at org.apache.solr.client.solrj.impl.LBHttpSolrServer.request(LBHttpSolrServer.java:362)
at org.apache.solr.client.solrj.impl.CloudSolrServer.request(CloudSolrServer.java:635)
at org.apache.solr.client.solrj.request.QueryRequest.process(QueryRequest.java:90)
at org.apache.solr.client.solrj.SolrServer.query(SolrServer.java:301)
at org.apache.solr.cloud.AbstractFullDistribZkTestBase.queryServer(AbstractFullDistribZkTestBase.java:1356)
at org.apache.solr.cloud.BasicDistributedZkTest.queryServer(BasicDistributedZkTest.java:1171)
at org.apache.solr.BaseDistributedSearchTestCase.query(BaseDistributedSearchTestCase.java:563)
at org.apache.solr.BaseDistributedSearchTestCase.query(BaseDistributedSearchTestCase.java:545)
at org.apache.solr.cloud.BasicDistributedZkTest.doTest(BasicDistributedZkTest.java:264)
at org.apache.solr.BaseDistributedSearchTestCase.testDistribSearch(BaseDistributedSearchTestCase.java:870)
at sun.reflect.NativeMethodAccessorImpl.invoke0(Native Method)
at sun.reflect.NativeMethodAccessorImpl.invoke(NativeMethodAccessorImpl.java:62)
at sun.reflect.DelegatingMethodAccessorImpl.invoke(DelegatingMethodAccessorImpl.java:43)
at java.lang.reflect.Method.invoke(Method.java:483)
at com.carrotsearch.randomizedtesting.RandomizedRunner.invoke(RandomizedRunner.java:1559)
at com.carrotsearch.randomizedtesting.RandomizedRunner.access$600(RandomizedRunner.java:79)
at com.carrotsearch.randomizedtesting.RandomizedRunner$6.evaluate(RandomizedRunner.java:737)
at com.carrotsearch.randomizedtesting.RandomizedRunner$7.evaluate(RandomizedRunner.java:773)
at com.carrotsearch.randomizedtesting.RandomizedRunner$8.evaluate(RandomizedRunner.java:787)
at com.carrotsearch.randomizedtesting.rules.SystemPropertiesRestoreRule$1.evaluate(SystemPropertiesRestoreRule.java:53)
at org.apache.lucene.util.TestRuleSetupTeardownChained$1.evaluate(TestRuleSetupTeardownChained.java:50)
at org.apache.lucene.util.TestRuleFieldCacheSanity$1.evaluate(TestRuleFieldCacheSanity.java:51)
at org.apache.lucene.util.AbstractBeforeAfterRule$1.evaluate(AbstractBeforeAfterRule.java:46)
at com.carrotsearch.randomizedtesting.rules.SystemPropertiesInvariantRule$1.evaluate(SystemPropertiesInvariantRule.java:55)
at org.apache.lucene.util.TestRuleThreadAndTestName$1.evaluate(TestRuleThreadAndTestName.java:49)
at org.apache.lucene.util.TestRuleIgnoreAfterMaxFailures$1.evaluate(TestRuleIgnoreAfterMaxFailures.java:70)
at org.apache.lucene.util.TestRuleMarkFailure$1.evaluate(TestRuleMarkFailure.java:48)
at com.carrotsearch.randomizedtesting.rules.StatementAdapter.evaluate(StatementAdapter.java:36)
at com.carrotsearch.randomizedtesting.ThreadLeakControl$StatementRunner.run(ThreadLeakControl.java:358)
at com.carrotsearch.randomizedtesting.ThreadLeakControl.forkTimeoutingTask(ThreadLeakControl.java:782)
at com.carrotsearch.randomizedtesting.ThreadLeakControl$3.evaluate(ThreadLeakControl.java:442)
at com.carrotsearch.randomizedtesting.RandomizedRunner.runSingleTest(RandomizedRunner.java:746)
at com.carrotsearch.randomizedtesting.RandomizedRunner$3.evaluate(RandomizedRunner.java:648)
at com.carrotsearch.randomizedtesting.RandomizedRunner$4.evaluate(RandomizedRunner.java:682)
at com.carrotsearch.randomizedtesting.RandomizedRunner$5.evaluate(RandomizedRunner.java:693)
at com.carrotsearch.randomizedtesting.rules.StatementAdapter.evaluate(StatementAdapter.java:36)
at com.carrotsearch.randomizedtesting.rules.SystemPropertiesRestoreRule$1.evaluate(SystemPropertiesRestoreRule.java:53)
at org.apache.lucene.util.AbstractBeforeAfterRule$1.evaluate(AbstractBeforeAfterRule.java:46)
at org.apache.lucene.util.TestRuleStoreClassName$1.evaluate(TestRuleStoreClassName.java:42)
at com.carrotsearch.randomizedtesting.rules.SystemPropertiesInvariantRule$1.evaluate(SystemPropertiesInvariantRule.java:55)
at com.carrotsearch.randomizedtesting.rules.NoShadowingOrOverridesOnMethodsRule$1.evaluate(NoShadowingOrOverridesOnMethodsRule.java:39)
at com.carrotsearch.randomizedtesting.rules.NoShadowingOrOverridesOnMethodsRule$1.evaluate(NoShadowingOrOverridesOnMethodsRule.java:39)
at com.carrotsearch.randomizedtesting.rules.StatementAdapter.evaluate(StatementAdapter.java:36)
at org.apache.lucene.util.TestRuleAssertionsRequired$1.evaluate(TestRuleAssertionsRequired.java:43)
at org.apache.lucene.util.TestRuleMarkFailure$1.evaluate(TestRuleMarkFailure.java:48)
at org.apache.lucene.util.TestRuleIgnoreAfterMaxFailures$1.evaluate(TestRuleIgnoreAfterMaxFailures.java:70)
at org.apache.lucene.util.TestRuleIgnoreTestSuites$1.evaluate(TestRuleIgnoreTestSuites.java:55)
at com.carrotsearch.randomizedtesting.rules.StatementAdapter.evaluate(StatementAdapter.java:36)
at com.carrotsearch.randomizedtesting.ThreadLeakControl$StatementRunner.run(ThreadLeakControl.java:358)
at java.lang.Thread.run(Thread.java:744)
Caused by: org.apache.solr.client.solrj.impl.HttpSolrServer$RemoteSolrException: Expected mime type application/octet-stream but got text/html. <html>
<head>
<meta http-equiv="Content-Type" content="text/html;charset=ISO-8859-1"/>
<title>Error 500 Server Error</title>
</head>
<body>
<h2>HTTP ERROR: 500</h2>
<p>Problem accessing /collection1/select. Reason:
<pre> Server Error</pre></p>
<hr /><i><small>Powered by Jetty://</small></i>
</body>
</html>
at org.apache.solr.client.solrj.impl.HttpSolrServer.request(HttpSolrServer.java:459)
at org.apache.solr.client.solrj.impl.HttpSolrServer.request(HttpSolrServer.java:199)
at org.apache.solr.client.solrj.impl.LBHttpSolrServer.request(LBHttpSolrServer.java:293)
... 49 more
Build Log:
[...truncated 10066 lines...]
[junit4] Suite: org.apache.solr.cloud.BasicDistributedZk2Test
[junit4] 2> 12943 T56 oas.SolrTestCaseJ4.buildSSLConfig Randomized ssl (true) and clientAuth (false)
[junit4] 2> 12944 T56 oas.BaseDistributedSearchTestCase.initHostContext Setting hostContext system property: /b/
[junit4] 2> 12951 T56 oas.SolrTestCaseJ4.setUp ###Starting testDistribSearch
[junit4] 2> Creating dataDir: /mnt/ssd/jenkins/workspace/Lucene-Solr-4.x-Linux/solr/build/solr-core/test/J1/./solrtest-BasicDistributedZk2Test-1392584850812
[junit4] 2> 12956 T56 oasc.ZkTestServer.run STARTING ZK TEST SERVER
[junit4] 2> 12959 T57 oasc.ZkTestServer$ZKServerMain.runFromConfig Starting server
[junit4] 2> 13058 T56 oasc.ZkTestServer.run start zk server on port:57661
[junit4] 2> 13129 T56 oascc.ConnectionManager.waitForConnected Waiting for client to connect to ZooKeeper
[junit4] 2> 13164 T58 oazs.NIOServerCnxn.doIO WARN Exception causing close of session 0x0 due to java.io.IOException: ZooKeeperServer not running
[junit4] 2> 15181 T63 oascc.ConnectionManager.process Watcher org.apache.solr.common.cloud.ConnectionManager@421d8a76 name:ZooKeeperConnection Watcher:127.0.0.1:57661 got event WatchedEvent state:SyncConnected type:None path:null path:null type:None
[junit4] 2> 15181 T56 oascc.ConnectionManager.waitForConnected Client is connected to ZooKeeper
[junit4] 2> 15183 T56 oascc.SolrZkClient.makePath makePath: /solr
[junit4] 2> 15216 T56 oascc.ConnectionManager.waitForConnected Waiting for client to connect to ZooKeeper
[junit4] 2> 15224 T65 oascc.ConnectionManager.process Watcher org.apache.solr.common.cloud.ConnectionManager@203c7622 name:ZooKeeperConnection Watcher:127.0.0.1:57661/solr got event WatchedEvent state:SyncConnected type:None path:null path:null type:None
[junit4] 2> 15225 T56 oascc.ConnectionManager.waitForConnected Client is connected to ZooKeeper
[junit4] 2> 15231 T56 oascc.SolrZkClient.makePath makePath: /collections/collection1
[junit4] 2> 15237 T56 oascc.SolrZkClient.makePath makePath: /collections/collection1/shards
[junit4] 2> 15242 T56 oascc.SolrZkClient.makePath makePath: /collections/control_collection
[junit4] 2> 15246 T56 oascc.SolrZkClient.makePath makePath: /collections/control_collection/shards
[junit4] 2> 15251 T56 oasc.AbstractZkTestCase.putConfig put /mnt/ssd/jenkins/workspace/Lucene-Solr-4.x-Linux/solr/build/solr-core/test-files/solr/collection1/conf/solrconfig-tlog.xml to /configs/conf1/solrconfig.xml
[junit4] 2> 15261 T56 oascc.SolrZkClient.makePath makePath: /configs/conf1/solrconfig.xml
[junit4] 2> 15268 T56 oasc.AbstractZkTestCase.putConfig put /mnt/ssd/jenkins/workspace/Lucene-Solr-4.x-Linux/solr/build/solr-core/test-files/solr/collection1/conf/schema.xml to /configs/conf1/schema.xml
[junit4] 2> 15268 T56 oascc.SolrZkClient.makePath makePath: /configs/conf1/schema.xml
[junit4] 2> 15273 T56 oasc.AbstractZkTestCase.putConfig put /mnt/ssd/jenkins/workspace/Lucene-Solr-4.x-Linux/solr/build/solr-core/test-files/solr/collection1/conf/solrconfig.snippet.randomindexconfig.xml to /configs/conf1/solrconfig.snippet.randomindexconfig.xml
[junit4] 2> 15273 T56 oascc.SolrZkClient.makePath makePath: /configs/conf1/solrconfig.snippet.randomindexconfig.xml
[junit4] 2> 15279 T56 oasc.AbstractZkTestCase.putConfig put /mnt/ssd/jenkins/workspace/Lucene-Solr-4.x-Linux/solr/build/solr-core/test-files/solr/collection1/conf/stopwords.txt to /configs/conf1/stopwords.txt
[junit4] 2> 15280 T56 oascc.SolrZkClient.makePath makePath: /configs/conf1/stopwords.txt
[junit4] 2> 15284 T56 oasc.AbstractZkTestCase.putConfig put /mnt/ssd/jenkins/workspace/Lucene-Solr-4.x-Linux/solr/build/solr-core/test-files/solr/collection1/conf/protwords.txt to /configs/conf1/protwords.txt
[junit4] 2> 15284 T56 oascc.SolrZkClient.makePath makePath: /configs/conf1/protwords.txt
[junit4] 2> 15288 T56 oasc.AbstractZkTestCase.putConfig put /mnt/ssd/jenkins/workspace/Lucene-Solr-4.x-Linux/solr/build/solr-core/test-files/solr/collection1/conf/currency.xml to /configs/conf1/currency.xml
[junit4] 2> 15289 T56 oascc.SolrZkClient.makePath makePath: /configs/conf1/currency.xml
[junit4] 2> 15296 T56 oasc.AbstractZkTestCase.putConfig put /mnt/ssd/jenkins/workspace/Lucene-Solr-4.x-Linux/solr/build/solr-core/test-files/solr/collection1/conf/enumsConfig.xml to /configs/conf1/enumsConfig.xml
[junit4] 2> 15296 T56 oascc.SolrZkClient.makePath makePath: /configs/conf1/enumsConfig.xml
[junit4] 2> 15300 T56 oasc.AbstractZkTestCase.putConfig put /mnt/ssd/jenkins/workspace/Lucene-Solr-4.x-Linux/solr/build/solr-core/test-files/solr/collection1/conf/open-exchange-rates.json to /configs/conf1/open-exchange-rates.json
[junit4] 2> 15301 T56 oascc.SolrZkClient.makePath makePath: /configs/conf1/open-exchange-rates.json
[junit4] 2> 15305 T56 oasc.AbstractZkTestCase.putConfig put /mnt/ssd/jenkins/workspace/Lucene-Solr-4.x-Linux/solr/build/solr-core/test-files/solr/collection1/conf/mapping-ISOLatin1Accent.txt to /configs/conf1/mapping-ISOLatin1Accent.txt
[junit4] 2> 15305 T56 oascc.SolrZkClient.makePath makePath: /configs/conf1/mapping-ISOLatin1Accent.txt
[junit4] 2> 15309 T56 oasc.AbstractZkTestCase.putConfig put /mnt/ssd/jenkins/workspace/Lucene-Solr-4.x-Linux/solr/build/solr-core/test-files/solr/collection1/conf/old_synonyms.txt to /configs/conf1/old_synonyms.txt
[junit4] 2> 15310 T56 oascc.SolrZkClient.makePath makePath: /configs/conf1/old_synonyms.txt
[junit4] 2> 15314 T56 oasc.AbstractZkTestCase.putConfig put /mnt/ssd/jenkins/workspace/Lucene-Solr-4.x-Linux/solr/build/solr-core/test-files/solr/collection1/conf/synonyms.txt to /configs/conf1/synonyms.txt
[junit4] 2> 15315 T56 oascc.SolrZkClient.makePath makePath: /configs/conf1/synonyms.txt
[junit4] 2> 15323 T56 oascc.ConnectionManager.waitForConnected Waiting for client to connect to ZooKeeper
[junit4] 2> 15327 T67 oascc.ConnectionManager.process Watcher org.apache.solr.common.cloud.ConnectionManager@172f240c name:ZooKeeperConnection Watcher:127.0.0.1:57661/solr got event WatchedEvent state:SyncConnected type:None path:null path:null type:None
[junit4] 2> 15328 T56 oascc.ConnectionManager.waitForConnected Client is connected to ZooKeeper
[junit4] 2> 15567 T56 oejs.Server.doStart jetty-8.1.10.v20130312
[junit4] 2> 16000 T56 oejus.SslContextFactory.doStart Enabled Protocols [SSLv2Hello, SSLv3, TLSv1, TLSv1.1, TLSv1.2] of [SSLv2Hello, SSLv3, TLSv1, TLSv1.1, TLSv1.2]
[junit4] 2> 16069 T56 oejs.AbstractConnector.doStart Started SslSelectChannelConnector@127.0.0.1:36889
[junit4] 2> 16179 T56 oass.SolrDispatchFilter.init SolrDispatchFilter.init()
[junit4] 2> 16180 T56 oasc.SolrResourceLoader.locateSolrHome JNDI not configured for solr (NoInitialContextEx)
[junit4] 2> 16180 T56 oasc.SolrResourceLoader.locateSolrHome using system property solr.solr.home: ../../../../../../../../../../mnt/ssd/jenkins/workspace/Lucene-Solr-4.x-Linux/solr/build/solr-core/test/J1/./org.apache.solr.cloud.BasicDistributedZk2Test-controljetty-1392584853190
[junit4] 2> 16181 T56 oasc.SolrResourceLoader.<init> new SolrResourceLoader for directory: '../../../../../../../../../../mnt/ssd/jenkins/workspace/Lucene-Solr-4.x-Linux/solr/build/solr-core/test/J1/./org.apache.solr.cloud.BasicDistributedZk2Test-controljetty-1392584853190/'
[junit4] 2> 16229 T56 oasc.ConfigSolr.fromFile Loading container configuration from /mnt/ssd/jenkins/workspace/Lucene-Solr-4.x-Linux/solr/build/solr-core/test/J1/../../../../../../../../../../mnt/ssd/jenkins/workspace/Lucene-Solr-4.x-Linux/solr/build/solr-core/test/J1/./org.apache.solr.cloud.BasicDistributedZk2Test-controljetty-1392584853190/solr.xml
[junit4] 2> 16249 T56 oasc.CoreContainer.<init> New CoreContainer 149891472
[junit4] 2> 16250 T56 oasc.CoreContainer.load Loading cores into CoreContainer [instanceDir=../../../../../../../../../../mnt/ssd/jenkins/workspace/Lucene-Solr-4.x-Linux/solr/build/solr-core/test/J1/./org.apache.solr.cloud.BasicDistributedZk2Test-controljetty-1392584853190/]
[junit4] 2> 16284 T56 oashc.HttpShardHandlerFactory.getParameter Setting socketTimeout to: 90000
[junit4] 2> 16285 T56 oashc.HttpShardHandlerFactory.getParameter Setting urlScheme to:
[junit4] 2> 16286 T56 oashc.HttpShardHandlerFactory.getParameter Setting connTimeout to: 15000
[junit4] 2> 16286 T56 oashc.HttpShardHandlerFactory.getParameter Setting maxConnectionsPerHost to: 20
[junit4] 2> 16287 T56 oashc.HttpShardHandlerFactory.getParameter Setting corePoolSize to: 0
[junit4] 2> 16287 T56 oashc.HttpShardHandlerFactory.getParameter Setting maximumPoolSize to: 2147483647
[junit4] 2> 16287 T56 oashc.HttpShardHandlerFactory.getParameter Setting maxThreadIdleTime to: 5
[junit4] 2> 16288 T56 oashc.HttpShardHandlerFactory.getParameter Setting sizeOfQueue to: -1
[junit4] 2> 16288 T56 oashc.HttpShardHandlerFactory.getParameter Setting fairnessPolicy to: false
[junit4] 2> 16301 T56 oasl.LogWatcher.createWatcher SLF4J impl is org.slf4j.impl.Log4jLoggerFactory
[junit4] 2> 16301 T56 oasl.LogWatcher.newRegisteredLogWatcher Registering Log Listener [Log4j (org.slf4j.impl.Log4jLoggerFactory)]
[junit4] 2> 16302 T56 oasc.CoreContainer.load Host Name: 127.0.0.1
[junit4] 2> 16302 T56 oasc.ZkContainer.initZooKeeper Zookeeper client=127.0.0.1:57661/solr
[junit4] 2> 16317 T56 oasc.ZkController.checkChrootPath zkHost includes chroot
[junit4] 2> 16325 T56 oascc.ConnectionManager.waitForConnected Waiting for client to connect to ZooKeeper
[junit4] 2> 16338 T79 oascc.ConnectionManager.process Watcher org.apache.solr.common.cloud.ConnectionManager@714a968e name:ZooKeeperConnection Watcher:127.0.0.1:57661 got event WatchedEvent state:SyncConnected type:None path:null path:null type:None
[junit4] 2> 16339 T56 oascc.ConnectionManager.waitForConnected Client is connected to ZooKeeper
[junit4] 2> 16353 T56 oascc.ConnectionManager.waitForConnected Waiting for client to connect to ZooKeeper
[junit4] 2> 16356 T81 oascc.ConnectionManager.process Watcher org.apache.solr.common.cloud.ConnectionManager@64753682 name:ZooKeeperConnection Watcher:127.0.0.1:57661/solr got event WatchedEvent state:SyncConnected type:None path:null path:null type:None
[junit4] 2> 16357 T56 oascc.ConnectionManager.waitForConnected Client is connected to ZooKeeper
[junit4] 2> 16364 T56 oascc.SolrZkClient.makePath makePath: /overseer/queue
[junit4] 2> 16379 T56 oascc.SolrZkClient.makePath makePath: /overseer/collection-queue-work
[junit4] 2> 16394 T56 oascc.SolrZkClient.makePath makePath: /live_nodes
[junit4] 2> 16397 T56 oasc.ZkController.createEphemeralLiveNode Register node as live in ZooKeeper:/live_nodes/127.0.0.1:36889_b
[junit4] 2> 16402 T56 oascc.SolrZkClient.makePath makePath: /live_nodes/127.0.0.1:36889_b
[junit4] 2> 16407 T56 oascc.SolrZkClient.makePath makePath: /overseer_elect
[junit4] 2> 16412 T56 oascc.SolrZkClient.makePath makePath: /overseer_elect/election
[junit4] 2> 16427 T56 oasc.OverseerElectionContext.runLeaderProcess I am going to be the leader 127.0.0.1:36889_b
[junit4] 2> 16428 T56 oascc.SolrZkClient.makePath makePath: /overseer_elect/leader
[junit4] 2> 16441 T56 oasc.Overseer.start Overseer (id=91264440791072772-127.0.0.1:36889_b-n_0000000000) starting
[junit4] 2> 16458 T56 oascc.SolrZkClient.makePath makePath: /overseer/queue-work
[junit4] 2> 16498 T82 oasc.Overseer$ClusterStateUpdater.run Starting to work on the main queue
[junit4] 2> 16513 T83 oasc.OverseerCollectionProcessor.run Process current queue of collection creations
[junit4] 2> 16515 T56 oascc.SolrZkClient.makePath makePath: /clusterstate.json
[junit4] 2> 16515 T83 oasc.OverseerCollectionProcessor.prioritizeOverseerNodes prioritizing overseer nodes
[junit4] 2> 16523 T56 oascc.SolrZkClient.makePath makePath: /aliases.json
[junit4] 2> 16526 T56 oascc.ZkStateReader.createClusterStateWatchersAndUpdate Updating cluster state from ZooKeeper...
[junit4] 2> 16552 T84 oasc.ZkController.publish publishing core=collection1 state=down
[junit4] 2> 16552 T84 oasc.ZkController.publish numShards not found on descriptor - reading it from system property
[junit4] 2> 16558 T81 oasc.DistributedQueue$LatchChildWatcher.process LatchChildWatcher fired on path: /overseer/queue state: SyncConnected type NodeChildrenChanged
[junit4] 2> 16558 T84 oasc.ZkController.waitForCoreNodeName look for our core node name
[junit4] 2> 16562 T82 oascc.ZkStateReader.updateClusterState Updating cloud state from ZooKeeper...
[junit4] 2> 16564 T82 oasc.Overseer$ClusterStateUpdater.updateState Update state numShards=1 message={
[junit4] 2> "operation":"state",
[junit4] 2> "state":"down",
[junit4] 2> "base_url":"https://127.0.0.1:36889/b",
[junit4] 2> "core":"collection1",
[junit4] 2> "roles":null,
[junit4] 2> "node_name":"127.0.0.1:36889_b",
[junit4] 2> "shard":null,
[junit4] 2> "shard_range":null,
[junit4] 2> "shard_state":"active",
[junit4] 2> "shard_parent":null,
[junit4] 2> "collection":"control_collection",
[junit4] 2> "numShards":"1",
[junit4] 2> "core_node_name":null}
[junit4] 2> 16565 T82 oasc.Overseer$ClusterStateUpdater.createCollection Create collection control_collection with shards [shard1]
[junit4] 2> 16579 T82 oasc.Overseer$ClusterStateUpdater.updateState Assigning new node to shard shard=shard1
[junit4] 2> 16586 T81 oasc.DistributedQueue$LatchChildWatcher.process LatchChildWatcher fired on path: /overseer/queue state: SyncConnected type NodeChildrenChanged
[junit4] 2> 16592 T81 oascc.ZkStateReader$2.process A cluster state change: WatchedEvent state:SyncConnected type:NodeDataChanged path:/clusterstate.json, has occurred - updating... (live nodes size: 1)
[junit4] 2> 17563 T84 oasc.ZkController.waitForShardId waiting to find shard id in clusterstate for collection1
[junit4] 2> 17564 T84 oasc.CoreContainer.create Creating SolrCore 'collection1' using instanceDir: ../../../../../../../../../../mnt/ssd/jenkins/workspace/Lucene-Solr-4.x-Linux/solr/build/solr-core/test/J1/./org.apache.solr.cloud.BasicDistributedZk2Test-controljetty-1392584853190/collection1
[junit4] 2> 17564 T84 oasc.ZkController.createCollectionZkNode Check for collection zkNode:control_collection
[junit4] 2> 17565 T84 oasc.ZkController.createCollectionZkNode Collection zkNode exists
[junit4] 2> 17565 T84 oascc.ZkStateReader.readConfigName Load collection config from:/collections/control_collection
[junit4] 2> 17566 T84 oascc.ZkStateReader.readConfigName path=/collections/control_collection configName=conf1 specified config exists in ZooKeeper
[junit4] 2> 17567 T84 oasc.SolrResourceLoader.<init> new SolrResourceLoader for directory: '../../../../../../../../../../mnt/ssd/jenkins/workspace/Lucene-Solr-4.x-Linux/solr/build/solr-core/test/J1/./org.apache.solr.cloud.BasicDistributedZk2Test-controljetty-1392584853190/collection1/'
[junit4] 2> 17568 T84 oasc.SolrResourceLoader.replaceClassLoader Adding 'file:/mnt/ssd/jenkins/workspace/Lucene-Solr-4.x-Linux/solr/build/solr-core/test/J1/org.apache.solr.cloud.BasicDistributedZk2Test-controljetty-1392584853190/collection1/lib/classes/' to classloader
[junit4] 2> 17568 T84 oasc.SolrResourceLoader.replaceClassLoader Adding 'file:/mnt/ssd/jenkins/workspace/Lucene-Solr-4.x-Linux/solr/build/solr-core/test/J1/org.apache.solr.cloud.BasicDistributedZk2Test-controljetty-1392584853190/collection1/lib/README' to classloader
[junit4] 2> 17600 T84 oasc.SolrConfig.<init> Using Lucene MatchVersion: LUCENE_47
[junit4] 2> 17616 T84 oasc.SolrConfig.<init> Loaded SolrConfig: solrconfig.xml
[junit4] 2> 17618 T84 oass.IndexSchema.readSchema Reading Solr Schema from schema.xml
[junit4] 2> 17635 T84 oass.IndexSchema.readSchema [collection1] Schema name=test
[junit4] 2> 17890 T84 oass.ByteField.init WARN ByteField is deprecated and will be removed in 5.0. You should use TrieIntField instead.
[junit4] 2> 17891 T84 oass.ShortField.init WARN ShortField is deprecated and will be removed in 5.0. You should use TrieIntField instead.
[junit4] 2> 17892 T84 oass.OpenExchangeRatesOrgProvider.init Initialized with rates=open-exchange-rates.json, refreshInterval=1440.
[junit4] 2> 17901 T84 oass.IndexSchema.readSchema default search field in schema is text
[junit4] 2> 17903 T84 oass.IndexSchema.readSchema unique key field: id
[junit4] 2> 17951 T84 oass.FileExchangeRateProvider.reload Reloading exchange rates from file currency.xml
[junit4] 2> 17960 T84 oass.FileExchangeRateProvider.reload Reloading exchange rates from file currency.xml
[junit4] 2> 17966 T84 oass.OpenExchangeRatesOrgProvider.reload Reloading exchange rates from open-exchange-rates.json
[junit4] 2> 17968 T84 oass.OpenExchangeRatesOrgProvider$OpenExchangeRates.<init> WARN Unknown key IMPORTANT NOTE
[junit4] 2> 17969 T84 oass.OpenExchangeRatesOrgProvider$OpenExchangeRates.<init> WARN Expected key, got STRING
[junit4] 2> 17969 T84 oass.OpenExchangeRatesOrgProvider.reload Reloading exchange rates from open-exchange-rates.json
[junit4] 2> 17971 T84 oass.OpenExchangeRatesOrgProvider$OpenExchangeRates.<init> WARN Unknown key IMPORTANT NOTE
[junit4] 2> 17972 T84 oass.OpenExchangeRatesOrgProvider$OpenExchangeRates.<init> WARN Expected key, got STRING
[junit4] 2> 17972 T84 oasc.SolrCore.initDirectoryFactory org.apache.solr.core.MockDirectoryFactory
[junit4] 2> 17973 T84 oasc.SolrCore.<init> [collection1] Opening new SolrCore at ../../../../../../../../../../mnt/ssd/jenkins/workspace/Lucene-Solr-4.x-Linux/solr/build/solr-core/test/J1/./org.apache.solr.cloud.BasicDistributedZk2Test-controljetty-1392584853190/collection1/, dataDir=./org.apache.solr.cloud.BasicDistributedZk2Test-1392584850811/control/data/
[junit4] 2> 17993 T84 oasc.JmxMonitoredMap.<init> JMX monitoring is enabled. Adding Solr mbeans to JMX Server: com.sun.jmx.mbeanserver.JmxMBeanServer@6e227cf4
[junit4] 2> 18009 T84 oasc.CachingDirectoryFactory.get return new directory for ./org.apache.solr.cloud.BasicDistributedZk2Test-1392584850811/control/data
[junit4] 2> 18009 T84 oasc.SolrCore.getNewIndexDir New index directory detected: old=null new=./org.apache.solr.cloud.BasicDistributedZk2Test-1392584850811/control/data/index/
[junit4] 2> 18009 T84 oasc.SolrCore.initIndex WARN [collection1] Solr index directory './org.apache.solr.cloud.BasicDistributedZk2Test-1392584850811/control/data/index' doesn't exist. Creating new index...
[junit4] 2> 18010 T84 oasc.CachingDirectoryFactory.get return new directory for ./org.apache.solr.cloud.BasicDistributedZk2Test-1392584850811/control/data/index
[junit4] 2> 18011 T84 oasu.RandomMergePolicy.<init> RandomMergePolicy wrapping class org.apache.lucene.index.AlcoholicMergePolicy: [AlcoholicMergePolicy: minMergeSize=0, mergeFactor=10, maxMergeSize=1206422031, maxMergeSizeForForcedMerge=9223372036854775807, calibrateSizeByDeletes=true, maxMergeDocs=2147483647, maxCFSSegmentSizeMB=8.796093022207999E12, noCFSRatio=0.1]
[junit4] 2> 18012 T84 oasc.SolrDeletionPolicy.onCommit SolrDeletionPolicy.onCommit: commits: num=1
[junit4] 2> commit{dir=MockDirectoryWrapper(RAMDirectory@3a77990e lockFactory=org.apache.lucene.store.SingleInstanceLockFactory@1bbfeda4),segFN=segments_1,generation=1}
[junit4] 2> 18013 T84 oasc.SolrDeletionPolicy.updateCommits newest commit generation = 1
[junit4] 2> 18020 T84 oasup.UpdateRequestProcessorChain.init creating updateRequestProcessorChain "nodistrib"
[junit4] 2> 18037 T84 oasup.UpdateRequestProcessorChain.init creating updateRequestProcessorChain "dedupe"
[junit4] 2> 18038 T84 oasup.UpdateRequestProcessorChain.init inserting DistributedUpdateProcessorFactory into updateRequestProcessorChain "dedupe"
[junit4] 2> 18038 T84 oasup.UpdateRequestProcessorChain.init creating updateRequestProcessorChain "stored_sig"
[junit4] 2> 18038 T84 oasup.UpdateRequestProcessorChain.init inserting DistributedUpdateProcessorFactory into updateRequestProcessorChain "stored_sig"
[junit4] 2> 18039 T84 oasup.UpdateRequestProcessorChain.init creating updateRequestProcessorChain "distrib-dup-test-chain-explicit"
[junit4] 2> 18039 T84 oasup.UpdateRequestProcessorChain.init creating updateRequestProcessorChain "distrib-dup-test-chain-implicit"
[junit4] 2> 18040 T84 oasup.UpdateRequestProcessorChain.init inserting DistributedUpdateProcessorFactory into updateRequestProcessorChain "distrib-dup-test-chain-implicit"
[junit4] 2> 18040 T84 oasc.SolrCore.loadUpdateProcessorChains no updateRequestProcessorChain defined as default, creating implicit default
[junit4] 2> 18044 T84 oasc.RequestHandlers.initHandlersFromConfig created standard: solr.StandardRequestHandler
[junit4] 2> 18045 T84 oasc.RequestHandlers.initHandlersFromConfig created /get: solr.RealTimeGetHandler
[junit4] 2> 18045 T84 oasc.RequestHandlers.initHandlersFromConfig adding lazy requestHandler: solr.ReplicationHandler
[junit4] 2> 18046 T84 oasc.RequestHandlers.initHandlersFromConfig created /replication: solr.ReplicationHandler
[junit4] 2> 18047 T84 oasc.RequestHandlers.initHandlersFromConfig created /update: solr.UpdateRequestHandler
[junit4] 2> 18048 T84 oasc.RequestHandlers.initHandlersFromConfig created /admin/: org.apache.solr.handler.admin.AdminHandlers
[junit4] 2> 18049 T84 oasc.RequestHandlers.initHandlersFromConfig created /admin/file: solr.admin.ShowFileRequestHandler
[junit4] 2> 18051 T84 oashl.XMLLoader.init xsltCacheLifetimeSeconds=60
[junit4] 2> 18064 T84 oasu.CommitTracker.<init> Hard AutoCommit: disabled
[junit4] 2> 18064 T84 oasu.CommitTracker.<init> Soft AutoCommit: disabled
[junit4] 2> 18066 T84 oasu.RandomMergePolicy.<init> RandomMergePolicy wrapping class org.apache.lucene.index.LogByteSizeMergePolicy: [LogByteSizeMergePolicy: minMergeSize=1677721, mergeFactor=20, maxMergeSize=2147483648, maxMergeSizeForForcedMerge=9223372036854775807, calibrateSizeByDeletes=false, maxMergeDocs=2147483647, maxCFSSegmentSizeMB=8.796093022207999E12, noCFSRatio=1.0]
[junit4] 2> 18066 T84 oasc.SolrDeletionPolicy.onInit SolrDeletionPolicy.onInit: commits: num=1
[junit4] 2> commit{dir=MockDirectoryWrapper(RAMDirectory@3a77990e lockFactory=org.apache.lucene.store.SingleInstanceLockFactory@1bbfeda4),segFN=segments_1,generation=1}
[junit4] 2> 18067 T84 oasc.SolrDeletionPolicy.updateCommits newest commit generation = 1
[junit4] 2> 18067 T84 oass.SolrIndexSearcher.<init> Opening Searcher@3ed62bdf[collection1] main
[junit4] 2> 18073 T85 oasc.SolrCore.registerSearcher [collection1] Registered new searcher Searcher@3ed62bdf[collection1] main{StandardDirectoryReader(segments_1:1:nrt)}
[junit4] 2> 18078 T84 oasc.CoreContainer.registerCore registering core: collection1
[junit4] 2> 18080 T56 oass.SolrDispatchFilter.init user.dir=/mnt/ssd/jenkins/workspace/Lucene-Solr-4.x-Linux/solr/build/solr-core/test/J1
[junit4] 2> 18080 T88 oasc.ZkController.register Register replica - core:collection1 address:https://127.0.0.1:36889/b collection:control_collection shard:shard1
[junit4] 2> 18080 T56 oass.SolrDispatchFilter.init SolrDispatchFilter.init() done
[junit4] 2> 18088 T88 oascc.SolrZkClient.makePath makePath: /collections/control_collection/leader_elect/shard1/election
[junit4] 2> 18102 T88 oasc.ShardLeaderElectionContext.runLeaderProcess Running the leader process for shard shard1
[junit4] 2> 18106 T81 oasc.DistributedQueue$LatchChildWatcher.process LatchChildWatcher fired on path: /overseer/queue state: SyncConnected type NodeChildrenChanged
[junit4] 2> 18107 T88 oasc.ShardLeaderElectionContext.waitForReplicasToComeUp Enough replicas found to continue.
[junit4] 2> 18108 T88 oasc.ShardLeaderElectionContext.runLeaderProcess I may be the new leader - try and sync
[junit4] 2> 18108 T82 oascc.ZkStateReader.updateClusterState Updating cloud state from ZooKeeper...
[junit4] 2> 18111 T56 oascc.ConnectionManager.waitForConnected Waiting for client to connect to ZooKeeper
[junit4] 2> ASYNC NEW_CORE C8 name=collection1 org.apache.solr.core.SolrCore@2ab36d6f url=https://127.0.0.1:36889/b/collection1 node=127.0.0.1:36889_b C8_STATE=coll:control_collection core:collection1 props:{state=down, base_url=https://127.0.0.1:36889/b, core=collection1, node_name=127.0.0.1:36889_b}
[junit4] 2> 18113 T88 C8 P36889 oasc.SyncStrategy.sync Sync replicas to https://127.0.0.1:36889/b/collection1/
[junit4] 2> 18114 T90 oascc.ConnectionManager.process Watcher org.apache.solr.common.cloud.ConnectionManager@9385c31 name:ZooKeeperConnection Watcher:127.0.0.1:57661/solr got event WatchedEvent state:SyncConnected type:None path:null path:null type:None
[junit4] 2> 18114 T88 C8 P36889 oasc.SyncStrategy.syncReplicas Sync Success - now sync replicas to me
[junit4] 2> 18115 T88 C8 P36889 oasc.SyncStrategy.syncToMe https://127.0.0.1:36889/b/collection1/ has no replicas
[junit4] 2> 18115 T88 oasc.ShardLeaderElectionContext.runLeaderProcess I am the new leader: https://127.0.0.1:36889/b/collection1/ shard1
[junit4] 2> 18116 T88 oascc.SolrZkClient.makePath makePath: /collections/control_collection/leaders/shard1
[junit4] 2> 18115 T56 oascc.ConnectionManager.waitForConnected Client is connected to ZooKeeper
[junit4] 2> 18123 T56 oascc.ZkStateReader.createClusterStateWatchersAndUpdate Updating cluster state from ZooKeeper...
[junit4] 2> 18129 T81 oasc.DistributedQueue$LatchChildWatcher.process LatchChildWatcher fired on path: /overseer/queue state: SyncConnected type NodeChildrenChanged
[junit4] 2> 18132 T81 oascc.ZkStateReader$2.process A cluster state change: WatchedEvent state:SyncConnected type:NodeDataChanged path:/clusterstate.json, has occurred - updating... (live nodes size: 1)
[junit4] 2> 18136 T90 oascc.ZkStateReader$2.process A cluster state change: WatchedEvent state:SyncConnected type:NodeDataChanged path:/clusterstate.json, has occurred - updating... (live nodes size: 1)
[junit4] 2> 18142 T56 oasc.ChaosMonkey.monkeyLog monkey: init - expire sessions:false cause connection loss:false
[junit4] 2> 18148 T81 oasc.DistributedQueue$LatchChildWatcher.process LatchChildWatcher fired on path: /overseer/queue state: SyncConnected type NodeChildrenChanged
[junit4] 2> 18160 T82 oascc.ZkStateReader.updateClusterState Updating cloud state from ZooKeeper...
[junit4] 2> 18164 T81 oasc.DistributedQueue$LatchChildWatcher.process LatchChildWatcher fired on path: /overseer/queue state: SyncConnected type NodeChildrenChanged
[junit4] 2> 18255 T56 oasc.AbstractFullDistribZkTestBase.createJettys create jetty 1
[junit4] 2> 18256 T56 oejs.Server.doStart jetty-8.1.10.v20130312
[junit4] 2> 18265 T56 oejus.SslContextFactory.doStart Enabled Protocols [SSLv2Hello, SSLv3, TLSv1, TLSv1.1, TLSv1.2] of [SSLv2Hello, SSLv3, TLSv1, TLSv1.1, TLSv1.2]
[junit4] 2> 18267 T90 oascc.ZkStateReader$2.process A cluster state change: WatchedEvent state:SyncConnected type:NodeDataChanged path:/clusterstate.json, has occurred - updating... (live nodes size: 1)
[junit4] 2> 18267 T81 oascc.ZkStateReader$2.process A cluster state change: WatchedEvent state:SyncConnected type:NodeDataChanged path:/clusterstate.json, has occurred - updating... (live nodes size: 1)
[junit4] 2> 18273 T56 oejs.AbstractConnector.doStart Started SslSelectChannelConnector@127.0.0.1:33794
[junit4] 2> 18283 T56 oass.SolrDispatchFilter.init SolrDispatchFilter.init()
[junit4] 2> 18283 T56 oasc.SolrResourceLoader.locateSolrHome JNDI not configured for solr (NoInitialContextEx)
[junit4] 2> 18284 T56 oasc.SolrResourceLoader.locateSolrHome using system property solr.solr.home: ./org.apache.solr.cloud.BasicDistributedZk2Test-jetty1-1392584856001
[junit4] 2> 18284 T56 oasc.SolrResourceLoader.<init> new SolrResourceLoader for directory: './org.apache.solr.cloud.BasicDistributedZk2Test-jetty1-1392584856001/'
[junit4] 2> 18307 T56 oasc.ConfigSolr.fromFile Loading container configuration from /mnt/ssd/jenkins/workspace/Lucene-Solr-4.x-Linux/solr/build/solr-core/test/J1/./org.apache.solr.cloud.BasicDistributedZk2Test-jetty1-1392584856001/solr.xml
[junit4] 2> 18310 T88 oasc.ZkController.register We are https://127.0.0.1:36889/b/collection1/ and leader is https://127.0.0.1:36889/b/collection1/
[junit4] 2> 18311 T88 oasc.ZkController.register No LogReplay needed for core=collection1 baseURL=https://127.0.0.1:36889/b
[junit4] 2> 18312 T88 oasc.ZkController.checkRecovery I am the leader, no recovery necessary
[junit4] 2> 18312 T88 oasc.ZkController.publish publishing core=collection1 state=active
[junit4] 2> 18312 T88 oasc.ZkController.publish numShards not found on descriptor - reading it from system property
[junit4] 2> 18315 T81 oasc.DistributedQueue$LatchChildWatcher.process LatchChildWatcher fired on path: /overseer/queue state: SyncConnected type NodeChildrenChanged
[junit4] 2> 18315 T81 oasc.DistributedQueue$LatchChildWatcher.process LatchChildWatcher fired on path: /overseer/queue state: SyncConnected type NodeChildrenChanged
[junit4] 2> 18316 T81 oasc.DistributedQueue$LatchChildWatcher.process LatchChildWatcher fired on path: /overseer/queue state: SyncConnected type NodeChildrenChanged
[junit4] 2> 18316 T88 oascc.ZkStateReader.updateClusterState Updating cloud state from ZooKeeper...
[junit4] 2> 18318 T82 oascc.ZkStateReader.updateClusterState Updating cloud state from ZooKeeper...
[junit4] 2> 18320 T82 oasc.Overseer$ClusterStateUpdater.updateState Update state numShards=2 message={
[junit4] 2> "operation":"state",
[junit4] 2> "state":"active",
[junit4] 2> "base_url":"https://127.0.0.1:36889/b",
[junit4] 2> "core":"collection1",
[junit4] 2> "roles":null,
[junit4] 2> "node_name":"127.0.0.1:36889_b",
[junit4] 2> "shard":"shard1",
[junit4] 2> "shard_range":null,
[junit4] 2> "shard_state":"active",
[junit4] 2> "shard_parent":null,
[junit4] 2> "collection":"control_collection",
[junit4] 2> "numShards":"2",
[junit4] 2> "core_node_name":"core_node1"}
[junit4] 2> 18324 T81 oasc.DistributedQueue$LatchChildWatcher.process LatchChildWatcher fired on path: /overseer/queue state: SyncConnected type NodeChildrenChanged
[junit4] 2> 18326 T56 oasc.CoreContainer.<init> New CoreContainer 1299498737
[junit4] 2> 18326 T56 oasc.CoreContainer.load Loading cores into CoreContainer [instanceDir=./org.apache.solr.cloud.BasicDistributedZk2Test-jetty1-1392584856001/]
[junit4] 2> 18327 T56 oashc.HttpShardHandlerFactory.getParameter Setting socketTimeout to: 90000
[junit4] 2> 18328 T56 oashc.HttpShardHandlerFactory.getParameter Setting urlScheme to:
[junit4] 2> 18328 T56 oashc.HttpShardHandlerFactory.getParameter Setting connTimeout to: 15000
[junit4] 2> 18329 T56 oashc.HttpShardHandlerFactory.getParameter Setting maxConnectionsPerHost to: 20
[junit4] 2> 18329 T56 oashc.HttpShardHandlerFactory.getParameter Setting corePoolSize to: 0
[junit4] 2> 18329 T56 oashc.HttpShardHandlerFactory.getParameter Setting maximumPoolSize to: 2147483647
[junit4] 2> 18330 T56 oashc.HttpShardHandlerFactory.getParameter Setting maxThreadIdleTime to: 5
[junit4] 2> 18330 T56 oashc.HttpShardHandlerFactory.getParameter Setting sizeOfQueue to: -1
[junit4] 2> 18331 T56 oashc.HttpShardHandlerFactory.getParameter Setting fairnessPolicy to: false
[junit4] 2> 18337 T56 oasl.LogWatcher.createWatcher SLF4J impl is org.slf4j.impl.Log4jLoggerFactory
[junit4] 2> 18339 T56 oasl.LogWatcher.newRegisteredLogWatcher Registering Log Listener [Log4j (org.slf4j.impl.Log4jLoggerFactory)]
[junit4] 2> 18339 T56 oasc.CoreContainer.load Host Name: 127.0.0.1
[junit4] 2> 18340 T56 oasc.ZkContainer.initZooKeeper Zookeeper client=127.0.0.1:57661/solr
[junit4] 2> 18340 T56 oasc.ZkController.checkChrootPath zkHost includes chroot
[junit4] 2> 18344 T56 oascc.ConnectionManager.waitForConnected Waiting for client to connect to ZooKeeper
[junit4] 2> 18347 T101 oascc.ConnectionManager.process Watcher org.apache.solr.common.cloud.ConnectionManager@537ab0fe name:ZooKeeperConnection Watcher:127.0.0.1:57661 got event WatchedEvent state:SyncConnected type:None path:null path:null type:None
[junit4] 2> 18348 T56 oascc.ConnectionManager.waitForConnected Client is connected to ZooKeeper
[junit4] 2> 18351 T56 oascc.ConnectionManager.waitForConnected Waiting for client to connect to ZooKeeper
[junit4] 2> 18355 T103 oascc.ConnectionManager.process Watcher org.apache.solr.common.cloud.ConnectionManager@e247ce4 name:ZooKeeperConnection Watcher:127.0.0.1:57661/solr got event WatchedEvent state:SyncConnected type:None path:null path:null type:None
[junit4] 2> 18355 T56 oascc.ConnectionManager.waitForConnected Client is connected to ZooKeeper
[junit4] 2> 18362 T56 oascc.ZkStateReader.createClusterStateWatchersAndUpdate Updating cluster state from ZooKeeper...
[junit4] 2> 18428 T90 oascc.ZkStateReader$2.process A cluster state change: WatchedEvent state:SyncConnected type:NodeDataChanged path:/clusterstate.json, has occurred - updating... (live nodes size: 1)
[junit4] 2> 18428 T81 oascc.ZkStateReader$2.process A cluster state change: WatchedEvent state:SyncConnected type:NodeDataChanged path:/clusterstate.json, has occurred - updating... (live nodes size: 1)
[junit4] 2> 18429 T103 oascc.ZkStateReader$2.process A cluster state change: WatchedEvent state:SyncConnected type:NodeDataChanged path:/clusterstate.json, has occurred - updating... (live nodes size: 1)
[junit4] 2> 19366 T56 oasc.ZkController.createEphemeralLiveNode Register node as live in ZooKeeper:/live_nodes/127.0.0.1:33794_b
[junit4] 2> 19367 T56 oascc.SolrZkClient.makePath makePath: /live_nodes/127.0.0.1:33794_b
[junit4] 2> 19375 T90 oascc.ZkStateReader$3.process Updating live nodes... (2)
[junit4] 2> 19375 T103 oascc.ZkStateReader$3.process Updating live nodes... (2)
[junit4] 2> 19375 T81 oascc.ZkStateReader$3.process Updating live nodes... (2)
[junit4] 2> 19388 T104 oasc.ZkController.publish publishing core=collection1 state=down
[junit4] 2> 19388 T104 oasc.ZkController.publish numShards not found on descriptor - reading it from system property
[junit4] 2> 19390 T81 oasc.DistributedQueue$LatchChildWatcher.process LatchChildWatcher fired on path: /overseer/queue state: SyncConnected type NodeChildrenChanged
[junit4] 2> 19390 T81 oasc.DistributedQueue$LatchChildWatcher.process LatchChildWatcher fired on path: /overseer/queue state: SyncConnected type NodeChildrenChanged
[junit4] 2> 19390 T104 oasc.ZkController.waitForCoreNodeName look for our core node name
[junit4] 2> 19391 T81 oasc.DistributedQueue$LatchChildWatcher.process LatchChildWatcher fired on path: /overseer/queue state: SyncConnected type NodeChildrenChanged
[junit4] 2> 19392 T82 oascc.ZkStateReader.updateClusterState Updating cloud state from ZooKeeper...
[junit4] 2> 19394 T82 oasc.Overseer$ClusterStateUpdater.updateState Update state numShards=2 message={
[junit4] 2> "operation":"state",
[junit4] 2> "state":"down",
[junit4] 2> "base_url":"https://127.0.0.1:33794/b",
[junit4] 2> "core":"collection1",
[junit4] 2> "roles":null,
[junit4] 2> "node_name":"127.0.0.1:33794_b",
[junit4] 2> "shard":null,
[junit4] 2> "shard_range":null,
[junit4] 2> "shard_state":"active",
[junit4] 2> "shard_parent":null,
[junit4] 2> "collection":"collection1",
[junit4] 2> "numShards":"2",
[junit4] 2> "core_node_name":null}
[junit4] 2> 19394 T82 oasc.Overseer$ClusterStateUpdater.createCollection Create collection collection1 with shards [shard1, shard2]
[junit4] 2> 19394 T82 oasc.Overseer$ClusterStateUpdater.updateState Assigning new node to shard shard=shard2
[junit4] 2> 19402 T81 oasc.DistributedQueue$LatchChildWatcher.process LatchChildWatcher fired on path: /overseer/queue state: SyncConnected type NodeChildrenChanged
[junit4] 2> 19505 T90 oascc.ZkStateReader$2.process A cluster state change: WatchedEvent state:SyncConnected type:NodeDataChanged path:/clusterstate.json, has occurred - updating... (live nodes size: 2)
[junit4] 2> 19505 T103 oascc.ZkStateReader$2.process A cluster state change: WatchedEvent state:SyncConnected type:NodeDataChanged path:/clusterstate.json, has occurred - updating... (live nodes size: 2)
[junit4] 2> 19505 T81 oascc.ZkStateReader$2.process A cluster state change: WatchedEvent state:SyncConnected type:NodeDataChanged path:/clusterstate.json, has occurred - updating... (live nodes size: 2)
[junit4] 2> 20391 T104 oasc.ZkController.waitForShardId waiting to find shard id in clusterstate for collection1
[junit4] 2> 20392 T104 oasc.CoreContainer.create Creating SolrCore 'collection1' using instanceDir: ./org.apache.solr.cloud.BasicDistributedZk2Test-jetty1-1392584856001/collection1
[junit4] 2> 20392 T104 oasc.ZkController.createCollectionZkNode Check for collection zkNode:collection1
[junit4] 2> 20393 T104 oasc.ZkController.createCollectionZkNode Collection zkNode exists
[junit4] 2> 20393 T104 oascc.ZkStateReader.readConfigName Load collection config from:/collections/collection1
[junit4] 2> 20394 T104 oascc.ZkStateReader.readConfigName path=/collections/collection1 configName=conf1 specified config exists in ZooKeeper
[junit4] 2> 20395 T104 oasc.SolrResourceLoader.<init> new SolrResourceLoader for directory: './org.apache.solr.cloud.BasicDistributedZk2Test-jetty1-1392584856001/collection1/'
[junit4] 2> 20395 T104 oasc.SolrResourceLoader.replaceClassLoader Adding 'file:/mnt/ssd/jenkins/workspace/Lucene-Solr-4.x-Linux/solr/build/solr-core/test/J1/org.apache.solr.cloud.BasicDistributedZk2Test-jetty1-1392584856001/collection1/lib/classes/' to classloader
[junit4] 2> 20396 T104 oasc.SolrResourceLoader.replaceClassLoader Adding 'file:/mnt/ssd/jenkins/workspace/Lucene-Solr-4.x-Linux/solr/build/solr-core/test/J1/org.apache.solr.cloud.BasicDistributedZk2Test-jetty1-1392584856001/collection1/lib/README' to classloader
[junit4] 2> 20438 T104 oasc.SolrConfig.<init> Using Lucene MatchVersion: LUCENE_47
[junit4] 2> 20454 T104 oasc.SolrConfig.<init> Loaded SolrConfig: solrconfig.xml
[junit4] 2> 20457 T104 oass.IndexSchema.readSchema Reading Solr Schema from schema.xml
[junit4] 2> 20487 T104 oass.IndexSchema.readSchema [collection1] Schema name=test
[junit4] 2> 20801 T104 oass.ByteField.init WARN ByteField is deprecated and will be removed in 5.0. You should use TrieIntField instead.
[junit4] 2> 20802 T104 oass.ShortField.init WARN ShortField is deprecated and will be removed in 5.0. You should use TrieIntField instead.
[junit4] 2> 20803 T104 oass.OpenExchangeRatesOrgProvider.init Initialized with rates=open-exchange-rates.json, refreshInterval=1440.
[junit4] 2> 20818 T104 oass.IndexSchema.readSchema default search field in schema is text
[junit4] 2> 20824 T104 oass.IndexSchema.readSchema unique key field: id
[junit4] 2> 20861 T104 oass.FileExchangeRateProvider.reload Reloading exchange rates from file currency.xml
[junit4] 2> 20866 T104 oass.FileExchangeRateProvider.reload Reloading exchange rates from file currency.xml
[junit4] 2> 20870 T104 oass.OpenExchangeRatesOrgProvider.reload Reloading exchange rates from open-exchange-rates.json
[junit4] 2> 20873 T104 oass.OpenExchangeRatesOrgProvider$OpenExchangeRates.<init> WARN Unknown key IMPORTANT NOTE
[junit4] 2> 20873 T104 oass.OpenExchangeRatesOrgProvider$OpenExchangeRates.<init> WARN Expected key, got STRING
[junit4] 2> 20873 T104 oass.OpenExchangeRatesOrgProvider.reload Reloading exchange rates from open-exchange-rates.json
[junit4] 2> 20875 T104 oass.OpenExchangeRatesOrgProvider$OpenExchangeRates.<init> WARN Unknown key IMPORTANT NOTE
[junit4] 2> 20876 T104 oass.OpenExchangeRatesOrgProvider$OpenExchangeRates.<init> WARN Expected key, got STRING
[junit4] 2> 20876 T104 oasc.SolrCore.initDirectoryFactory org.apache.solr.core.MockDirectoryFactory
[junit4] 2> 20876 T104 oasc.SolrCore.<init> [collection1] Opening new SolrCore at ./org.apache.solr.cloud.BasicDistributedZk2Test-jetty1-1392584856001/collection1/, dataDir=./org.apache.solr.cloud.BasicDistributedZk2Test-1392584850811/jetty1/
[junit4] 2> 20877 T104 oasc.JmxMonitoredMap.<init> JMX monitoring is enabled. Adding Solr mbeans to JMX Server: com.sun.jmx.mbeanserver.JmxMBeanServer@6e227cf4
[junit4] 2> 20895 T104 oasc.CachingDirectoryFactory.get return new directory for ./org.apache.solr.cloud.BasicDistributedZk2Test-1392584850811/jetty1
[junit4] 2> 20896 T104 oasc.SolrCore.getNewIndexDir New index directory detected: old=null new=./org.apache.solr.cloud.BasicDistributedZk2Test-1392584850811/jetty1/index/
[junit4] 2> 20896 T104 oasc.SolrCore.initIndex WARN [collection1] Solr index directory './org.apache.solr.cloud.BasicDistributedZk2Test-1392584850811/jetty1/index' doesn't exist. Creating new index...
[junit4] 2> 20896 T104 oasc.CachingDirectoryFactory.get return new directory for ./org.apache.solr.cloud.BasicDistributedZk2Test-1392584850811/jetty1/index
[junit4] 2> 20897 T104 oasu.RandomMergePolicy.<init> RandomMergePolicy wrapping class org.apache.lucene.index.AlcoholicMergePolicy: [AlcoholicMergePolicy: minMergeSize=0, mergeFactor=10, maxMergeSize=1206422031, maxMergeSizeForForcedMerge=9223372036854775807, calibrateSizeByDeletes=true, maxMergeDocs=2147483647, maxCFSSegmentSizeMB=8.796093022207999E12, noCFSRatio=0.1]
[junit4] 2> 20898 T104 oasc.SolrDeletionPolicy.onCommit SolrDeletionPolicy.onCommit: commits: num=1
[junit4] 2> commit{dir=MockDirectoryWrapper(RAMDirectory@748d6ca7 lockFactory=org.apache.lucene.store.SingleInstanceLockFactory@2a69966),segFN=segments_1,generation=1}
[junit4] 2> 20899 T104 oasc.SolrDeletionPolicy.updateCommits newest commit generation = 1
[junit4] 2> 20911 T104 oasup.UpdateRequestProcessorChain.init creating updateRequestProcessorChain "nodistrib"
[junit4] 2> 20912 T104 oasup.UpdateRequestProcessorChain.init creating updateRequestProcessorChain "dedupe"
[junit4] 2> 20912 T104 oasup.UpdateRequestProcessorChain.init inserting DistributedUpdateProcessorFactory into updateRequestProcessorChain "dedupe"
[junit4] 2> 20912 T104 oasup.UpdateRequestProcessorChain.init creating updateRequestProcessorChain "stored_sig"
[junit4] 2> 20913 T104 oasup.UpdateRequestProcessorChain.init inserting DistributedUpdateProcessorFactory into updateRequestProcessorChain "stored_sig"
[junit4] 2> 20913 T104 oasup.UpdateRequestProcessorChain.init creating updateRequestProcessorChain "distrib-dup-test-chain-explicit"
[junit4] 2> 20914 T104 oasup.UpdateRequestProcessorChain.init creating updateRequestProcessorChain "distrib-dup-test-chain-implicit"
[junit4] 2> 20915 T104 oasup.UpdateRequestProcessorChain.init inserting DistributedUpdateProcessorFactory into updateRequestProcessorChain "distrib-dup-test-chain-implicit"
[junit4] 2> 20915 T104 oasc.SolrCore.loadUpdateProcessorChains no updateRequestProcessorChain defined as default, creating implicit default
[junit4] 2> 20917 T104 oasc.RequestHandlers.initHandlersFromConfig created standard: solr.StandardRequestHandler
[junit4] 2> 20918 T104 oasc.RequestHandlers.initHandlersFromConfig created /get: solr.RealTimeGetHandler
[junit4] 2> 20918 T104 oasc.RequestHandlers.initHandlersFromConfig adding lazy requestHandler: solr.ReplicationHandler
[junit4] 2> 20919 T104 oasc.RequestHandlers.initHandlersFromConfig created /replication: solr.ReplicationHandler
[junit4] 2> 20920 T104 oasc.RequestHandlers.initHandlersFromConfig created /update: solr.UpdateRequestHandler
[junit4] 2> 20921 T104 oasc.RequestHandlers.initHandlersFromConfig created /admin/: org.apache.solr.handler.admin.AdminHandlers
[junit4] 2> 20923 T104 oasc.RequestHandlers.initHandlersFromConfig created /admin/file: solr.admin.ShowFileRequestHandler
[junit4] 2> 20926 T104 oashl.XMLLoader.init xsltCacheLifetimeSeconds=60
[junit4] 2> 20930 T104 oasu.CommitTracker.<init> Hard AutoCommit: disabled
[junit4] 2> 20930 T104 oasu.CommitTracker.<init> Soft AutoCommit: disabled
[junit4] 2> 20935 T104 oasu.RandomMergePolicy.<init> RandomMergePolicy wrapping class org.apache.lucene.index.LogByteSizeMergePolicy: [LogByteSizeMergePolicy: minMergeSize=1677721, mergeFactor=20, maxMergeSize=2147483648, maxMergeSizeForForcedMerge=9223372036854775807, calibrateSizeByDeletes=false, maxMergeDocs=2147483647, maxCFSSegmentSizeMB=8.796093022207999E12, noCFSRatio=1.0]
[junit4] 2> 20937 T104 oasc.SolrDeletionPolicy.onInit SolrDeletionPolicy.onInit: commits: num=1
[junit4] 2> commit{dir=MockDirectoryWrapper(RAMDirectory@748d6ca7 lockFactory=org.apache.lucene.store.SingleInstanceLockFactory@2a69966),segFN=segments_1,generation=1}
[junit4] 2> 20938 T104 oasc.SolrDeletionPolicy.updateCommits newest commit generation = 1
[junit4] 2> 20938 T104 oass.SolrIndexSearcher.<init> Opening Searcher@46459a79[collection1] main
[junit4] 2> 20946 T105 oasc.SolrCore.registerSearcher [collection1] Registered new searcher Searcher@46459a79[collection1] main{StandardDirectoryReader(segments_1:1:nrt)}
[junit4] 2> 20952 T104 oasc.CoreContainer.registerCore registering core: collection1
[junit4] 2> 20953 T56 oass.SolrDispatchFilter.init user.dir=/mnt/ssd/jenkins/workspace/Lucene-Solr-4.x-Linux/solr/build/solr-core/test/J1
[junit4] 2> 20953 T56 oass.SolrDispatchFilter.init SolrDispatchFilter.init() done
[junit4] 2> 20953 T108 oasc.ZkController.register Register replica - core:collection1 address:https://127.0.0.1:33794/b collection:collection1 shard:shard2
[junit4] 2> 20955 T108 oascc.SolrZkClient.makePath makePath: /collections/collection1/leader_elect/shard2/election
[junit4] 2> 20977 T108 oasc.ShardLeaderElectionContext.runLeaderProcess Running the leader process for shard shard2
[junit4] 2> 20983 T81 oasc.DistributedQueue$LatchChildWatcher.process LatchChildWatcher fired on path: /overseer/queue state: SyncConnected type NodeChildrenChanged
[junit4] 2> 20983 T81 oasc.DistributedQueue$LatchChildWatcher.process LatchChildWatcher fired on path: /overseer/queue state: SyncConnected type NodeChildrenChanged
[junit4] 2> 20983 T81 oasc.DistributedQueue$LatchChildWatcher.process LatchChildWatcher fired on path: /overseer/queue state: SyncConnected type NodeChildrenChanged
[junit4] 2> 20983 T108 oasc.ShardLeaderElectionContext.waitForReplicasToComeUp Enough replicas found to continue.
[junit4] 2> 20984 T108 oasc.ShardLeaderElectionContext.runLeaderProcess I may be the new leader - try and sync
[junit4] 2> ASYNC NEW_CORE C9 name=collection1 org.apache.solr.core.SolrCore@3c1cf6fb url=https://127.0.0.1:33794/b/collection1 node=127.0.0.1:33794_b C9_STATE=coll:collection1 core:collection1 props:{state=down, base_url=https://127.0.0.1:33794/b, core=collection1, node_name=127.0.0.1:33794_b}
[junit4] 2> 20984 T108 C9 P33794 oasc.SyncStrategy.sync Sync replicas to https://127.0.0.1:33794/b/collection1/
[junit4] 2> 20992 T108 C9 P33794 oasc.SyncStrategy.syncReplicas Sync Success - now sync replicas to me
[junit4] 2> 20992 T108 C9 P33794 oasc.SyncStrategy.syncToMe https://127.0.0.1:33794/b/collection1/ has no replicas
[junit4] 2> 20992 T108 oasc.ShardLeaderElectionContext.runLeaderProcess I am the new leader: https://127.0.0.1:33794/b/collection1/ shard2
[junit4] 2> 20993 T108 oascc.SolrZkClient.makePath makePath: /collections/collection1/leaders/shard2
[junit4] 2> 20993 T82 oascc.ZkStateReader.updateClusterState Updating cloud state from ZooKeeper...
[junit4] 2> 21001 T81 oasc.DistributedQueue$LatchChildWatcher.process LatchChildWatcher fired on path: /overseer/queue state: SyncConnected type NodeChildrenChanged
[junit4] 2> 21023 T81 oasc.DistributedQueue$LatchChildWatcher.process LatchChildWatcher fired on path: /overseer/queue state: SyncConnected type NodeChildrenChanged
[junit4] 2> 21029 T81 oasc.DistributedQueue$LatchChildWatcher.process LatchChildWatcher fired on path: /overseer/queue state: SyncConnected type NodeChildrenChanged
[junit4] 2> 21039 T90 oascc.ZkStateReader$2.process A cluster state change: WatchedEvent state:SyncConnected type:NodeDataChanged path:/clusterstate.json, has occurred - updating... (live nodes size: 2)
[junit4] 2> 21039 T81 oascc.ZkStateReader$2.process A cluster state change: WatchedEvent state:SyncConnected type:NodeDataChanged path:/clusterstate.json, has occurred - updating... (live nodes size: 2)
[junit4] 2> 21041 T103 oascc.ZkStateReader$2.process A cluster state change: WatchedEvent state:SyncConnected type:NodeDataChanged path:/clusterstate.json, has occurred - updating... (live nodes size: 2)
[junit4] 2> 21075 T108 oasc.ZkController.register We are https://127.0.0.1:33794/b/collection1/ and leader is https://127.0.0.1:33794/b/collection1/
[junit4] 2> 21076 T108 oasc.ZkController.register No LogReplay needed for core=collection1 baseURL=https://127.0.0.1:33794/b
[junit4] 2> 21076 T108 oasc.ZkController.checkRecovery I am the leader, no recovery necessary
[junit4] 2> 21076 T108 oasc.ZkController.publish publishing core=collection1 state=active
[junit4] 2> 21076 T108 oasc.ZkController.publish numShards not found on descriptor - reading it from system property
[junit4] 2> 21078 T81 oasc.DistributedQueue$LatchChildWatcher.process LatchChildWatcher fired on path: /overseer/queue state: SyncConnected type NodeChildrenChanged
[junit4] 2> 21079 T108 oascc.ZkStateReader.updateClusterState Updating cloud state from ZooKeeper...
[junit4] 2> 21081 T82 oascc.ZkStateReader.updateClusterState Updating cloud state from ZooKeeper...
[junit4] 2> 21083 T82 oasc.Overseer$ClusterStateUpdater.updateState Update state numShards=2 message={
[junit4] 2> "operation":"state",
[junit4] 2> "state":"active",
[junit4] 2> "base_url":"https://127.0.0.1:33794/b",
[junit4] 2> "core":"collection1",
[junit4] 2> "roles":null,
[junit4] 2> "node_name":"127.0.0.1:33794_b",
[junit4] 2> "shard":"shard2",
[junit4] 2> "shard_range":null,
[junit4] 2> "shard_state":"active",
[junit4] 2> "shard_parent":null,
[junit4] 2> "collection":"collection1",
[junit4] 2> "numShards":"2",
[junit4] 2> "core_node_name":"core_node1"}
[junit4] 2> 21087 T81 oasc.DistributedQueue$LatchChildWatcher.process LatchChildWatcher fired on path: /overseer/queue state: SyncConnected type NodeChildrenChanged
[junit4] 2> 21145 T56 oasc.AbstractFullDistribZkTestBase.createJettys create jetty 2
[junit4] 2> 21147 T56 oejs.Server.doStart jetty-8.1.10.v20130312
[junit4] 2> 21154 T56 oejus.SslContextFactory.doStart Enabled Protocols [SSLv2Hello, SSLv3, TLSv1, TLSv1.1, TLSv1.2] of [SSLv2Hello, SSLv3, TLSv1, TLSv1.1, TLSv1.2]
[junit4] 2> 21158 T56 oejs.AbstractConnector.doStart Started SslSelectChannelConnector@127.0.0.1:59585
[junit4] 2> 21164 T56 oass.SolrDispatchFilter.init SolrDispatchFilter.init()
[junit4] 2> 21165 T56 oasc.SolrResourceLoader.locateSolrHome JNDI not configured for solr (NoInitialContextEx)
[junit4] 2> 21165 T56 oasc.SolrResourceLoader.locateSolrHome using system property solr.solr.home: ./org.apache.solr.cloud.BasicDistributedZk2Test-jetty2-1392584858815
[junit4] 2> 21166 T56 oasc.SolrResourceLoader.<init> new SolrResourceLoader for directory: './org.apache.solr.cloud.BasicDistributedZk2Test-jetty2-1392584858815/'
[junit4] 2> 21184 T56 oasc.ConfigSolr.fromFile Loading container configuration from /mnt/ssd/jenkins/workspace/Lucene-Solr-4.x-Linux/solr/build/solr-core/test/J1/./org.apache.solr.cloud.BasicDistributedZk2Test-jetty2-1392584858815/solr.xml
[junit4] 2> 21190 T81 oascc.ZkStateReader$2.process A c
[...truncated too long message...]
Closing directory: ./org.apache.solr.TestDistributedSearch-1392585729751/shard0/data/index
[junit4] 2> 896744 T4000 oejsh.ContextHandler.doStop stopped o.e.j.s.ServletContextHandler{/phjqd,null}
[junit4] 2> 896816 T4000 oasc.CoreContainer.shutdown Shutting down CoreContainer instance=1844518859
[junit4] 2> 896817 T4000 oasc.SolrCore.close [collection1] CLOSING SolrCore org.apache.solr.core.SolrCore@517dca96
[junit4] 2> 896826 T4000 oasu.DirectUpdateHandler2.close closing DirectUpdateHandler2{commits=2,autocommits=0,soft autocommits=0,optimizes=0,rollbacks=0,expungeDeletes=0,docsPending=0,adds=0,deletesById=0,deletesByQuery=0,errors=0,cumulative_adds=34,cumulative_deletesById=0,cumulative_deletesByQuery=1,cumulative_errors=0,transaction_logs_total_size=8704,transaction_logs_total_number=2}
[junit4] 2> 896827 T4000 oasu.SolrCoreState.decrefSolrCoreState Closing SolrCoreState
[junit4] 2> 896827 T4000 oasu.DefaultSolrCoreState.closeIndexWriter SolrCoreState ref count has reached 0 - closing IndexWriter
[junit4] 2> 896827 T4000 oasu.DefaultSolrCoreState.closeIndexWriter closing IndexWriter with IndexWriterCloser
[junit4] 2> 896828 T4000 oasc.SolrCore.closeSearcher [collection1] Closing main searcher on request.
[junit4] 2> 896828 T4000 oasc.CachingDirectoryFactory.close Closing MockDirectoryFactory - 2 directories currently being tracked
[junit4] 2> 896829 T4000 oasc.CachingDirectoryFactory.closeCacheValue looking to close ./org.apache.solr.TestDistributedSearch-1392585729751/shard1/data [CachedDir<<refCount=0;path=./org.apache.solr.TestDistributedSearch-1392585729751/shard1/data;done=false>>]
[junit4] 2> 896829 T4000 oasc.CachingDirectoryFactory.close Closing directory: ./org.apache.solr.TestDistributedSearch-1392585729751/shard1/data
[junit4] 2> 896829 T4000 oasc.CachingDirectoryFactory.closeCacheValue looking to close ./org.apache.solr.TestDistributedSearch-1392585729751/shard1/data/index [CachedDir<<refCount=0;path=./org.apache.solr.TestDistributedSearch-1392585729751/shard1/data/index;done=false>>]
[junit4] 2> 896829 T4000 oasc.CachingDirectoryFactory.close Closing directory: ./org.apache.solr.TestDistributedSearch-1392585729751/shard1/data/index
[junit4] 2> 896831 T4000 oejsh.ContextHandler.doStop stopped o.e.j.s.ServletContextHandler{/phjqd,null}
[junit4] 2> 896892 T4000 oas.SolrTestCaseJ4.tearDown ###Ending testDistribSearch
[junit4] 2> NOTE: reproduce with: ant test -Dtestcase=TestDistributedSearch -Dtests.method=testDistribSearch -Dtests.seed=B8AAAD58FF4DF506 -Dtests.multiplier=3 -Dtests.slow=true -Dtests.locale=sr_ME -Dtests.timezone=Asia/Thimphu -Dtests.file.encoding=ISO-8859-1
[junit4] ERROR 5.95s J0 | TestDistributedSearch.testDistribSearch <<<
[junit4] > Throwable #1: org.apache.solr.client.solrj.impl.HttpSolrServer$RemoteSolrException: Expected mime type application/octet-stream but got text/html. <html>
[junit4] > <head>
[junit4] > <meta http-equiv="Content-Type" content="text/html;charset=ISO-8859-1"/>
[junit4] > <title>Error 500 Server Error</title>
[junit4] > </head>
[junit4] > <body>
[junit4] > <h2>HTTP ERROR: 500</h2>
[junit4] > <p>Problem accessing /phjqd/select. Reason:
[junit4] > <pre> Server Error</pre></p>
[junit4] > <hr /><i><small>Powered by Jetty://</small></i>
[junit4] >
[junit4] >
[junit4] >
[junit4] >
[junit4] >
[junit4] >
[junit4] >
[junit4] >
[junit4] >
[junit4] >
[junit4] >
[junit4] >
[junit4] >
[junit4] >
[junit4] >
[junit4] >
[junit4] >
[junit4] >
[junit4] >
[junit4] >
[junit4] > </body>
[junit4] > </html>
[junit4] > at __randomizedtesting.SeedInfo.seed([B8AAAD58FF4DF506:394C23408812953A]:0)
[junit4] > at org.apache.solr.client.solrj.impl.HttpSolrServer.request(HttpSolrServer.java:459)
[junit4] > at org.apache.solr.client.solrj.impl.HttpSolrServer.request(HttpSolrServer.java:199)
[junit4] > at org.apache.solr.client.solrj.request.QueryRequest.process(QueryRequest.java:90)
[junit4] > at org.apache.solr.client.solrj.SolrServer.query(SolrServer.java:301)
[junit4] > at org.apache.solr.BaseDistributedSearchTestCase.queryServer(BaseDistributedSearchTestCase.java:515)
[junit4] > at org.apache.solr.BaseDistributedSearchTestCase.query(BaseDistributedSearchTestCase.java:563)
[junit4] > at org.apache.solr.BaseDistributedSearchTestCase.query(BaseDistributedSearchTestCase.java:545)
[junit4] > at org.apache.solr.BaseDistributedSearchTestCase.query(BaseDistributedSearchTestCase.java:524)
[junit4] > at org.apache.solr.TestDistributedSearch.doTest(TestDistributedSearch.java:177)
[junit4] > at org.apache.solr.BaseDistributedSearchTestCase.testDistribSearch(BaseDistributedSearchTestCase.java:876)
[junit4] > at java.lang.Thread.run(Thread.java:744)
[junit4] 2> 896899 T4000 oas.SolrTestCaseJ4.deleteCore ###deleteCore
[junit4] 2> NOTE: test params are: codec=Lucene45, sim=DefaultSimilarity, locale=sr_ME, timezone=Asia/Thimphu
[junit4] 2> NOTE: Linux 3.8.0-35-generic amd64/Oracle Corporation 1.8.0 (64-bit)/cpus=8,threads=1,free=150661880,total=536870912
[junit4] 2> NOTE: All tests run in this JVM: [TestSuggestSpellingConverter, TestSimpleQParserPlugin, QueryElevationComponentTest, CircularListTest, HdfsChaosMonkeySafeLeaderTest, TestConfig, FieldMutatingUpdateProcessorTest, TestRandomDVFaceting, RecoveryZkTest, SpellPossibilityIteratorTest, TestAnalyzeInfixSuggestions, HdfsDirectoryTest, TestRandomMergePolicy, TestQueryUtils, WordBreakSolrSpellCheckerTest, SliceStateTest, SynonymTokenizerTest, AnalysisAfterCoreReloadTest, TestLuceneMatchVersion, PolyFieldTest, TestFieldTypeResource, CustomCollectionTest, UpdateParamsTest, TermVectorComponentTest, TestJoin, TestDistribDocBasedVersion, ChangedSchemaMergeTest, TestLFUCache, RegexBoostProcessorTest, MoreLikeThisHandlerTest, TestSystemIdResolver, TestNonNRTOpen, TestLRUCache, QueryEqualityTest, TestPseudoReturnFields, IndexSchemaTest, TestCopyFieldCollectionResource, ParsingFieldUpdateProcessorsTest, TestValueSourceCache, InfoHandlerTest, TestSolrQueryParser, SuggesterTest, SuggesterFSTTest, CoreAdminCreateDiscoverTest, TestGroupingSearch, ShowFileRequestHandlerTest, DistributedQueryElevationComponentTest, PeerSyncTest, TestElisionMultitermQuery, TestBlendedInfixSuggestions, CursorPagingTest, CSVRequestHandlerTest, SolrInfoMBeanTest, AutoCommitTest, SOLR749Test, TestStressVersions, TestFieldCollectionResource, TestRealTimeGet, TestPostingsSolrHighlighter, TestCoreContainer, ShardRoutingTest, TestMergePolicyConfig, StressHdfsTest, AddSchemaFieldsUpdateProcessorFactoryTest, SystemInfoHandlerTest, DOMUtilTest, LeaderElectionTest, TestCharFilters, TestClassNameShortening, TestPHPSerializedResponseWriter, TestSchemaSimilarityResource, TestTrie, TestSearchPerf, TestSurroundQueryParser, DistribCursorPagingTest, SolrCoreTest, TestHighlightDedupGrouping, BasicDistributedZkTest, ZkControllerTest, OverseerCollectionProcessorTest, BadCopyFieldTest, TestSolrQueryParserResource, SimpleFacetsTest, TestStandardQParsers, DistributedTermsComponentTest, TestSort, CoreAdminHandlerTest, MBeansHandlerTest, UnloadDistributedZkTest, SyncSliceTest, OpenCloseCoreStressTest, LeaderElectionIntegrationTest, TestReplicationHandler, ClusterStateUpdateTest, ZkSolrClientTest, ShardRoutingCustomTest, SliceStateUpdateTest, TestDistributedSearch]
[junit4] Completed on J0 in 5.97s, 1 test, 1 error <<< FAILURES!
[...truncated 524 lines...]
BUILD FAILED
/mnt/ssd/jenkins/workspace/Lucene-Solr-4.x-Linux/build.xml:459: The following error occurred while executing this line:
/mnt/ssd/jenkins/workspace/Lucene-Solr-4.x-Linux/build.xml:439: The following error occurred while executing this line:
/mnt/ssd/jenkins/workspace/Lucene-Solr-4.x-Linux/build.xml:39: The following error occurred while executing this line:
/mnt/ssd/jenkins/workspace/Lucene-Solr-4.x-Linux/extra-targets.xml:37: The following error occurred while executing this line:
/mnt/ssd/jenkins/workspace/Lucene-Solr-4.x-Linux/solr/build.xml:189: The following error occurred while executing this line:
/mnt/ssd/jenkins/workspace/Lucene-Solr-4.x-Linux/solr/common-build.xml:491: The following error occurred while executing this line:
/mnt/ssd/jenkins/workspace/Lucene-Solr-4.x-Linux/lucene/common-build.xml:1308: The following error occurred while executing this line:
/mnt/ssd/jenkins/workspace/Lucene-Solr-4.x-Linux/lucene/common-build.xml:941: There were test failures: 362 suites, 1563 tests, 5 errors, 35 ignored (7 assumptions)
Total time: 47 minutes 7 seconds
Build step 'Invoke Ant' marked build as failure
Description set: Java: 64bit/jdk1.8.0-fcs-b129 -XX:-UseCompressedOops -XX:+UseG1GC
Archiving artifacts
Recording test results
Email was triggered for: Failure
Sending email for trigger: Failure