You are viewing a plain text version of this content. The canonical link for it is here.
Posted to builds@cassandra.apache.org by Apache Jenkins Server <je...@builds.apache.org> on 2026/02/26 04:27:32 UTC
Build complete: Cassandra-trunk #2411 [UNSTABLE] d41a4f7b70477c48d1886e2678c8a819a3e6821e
-------------------------------------------------------------------------------
Build Cassandra-trunk #2411 Still unstable
URL: https://ci-cassandra.apache.org/job/Cassandra-trunk/2411/
-------------------------------------------------------------------------------
Changes:
[jchovati] No need to evict already prepared statements, as it creates a race
[jchovati] No need to evict already prepared statements, as it creates a race
[Stefan Miklosovic] Update maven-shade-plugin to version 3.6.1
-------------------------------------------------------------------------------
Failed Tests:
75 tests failed.
FAILED: dtest-large-latest.replace_address_test.TestReplaceAddress.Tests / dtest-large-latest jdk21 3/6 / test_replace_stopped_node_same_address
FAILED: dtest-latest.bootstrap_test.TestBootstrap.Tests / dtest-latest jdk21 15/64 / test_decommissioned_wiped_node_can_join
FAILED: dtest-latest.bootstrap_test.TestBootstrap.Tests / dtest-latest jdk11 15/64 / test_decommissioned_wiped_node_can_join
FAILED: dtest-latest.bootstrap_test.TestBootstrap.Tests / dtest-latest jdk21 2/64 / test_read_from_bootstrapped_node
FAILED: dtest-latest.materialized_views_test.TestMaterializedViews.Tests / dtest-latest jdk11 46/64 / test_drop_mv
FAILED: dtest-latest.materialized_views_test.TestMaterializedViews.Tests / dtest-latest jdk11 63/64 / test_drop_with_stopped_build
FAILED: dtest-latest.secondary_indexes_test.TestSecondaryIndexes.Tests / dtest-latest jdk11 63/64 / test_6924_dropping_ks
FAILED: dtest-novnode.materialized_views_test.TestMaterializedViews.Tests / dtest-novnode jdk21 42/64 / test_view_metadata_cleanup
FAILED: dtest-novnode.pushed_notifications_test.TestPushedNotifications.Tests / dtest-novnode jdk17 56/64 / test_move_single_node_localhost
FAILED: dtest-upgrade.upgrade_tests.bootstrap_upgrade_test.TestBootstrapUpgrade.Tests / dtest-upgrade jdk11 18/160 / test_shutdown_wiped_node_cannot_join
FAILED: dtest-upgrade.upgrade_tests.cql_tests.TestCQLNodes2RF1_Upgrade_current_5_0_x_To_indev_trunk.Tests / dtest-upgrade jdk11 43/160 / test_multiordering
FAILED: dtest-upgrade.upgrade_tests.cql_tests.TestCQLNodes2RF1_Upgrade_indev_4_0_x_To_indev_trunk.Tests / dtest-upgrade jdk11 36/160 / test_edge_2i_on_complex_pk
FAILED: dtest-upgrade.upgrade_tests.cql_tests.TestCQLNodes2RF1_Upgrade_indev_4_0_x_To_indev_trunk.Tests / dtest-upgrade jdk11 43/160 / test_empty_blob
FAILED: dtest-upgrade.upgrade_tests.cql_tests.TestCQLNodes2RF1_Upgrade_indev_4_1_x_To_indev_trunk.Tests / dtest-upgrade jdk11 43/160 / test_map_keys_indexing
FAILED: dtest-upgrade.upgrade_tests.cql_tests.TestCQLNodes2RF1_Upgrade_indev_5_0_x_To_indev_trunk.Tests / dtest-upgrade jdk11 43/160 / test_static_with_empty_clustering
FAILED: dtest-upgrade.upgrade_tests.cql_tests.TestCQLNodes3RF3_Upgrade_current_5_0_x_To_indev_trunk.Tests / dtest-upgrade jdk11 43/160 / test_select_with_alias
FAILED: dtest-upgrade.upgrade_tests.cql_tests.TestCQLNodes3RF3_Upgrade_indev_4_0_x_To_indev_trunk.Tests / dtest-upgrade jdk11 43/160 / test_select_count_paging
FAILED: dtest-upgrade.upgrade_tests.cql_tests.TestCQLNodes3RF3_Upgrade_indev_4_1_x_To_indev_trunk.Tests / dtest-upgrade jdk11 43/160 / test_SIM_assertion_error
FAILED: dtest-upgrade.upgrade_tests.paging_test.TestPagingDataNodes3RF3_Upgrade_indev_4_0_x_To_indev_trunk.Tests / dtest-upgrade jdk11 43/160 / test_paging_a_single_wide_row
FAILED: dtest-upgrade.upgrade_tests.paging_test.TestPagingWithDeletionsNodes3RF3_Upgrade_indev_5_0_x_To_indev_trunk.Tests / dtest-upgrade jdk11 43/160 / test_multiple_cell_deletions
FAILED: dtest.bootstrap_test.TestBootstrap.Tests / dtest jdk21 15/64 / test_decommissioned_wiped_node_can_join
FAILED: dtest.bootstrap_test.TestBootstrap.Tests / dtest jdk21 13/64 / test_shutdown_wiped_node_cannot_join
FAILED: dtest.materialized_views_test.TestMaterializedViews.Tests / dtest jdk17 63/64 / test_drop_with_stopped_build
FAILED: dtest.repair_tests.repair_test.TestRepair.Tests / dtest jdk21 10/64 / test_dead_sync_initiator
FAILED: dtest.replace_address_test.TestReplaceAddress.Tests / dtest jdk11 18/64 / test_fail_without_replace
FAILED: dtest.secondary_indexes_test.TestSecondaryIndexes.Tests / dtest jdk17 63/64 / test_6924_dropping_ks
FAILED: org.apache.cassandra.db.commitlog.BatchCommitLogTest.Tests / test-oa jdk11 13/20 / testBatchCLShutDownImmediately[1]-oa_jdk11_x86_64
FAILED: org.apache.cassandra.db.compaction.CompactionsBytemanTest.Tests / test-compression jdk11 1/20 / testSSTableNotEnoughDiskSpaceForCompactionGetsDropped-compression_jdk11_x86_64
FAILED: org.apache.cassandra.db.compaction.CompactionsBytemanTest.Tests / test-system-keyspace-directory jdk17 1/20 / testSSTableNotEnoughDiskSpaceForCompactionGetsDropped-system_keyspace_directory_jdk17_x86_64
FAILED: org.apache.cassandra.distributed.test.accord.AccordWriteInteroperabilityTest.Tests / jvm-dtest jdk11 13/16 / testTransactionStatementApplyIsInteropApply[transactionalMode=test_interop_read, migrated=firstPhase]-_jdk11_x86_64
FAILED: org.apache.cassandra.distributed.test.accord.MigrationFromAccordWriteRaceTest.Tests / jvm-dtest jdk17 5/16 / testSplitAndRetryNonSerialLoggedBatchTwoTablesTwoPkeyHintedViaBatchLogRoutingFailure-_jdk17_x86_64
FAILED: org.apache.cassandra.distributed.test.jmx.JMXGetterCheckTest.Tests / jvm-dtest jdk17 16/16 / testGetters-_jdk17_x86_64
FAILED: org.apache.cassandra.hints.HintsServiceTest.Tests / test-system-keyspace-directory jdk21 16/20 / testPageSeek-system_keyspace_directory_jdk21_x86_64
FAILED: org.apache.cassandra.repair.autorepair.AutoRepairParameterizedTest.Tests / test-latest jdk17 19/20 / testTableAttribute[repairType=PREVIEW_REPAIRED]-cassandra.testtag_IS_UNDEFINED
FAILED: org.apache.cassandra.transport.DriverBurnTest.Tests / test-burn jdk17 1/4 / measureLargeV6-cassandra.testtag_IS_UNDEFINED
FAILED: dtest.bootstrap_test.TestBootstrap.Tests / dtest jdk11 15/64 / test_decommissioned_wiped_node_can_join
FAILED: org.apache.cassandra.distributed.test.cql3.MixedReadsAccordInteropMultiNodeTableWalkTest.Tests / jvm-dtest jdk21 13/16 / test-_jdk21_x86_64
FAILED: dtest-latest.bootstrap_test.TestBootstrap.Tests / dtest-latest jdk17 15/64 / test_decommissioned_wiped_node_can_join
FAILED: dtest-novnode.materialized_views_test.TestMaterializedViews.Tests / dtest-novnode jdk17 52/64 / test_drop_mv
FAILED: dtest-upgrade.upgrade_tests.bootstrap_upgrade_test.TestBootstrapUpgrade.Tests / dtest-upgrade jdk11 19/160 / test_killed_wiped_node_cannot_join
FAILED: dtest-latest.bootstrap_test.TestBootstrap.Tests / dtest-latest jdk21 14/64 / test_killed_wiped_node_cannot_join
FAILED: dtest-latest.bootstrap_test.TestBootstrap.Tests / dtest-latest jdk11 2/64 / test_read_from_bootstrapped_node
FAILED: org.apache.cassandra.distributed.test.accord.MigrationFromAccordWriteRaceTest.Tests / jvm-dtest jdk21 5/16 / testSplitAndRetryNonSerialLoggedBatchTwoTablesTwoPkeyHintedViaBatchLogRoutingFailure-_jdk21_x86_64
FAILED: org.apache.cassandra.simulator.test.AccordHarrySimulationTest.Tests / simulator-dtest jdk11 1/2 / test-_jdk11_x86_64
FAILED: org.apache.cassandra.simulator.test.ShortAccordSimulationTest.Tests / simulator-dtest jdk11 1/2 / simulationTest-_jdk11_x86_64
FAILED: dtest-latest.bootstrap_test.TestBootstrap.Tests / dtest-latest jdk17 14/64 / test_killed_wiped_node_cannot_join
FAILED: org.apache.cassandra.transport.DriverBurnTest.Tests / test-burn jdk21 1/4 / measureLargeV5-cassandra.testtag_IS_UNDEFINED
FAILED: org.apache.cassandra.simulator.test.HarrySimulatorTest.Tests / simulator-dtest jdk11 2/2 / test-_jdk11_x86_64
FAILED: dtest-novnode.materialized_views_test.TestMaterializedViews.Tests / dtest-novnode jdk21 7/64 / test_mv_with_default_ttl_with_flush
FAILED: dtest.materialized_views_test.TestMaterializedViews.Tests / dtest jdk21 1/64 / test_mv_with_default_ttl_with_flush
FAILED: junit.framework.TestSuite.Tests / jvm-dtest jdk21 5/16 / org.apache.cassandra.distributed.test.accord.MigrationFromAccordWriteRaceTest-_jdk21_x86_64
FAILED: org.apache.cassandra.repair.autorepair.AutoRepairParameterizedTest.Tests / test-system-keyspace-directory jdk21 19/20 / testTooFrequentRepairs[repairType=PREVIEW_REPAIRED]-cassandra.testtag_IS_UNDEFINED
FAILED: org.apache.cassandra.repair.autorepair.AutoRepairParameterizedTest.Tests / test-system-keyspace-directory jdk17 19/20 / testRepairPrimaryRangesByDefault[repairType=PREVIEW_REPAIRED]-cassandra.testtag_IS_UNDEFINED
FAILED: dtest-novnode.materialized_views_test.TestMaterializedViews.Tests / dtest-novnode jdk11 7/64 / test_mv_with_default_ttl_with_flush
FAILED: dtest-novnode.materialized_views_test.TestMaterializedViews.Tests / dtest-novnode jdk17 7/64 / test_mv_with_default_ttl_with_flush
FAILED: dtest.materialized_views_test.TestMaterializedViews.Tests / dtest jdk17 1/64 / test_mv_with_default_ttl_with_flush
FAILED: dtest.materialized_views_test.TestMaterializedViews.Tests / dtest jdk11 1/64 / test_mv_with_default_ttl_with_flush
FAILED: org.apache.cassandra.simulator.test.EpochStressTest.Tests / simulator-dtest jdk11 1/2 / manyEpochsAndAccordConverges-cassandra.testtag_IS_UNDEFINED
FAILED: junit.framework.TestSuite.Tests / jvm-dtest jdk17 5/16 / org.apache.cassandra.distributed.test.accord.MigrationFromAccordWriteRaceTest-_jdk17_x86_64
FAILED: org.apache.cassandra.fuzz.topology.AccordBootstrapTest.Tests / jvm-dtest jdk21 8/16 / terminated successfully-cassandra.testtag_IS_UNDEFINED
FAILED: org.apache.cassandra.fuzz.topology.AccordBootstrapTest.Tests / jvm-dtest jdk11 8/16 / terminated successfully-cassandra.testtag_IS_UNDEFINED
FAILED: org.apache.cassandra.fuzz.topology.AccordBootstrapTest.Tests / jvm-dtest jdk17 8/16 / terminated successfully-cassandra.testtag_IS_UNDEFINED
FAILED: org.apache.cassandra.simulator.test.ShortPaxosSimulationTest.Tests / simulator-dtest jdk11 2/2 / selfReconcileTest-cassandra.testtag_IS_UNDEFINED
FAILED: org.apache.cassandra.index.accord.RouteIndexTest.Tests / test-latest jdk11 3/20 / test-cassandra.testtag_IS_UNDEFINED
FAILED: org.apache.cassandra.index.accord.RouteIndexTest.Tests / test-oa jdk11 3/20 / test-cassandra.testtag_IS_UNDEFINED
FAILED: org.apache.cassandra.index.accord.RouteIndexTest.Tests / test jdk17 3/20 / test-cassandra.testtag_IS_UNDEFINED
FAILED: org.apache.cassandra.index.accord.RouteIndexTest.Tests / test-compression jdk17 3/20 / test-cassandra.testtag_IS_UNDEFINED
FAILED: org.apache.cassandra.index.accord.RouteIndexTest.Tests / test jdk21 3/20 / test-cassandra.testtag_IS_UNDEFINED
FAILED: org.apache.cassandra.index.accord.RouteIndexTest.Tests / test-compression jdk11 3/20 / test-cassandra.testtag_IS_UNDEFINED
FAILED: org.apache.cassandra.index.accord.RouteIndexTest.Tests / test-oa jdk21 3/20 / test-cassandra.testtag_IS_UNDEFINED
FAILED: org.apache.cassandra.index.accord.RouteIndexTest.Tests / test-latest jdk21 3/20 / test-cassandra.testtag_IS_UNDEFINED
FAILED: org.apache.cassandra.index.accord.RouteIndexTest.Tests / test jdk11 3/20 / test-cassandra.testtag_IS_UNDEFINED
FAILED: org.apache.cassandra.index.accord.RouteIndexTest.Tests / test-compression jdk21 3/20 / test-cassandra.testtag_IS_UNDEFINED
FAILED: org.apache.cassandra.distributed.upgrade.ClusterMetadataUpgradeHarryTest.Tests / jvm-dtest-upgrade jdk11 3/6 / simpleUpgradeTest-cassandra.testtag_IS_UNDEFINED
FAILED: org.apache.cassandra.fuzz.sai.MultiNodeSAITest.Tests / jvm-dtest jdk11 4/16 / indexOnlySaiTest-cassandra.testtag_IS_UNDEFINED
-------------------------------------------------------------------------------
For complete test report and logs see https://nightlies.apache.org/cassandra/Cassandra-trunk/2411/