You are viewing a plain text version of this content. The canonical link for it is here.
Posted to dev@sling.apache.org by Apache Jenkins Server <je...@builds.apache.org> on 2014/12/11 19:48:01 UTC

Build failed in Jenkins: sling-trunk-1.8 #529

See <https://builds.apache.org/job/sling-trunk-1.8/529/changes>

Changes:

[jsedding] SLING-4215 - Resource Editor :: Removal of duplicated file content
- patch by Sandro Boehme, thanks!

------------------------------------------
[...truncated 62390 lines...]
[INFO] Apache Sling JSON Library ......................... SUCCESS [3.511s]
[INFO] Apache Sling SLF4J Implementation (Logback) ....... SUCCESS [24.719s]
[INFO] Apache Sling OSGi LogService Implementation ....... SUCCESS [2.220s]
[INFO] Apache Sling MIME type mapping support ............ SUCCESS [3.382s]
[INFO] Apache Sling Commons OSGi support ................. SUCCESS [3.127s]
[INFO] Apache Sling Scheduler Support .................... SUCCESS [2.615s]
[INFO] Apache Sling Testing Utilities .................... SUCCESS [10.939s]
[INFO] Apache Sling Thread Dumper ........................ SUCCESS [2.195s]
[INFO] Apache Sling Thread Support ....................... SUCCESS [2.797s]
[INFO] Apache Sling Authentication Service ............... SUCCESS [3.484s]
[INFO] Apache Sling Form Based Authentication Handler .... SUCCESS [4.872s]
[INFO] Apache Sling Engine Implementation ................ SUCCESS [12.097s]
[INFO] Apache Sling Repository API Bundle ................ SUCCESS [2.217s]
[INFO] Apache Sling JCR Base Bundle ...................... SUCCESS [3.056s]
[INFO] Apache Sling JCR ClassLoader ...................... SUCCESS [2.281s]
[INFO] Apache Sling Initial Content Loader ............... SUCCESS [3.511s]
[INFO] Apache Sling Jackrabbit Embedded Repository ....... SUCCESS [11.341s]
[INFO] Apache Sling Jackrabbit UserManager Support ....... SUCCESS [2.766s]
[INFO] Apache Sling Jackrabbit JSR-283 Access Control Manager Support  SUCCESS [2.396s]
[INFO] Apache Sling Wrapper Bundle for the JCR API ....... SUCCESS [2.052s]
[INFO] Apache Sling JCR Resource Resolver ................ SUCCESS [36.545s]
[INFO] Apache Sling JCR Repository Registration .......... SUCCESS [3.686s]
[INFO] Apache Sling Simple WebDAV Access to repositories . SUCCESS [2.913s]
[INFO] Apache Sling DavEx Access to repositories ......... SUCCESS [3.372s]
[INFO] Apache Sling JCR WebConsole Bundle ................ SUCCESS [2.167s]
[INFO] Apache Sling Oak Repository Server ................ SUCCESS [2.952s]
[INFO] Apache Sling SlingRepository Integration Tests .... SUCCESS [41.979s]
[INFO] Apache Sling Servlet Resolver ..................... SUCCESS [3.897s]
[INFO] Apache Sling Default GET Servlets ................. SUCCESS [3.630s]
[INFO] Apache Sling Default POST Servlets ................ SUCCESS [4.154s]
[INFO] Apache Sling Compat Servlets ...................... SUCCESS [2.335s]
[INFO] Apache Sling Scripting Implementation API ......... SUCCESS [2.257s]
[INFO] Apache Sling Scripting Core implementation ........ SUCCESS [10.726s]
[INFO] Apache Sling Scripting JavaScript Support ......... SUCCESS [8.972s]
[INFO] Apache Sling Scripting JSP Support ................ SUCCESS [5.722s]
[INFO] Apache Sling JSP Tag Library ...................... SUCCESS [4.500s]
[INFO] Apache Sling JSP Standard Tag Library ............. SUCCESS [2.188s]
[INFO] Apache Sling Adapter Manager Implementation ....... SUCCESS [2.971s]
[INFO] Apache Sling Bundle Resource Provider ............. SUCCESS [2.163s]
[INFO] Apache Sling Distributed Event Admin .............. SUCCESS [4.492s]
[INFO] Apache Sling Discovery API ........................ SUCCESS [2.033s]
[INFO] Apache Sling Resource-Based Discovery Service ..... SUCCESS [2:41.472s]
[INFO] Apache Sling Discovery Support Bundle ............. SUCCESS [2.145s]
[INFO] Apache Sling Discovery Standalone Implementation .. SUCCESS [2.172s]
[INFO] Apache Sling Event Support ........................ SUCCESS [11:27.995s]
[INFO] Apache Sling Feature Flags ........................ SUCCESS [2.574s]
[INFO] Apache Sling Filesystem Resource Provider ......... SUCCESS [2.692s]
[INFO] Apache Sling javax.activation bundle .............. SUCCESS [2.482s]
[INFO] Apache Sling Service User Mapper .................. SUCCESS [3.269s]
[INFO] Apache Sling Settings ............................. SUCCESS [3.246s]
[INFO] Apache Sling Web Console Branding ................. SUCCESS [2.253s]
[INFO] Apache Sling Web Console Security Provider ........ SUCCESS [2.490s]
[INFO] Apache Sling Explorer ............................. SUCCESS [2.421s]
[INFO] Apache Sling Health Check Core .................... SUCCESS [13.781s]
[INFO] Apache Sling Health Check Annotations ............. SUCCESS [2.211s]
[INFO] Apache Sling Health Check Samples ................. SUCCESS [3.345s]
[INFO] Apache Sling Health Check Support Components ...... SUCCESS [3.555s]
[INFO] Apache Sling Health Check Webconsole Plugin ....... SUCCESS [2.654s]
[INFO] Apache Sling Health Check JUnit Bridge ............ SUCCESS [3.261s]
[INFO] Apache Sling Health Check Integration Tests ....... SUCCESS [16.068s]
[INFO] Apache Sling Health Check Reactor POM ............. SUCCESS [1.270s]
[INFO] Apache Sling Resource Access Security ............. SUCCESS [2.887s]
[INFO] Apache Sling Resource Access Security Integration Tests  SUCCESS [21.631s]
[INFO] Apache Sling Models API ........................... SUCCESS [2.789s]
[INFO] Apache Sling Models Implementation ................ SUCCESS [6.016s]
[INFO] Apache Sling Test Tools ........................... SUCCESS [3.524s]
[INFO] Apache Sling Models Integration Tests ............. SUCCESS [29.778s]
[INFO] Apache Sling JUnit Core ........................... SUCCESS [3.456s]
[INFO] Apache Sling JUnit Scriptable Tests Provider ...... SUCCESS [3.104s]
[INFO] Apache Sling JUnit Health Checks .................. SUCCESS [3.125s]
[INFO] Apache Sling JUnit Remote Tests Runners ........... SUCCESS [3.192s]
[INFO] Apache Sling JUnit Performance .................... SUCCESS [2.990s]
[INFO] Apache Sling Testing Resource Resolver Mock ....... SUCCESS [2.955s]
[INFO] Apache Sling Testing JCR Mock ..................... SUCCESS [3.740s]
[INFO] Apache Sling Testing OSGi Mock .................... SUCCESS [4.070s]
[INFO] Apache Sling Testing Sling Mock ................... SUCCESS [7.631s]
[INFO] Apache Sling Testing Sling Mock Jackrabbit-based Resource Resolver  SUCCESS [11.511s]
[INFO] Apache Sling Pax Exam Utilities ................... SUCCESS [22.264s]
[INFO] Apache Sling Sample Server-Side Tests ............. SUCCESS [3.451s]
[INFO] Apache Sling Failing Server-Side Tests ............ SUCCESS [3.706s]
[INFO] Apache Sling Launchpad Application Builder ........ SUCCESS [24.457s]
[INFO] Apache Sling Sample Integration Tests ............. SUCCESS [1:06.208s]
[INFO] Apache Sling Testing Modules Reactor .............. SUCCESS [1.530s]
[INFO] Apache Sling Installer ............................ SUCCESS [14.878s]
[INFO] Apache Sling Installer WebConsole Plugin .......... SUCCESS [2.521s]
[INFO] Apache Sling File Installer ....................... SUCCESS [2.383s]
[INFO] Apache Sling JCR Installer ........................ SUCCESS [2:00.154s]
[INFO] Apache Sling Installer Configuration Admin Support  SUCCESS [3.648s]
[INFO] Apache Sling Deployment Package Installer ......... SUCCESS [2.329s]
[INFO] Apache Sling Subsystems Installer ................. SUCCESS [2.463s]
[INFO] Apache Sling Installer Integration Tests .......... SUCCESS [37.976s]
[INFO] Apache Sling Launchpad API ........................ SUCCESS [7.377s]
[INFO] Apache Sling Launchpad Base ....................... SUCCESS [10.786s]
[INFO] Apache Sling Launchpad Installer .................. SUCCESS [1:31.169s]
[INFO] Apache Sling Launchpad Content .................... SUCCESS [2.515s]
[INFO] Apache Sling Launchpad Testing Services ........... SUCCESS [4.804s]
[INFO] Apache Sling Launchpad Testing Services WAR ....... SUCCESS [2.794s]
[INFO] Apache Sling Launchpad Testing Fragment Bundle .... SUCCESS [2.327s]
[INFO] Apache Sling Launchpad Test Bundles ............... SUCCESS [3.158s]
[INFO] Apache Sling Integration Tests .................... FAILURE [0.522s]
[INFO] Apache Sling Launchpad Testing .................... SKIPPED
[INFO] Apache Sling (Builder) ............................ SKIPPED
[INFO] ------------------------------------------------------------------------
[INFO] BUILD FAILURE
[INFO] ------------------------------------------------------------------------
[INFO] Total time: 32:26.488s
[INFO] Finished at: Thu Dec 11 18:46:57 UTC 2014
[INFO] Final Memory: 180M/421M
[INFO] ------------------------------------------------------------------------
[JENKINS] Archiving disabled
[JENKINS] Archiving disabled
[JENKINS] Archiving disabled
[JENKINS] Archiving disabled
[JENKINS] Archiving disabled
[JENKINS] Archiving disabled
[JENKINS] Archiving disabled
[JENKINS] Archiving disabled
[JENKINS] Archiving disabled
[JENKINS] Archiving disabled
[JENKINS] Archiving disabled
[JENKINS] Archiving disabled
[JENKINS] Archiving disabled
[JENKINS] Archiving disabled
[JENKINS] Archiving disabled
[JENKINS] Archiving disabled
[JENKINS] Archiving disabled
[JENKINS] Archiving disabled
[JENKINS] Archiving disabled
[JENKINS] Archiving disabled
[JENKINS] Archiving disabled
[JENKINS] Archiving disabled
[JENKINS] Archiving disabled
[JENKINS] Archiving disabled
[JENKINS] Archiving disabled
[JENKINS] Archiving disabled
[JENKINS] Archiving disabled
[JENKINS] Archiving disabled
[JENKINS] Archiving disabled
[JENKINS] Archiving disabled
[JENKINS] Archiving disabled
[JENKINS] Archiving disabled
[JENKINS] Archiving disabled
[JENKINS] Archiving disabled
[JENKINS] Archiving disabled
[JENKINS] Archiving disabled
[JENKINS] Archiving disabled
[JENKINS] Archiving disabled
[JENKINS] Archiving disabled
[JENKINS] Archiving disabled
[JENKINS] Archiving disabled
[JENKINS] Archiving disabled
[JENKINS] Archiving disabled
[JENKINS] Archiving disabled
[JENKINS] Archiving disabled
[JENKINS] Archiving disabled
[JENKINS] Archiving disabled
[JENKINS] Archiving disabled
[JENKINS] Archiving disabled
[JENKINS] Archiving disabled
[JENKINS] Archiving disabled
[JENKINS] Archiving disabled
[JENKINS] Archiving disabled
[JENKINS] Archiving disabled
[JENKINS] Archiving disabled
[JENKINS] Archiving disabled
[JENKINS] Archiving disabled
[JENKINS] Archiving disabled
[JENKINS] Archiving disabled
[JENKINS] Archiving disabled
[JENKINS] Archiving disabled
[JENKINS] Archiving disabled
[JENKINS] Archiving disabled
[JENKINS] Archiving disabled
[JENKINS] Archiving disabled
[JENKINS] Archiving disabled
[JENKINS] Archiving disabled
[JENKINS] Archiving disabled
[JENKINS] Archiving disabled
[JENKINS] Archiving disabled
[JENKINS] Archiving disabled
[JENKINS] Archiving disabled
[JENKINS] Archiving disabled
[JENKINS] Archiving disabled
[JENKINS] Archiving disabled
[JENKINS] Archiving disabled
[JENKINS] Archiving disabled
[JENKINS] Archiving disabled
[JENKINS] Archiving disabled
[JENKINS] Archiving disabled
[JENKINS] Archiving disabled
[JENKINS] Archiving disabled
[JENKINS] Archiving disabled
[JENKINS] Archiving disabled
[JENKINS] Archiving disabled
[JENKINS] Archiving disabled
[JENKINS] Archiving disabled
[JENKINS] Archiving disabled
[JENKINS] Archiving disabled
[JENKINS] Archiving disabled
[JENKINS] Archiving disabled
[JENKINS] Archiving disabled
[JENKINS] Archiving disabled
[JENKINS] Archiving disabled
[JENKINS] Archiving disabled
[JENKINS] Archiving disabled
[JENKINS] Archiving disabled
[JENKINS] Archiving disabled
[JENKINS] Archiving disabled
[JENKINS] Archiving disabled
[JENKINS] Archiving disabled
[JENKINS] Archiving disabled
[JENKINS] Archiving disabled
[JENKINS] Archiving disabled
[JENKINS] Archiving disabled
[JENKINS] Archiving disabled
[JENKINS] Archiving disabled
[JENKINS] Archiving disabled
[JENKINS] Archiving disabled
[JENKINS] Archiving disabled
[JENKINS] Archiving disabled
[JENKINS] Archiving disabled
[JENKINS] Archiving disabled
[JENKINS] Archiving disabled
[JENKINS] Archiving disabled
[JENKINS] Archiving disabled
[JENKINS] Archiving disabled
[JENKINS] Archiving disabled
[JENKINS] Archiving disabled
[JENKINS] Archiving disabled
[JENKINS] Archiving disabled
[JENKINS] Archiving disabled
[JENKINS] Archiving disabled
[JENKINS] Archiving disabled
[JENKINS] Archiving disabled
[JENKINS] Archiving disabled
Waiting for Jenkins to finish collecting data
[ERROR] Failed to execute goal on project org.apache.sling.launchpad.integration-tests: Could not resolve dependencies for project org.apache.sling:org.apache.sling.launchpad.integration-tests:jar:1.0.1-SNAPSHOT: Could not find artifact org.apache.sling:org.apache.sling.junit.core:jar:1.0.10 in central (http://repo.maven.apache.org/maven2) -> [Help 1]
[ERROR] 
[ERROR] To see the full stack trace of the errors, re-run Maven with the -e switch.
[ERROR] Re-run Maven using the -X switch to enable full debug logging.
[ERROR] 
[ERROR] For more information about the errors and possible solutions, please read the following articles:
[ERROR] [Help 1] http://cwiki.apache.org/confluence/display/MAVEN/DependencyResolutionException
[ERROR] 
[ERROR] After correcting the problems, you can resume the build with the command
[ERROR]   mvn <goals> -rf :org.apache.sling.launchpad.integration-tests
Sending e-mails to: dev@sling.apache.org
Sending e-mails to: dev@sling.apache.org
channel stopped

Jenkins build is back to stable : sling-trunk-1.8 #546

Posted by Apache Jenkins Server <je...@builds.apache.org>.
See <https://builds.apache.org/job/sling-trunk-1.8/546/changes>


Jenkins build is still unstable: sling-trunk-1.8 #545

Posted by Apache Jenkins Server <je...@builds.apache.org>.
See <https://builds.apache.org/job/sling-trunk-1.8/changes>


Jenkins build is still unstable: sling-trunk-1.8 #544

Posted by Apache Jenkins Server <je...@builds.apache.org>.
See <https://builds.apache.org/job/sling-trunk-1.8/changes>


Jenkins build is still unstable: sling-trunk-1.8 #543

Posted by Apache Jenkins Server <je...@builds.apache.org>.
See <https://builds.apache.org/job/sling-trunk-1.8/changes>


Jenkins build is still unstable: sling-trunk-1.8 #542

Posted by Apache Jenkins Server <je...@builds.apache.org>.
See <https://builds.apache.org/job/sling-trunk-1.8/changes>


Jenkins build is still unstable: sling-trunk-1.8 #541

Posted by Apache Jenkins Server <je...@builds.apache.org>.
See <https://builds.apache.org/job/sling-trunk-1.8/changes>


Jenkins build is still unstable: sling-trunk-1.8 #540

Posted by Apache Jenkins Server <je...@builds.apache.org>.
See <https://builds.apache.org/job/sling-trunk-1.8/changes>


Jenkins build is still unstable: sling-trunk-1.8 #539

Posted by Apache Jenkins Server <je...@builds.apache.org>.
See <https://builds.apache.org/job/sling-trunk-1.8/changes>


Jenkins build is still unstable: sling-trunk-1.8 #538

Posted by Apache Jenkins Server <je...@builds.apache.org>.
See <https://builds.apache.org/job/sling-trunk-1.8/changes>


Jenkins build is still unstable: sling-trunk-1.8 #537

Posted by Apache Jenkins Server <je...@builds.apache.org>.
See <https://builds.apache.org/job/sling-trunk-1.8/changes>


Jenkins build is still unstable: sling-trunk-1.8 #536

Posted by Apache Jenkins Server <je...@builds.apache.org>.
See <https://builds.apache.org/job/sling-trunk-1.8/changes>


Jenkins build is unstable: sling-trunk-1.8 #535

Posted by Apache Jenkins Server <je...@builds.apache.org>.
See <https://builds.apache.org/job/sling-trunk-1.8/535/changes>


Build failed in Jenkins: sling-trunk-1.8 #534

Posted by Apache Jenkins Server <je...@builds.apache.org>.
See <https://builds.apache.org/job/sling-trunk-1.8/534/changes>

Changes:

[mpetria] SLING-4153: changing distribution response to a provider interface

------------------------------------------
[...truncated 53023 lines...]
[INFO] Apache Sling SLF4J Implementation (Logback) ....... SUCCESS [25.394s]
[INFO] Apache Sling OSGi LogService Implementation ....... SUCCESS [2.285s]
[INFO] Apache Sling MIME type mapping support ............ SUCCESS [3.623s]
[INFO] Apache Sling Commons OSGi support ................. SUCCESS [3.109s]
[INFO] Apache Sling Scheduler Support .................... SUCCESS [2.728s]
[INFO] Apache Sling Testing Utilities .................... SUCCESS [11.400s]
[INFO] Apache Sling Thread Dumper ........................ SUCCESS [2.268s]
[INFO] Apache Sling Thread Support ....................... SUCCESS [2.904s]
[INFO] Apache Sling Authentication Service ............... SUCCESS [3.742s]
[INFO] Apache Sling Form Based Authentication Handler .... SUCCESS [4.987s]
[INFO] Apache Sling Engine Implementation ................ SUCCESS [14.128s]
[INFO] Apache Sling Repository API Bundle ................ SUCCESS [2.191s]
[INFO] Apache Sling JCR Base Bundle ...................... SUCCESS [3.163s]
[INFO] Apache Sling JCR ClassLoader ...................... SUCCESS [2.617s]
[INFO] Apache Sling Initial Content Loader ............... SUCCESS [3.837s]
[INFO] Apache Sling Jackrabbit Embedded Repository ....... SUCCESS [11.657s]
[INFO] Apache Sling Jackrabbit UserManager Support ....... SUCCESS [2.822s]
[INFO] Apache Sling Jackrabbit JSR-283 Access Control Manager Support  SUCCESS [2.547s]
[INFO] Apache Sling Wrapper Bundle for the JCR API ....... SUCCESS [2.115s]
[INFO] Apache Sling JCR Resource Resolver ................ SUCCESS [28.162s]
[INFO] Apache Sling JCR Repository Registration .......... SUCCESS [3.864s]
[INFO] Apache Sling Simple WebDAV Access to repositories . SUCCESS [3.038s]
[INFO] Apache Sling DavEx Access to repositories ......... SUCCESS [3.463s]
[INFO] Apache Sling JCR WebConsole Bundle ................ SUCCESS [2.558s]
[INFO] Apache Sling Oak Repository Server ................ SUCCESS [3.105s]
[INFO] Apache Sling SlingRepository Integration Tests .... SUCCESS [43.331s]
[INFO] Apache Sling Servlet Resolver ..................... SUCCESS [3.859s]
[INFO] Apache Sling Default GET Servlets ................. SUCCESS [3.792s]
[INFO] Apache Sling Default POST Servlets ................ SUCCESS [4.490s]
[INFO] Apache Sling Compat Servlets ...................... SUCCESS [3.006s]
[INFO] Apache Sling Scripting Implementation API ......... SUCCESS [2.253s]
[INFO] Apache Sling Scripting Core implementation ........ SUCCESS [11.124s]
[INFO] Apache Sling Scripting JavaScript Support ......... SUCCESS [8.771s]
[INFO] Apache Sling Scripting JSP Support ................ SUCCESS [5.940s]
[INFO] Apache Sling JSP Tag Library ...................... SUCCESS [4.662s]
[INFO] Apache Sling JSP Standard Tag Library ............. SUCCESS [2.308s]
[INFO] Apache Sling Adapter Manager Implementation ....... SUCCESS [3.019s]
[INFO] Apache Sling Bundle Resource Provider ............. SUCCESS [2.163s]
[INFO] Apache Sling Distributed Event Admin .............. SUCCESS [4.461s]
[INFO] Apache Sling Discovery API ........................ SUCCESS [2.124s]
[INFO] Apache Sling Resource-Based Discovery Service ..... SUCCESS [2:49.550s]
[INFO] Apache Sling Discovery Support Bundle ............. SUCCESS [2.265s]
[INFO] Apache Sling Discovery Standalone Implementation .. SUCCESS [2.170s]
[INFO] Apache Sling Event Support ........................ SUCCESS [11:35.009s]
[INFO] Apache Sling Feature Flags ........................ SUCCESS [2.345s]
[INFO] Apache Sling Filesystem Resource Provider ......... SUCCESS [2.471s]
[INFO] Apache Sling javax.activation bundle .............. SUCCESS [2.228s]
[INFO] Apache Sling Service User Mapper .................. SUCCESS [3.160s]
[INFO] Apache Sling Settings ............................. SUCCESS [3.048s]
[INFO] Apache Sling Web Console Branding ................. SUCCESS [2.016s]
[INFO] Apache Sling Web Console Security Provider ........ SUCCESS [2.222s]
[INFO] Apache Sling Explorer ............................. SUCCESS [2.123s]
[INFO] Apache Sling Health Check Core .................... SUCCESS [7.777s]
[INFO] Apache Sling Health Check Annotations ............. SUCCESS [2.027s]
[INFO] Apache Sling Health Check Samples ................. SUCCESS [3.150s]
[INFO] Apache Sling Health Check Support Components ...... SUCCESS [3.139s]
[INFO] Apache Sling Health Check Webconsole Plugin ....... SUCCESS [2.235s]
[INFO] Apache Sling Health Check JUnit Bridge ............ SUCCESS [3.174s]
[INFO] Apache Sling Health Check Integration Tests ....... SUCCESS [14.769s]
[INFO] Apache Sling Health Check Reactor POM ............. SUCCESS [1.337s]
[INFO] Apache Sling Resource Access Security ............. SUCCESS [2.476s]
[INFO] Apache Sling Resource Access Security Integration Tests  SUCCESS [20.253s]
[INFO] Apache Sling Models API ........................... SUCCESS [2.387s]
[INFO] Apache Sling Models Implementation ................ SUCCESS [5.544s]
[INFO] Apache Sling Test Tools ........................... SUCCESS [3.261s]
[INFO] Apache Sling Models Integration Tests ............. SUCCESS [24.464s]
[INFO] Apache Sling JUnit Core ........................... SUCCESS [3.845s]
[INFO] Apache Sling JUnit Scriptable Tests Provider ...... SUCCESS [2.932s]
[INFO] Apache Sling JUnit Health Checks .................. SUCCESS [2.715s]
[INFO] Apache Sling JUnit Remote Tests Runners ........... SUCCESS [2.327s]
[INFO] Apache Sling JUnit Performance .................... SUCCESS [2.767s]
[INFO] Apache Sling Testing Resource Resolver Mock ....... SUCCESS [2.898s]
[INFO] Apache Sling Testing JCR Mock ..................... SUCCESS [3.506s]
[INFO] Apache Sling Testing OSGi Mock .................... SUCCESS [3.946s]
[INFO] Apache Sling Testing Sling Mock ................... SUCCESS [6.910s]
[INFO] Apache Sling Testing Sling Mock Jackrabbit-based Resource Resolver  SUCCESS [10.553s]
[INFO] Apache Sling Pax Exam Utilities ................... SUCCESS [19.429s]
[INFO] Apache Sling Sample Server-Side Tests ............. SUCCESS [2.358s]
[INFO] Apache Sling Failing Server-Side Tests ............ SUCCESS [2.173s]
[INFO] Apache Sling Launchpad Application Builder ........ SUCCESS [20.631s]
[INFO] Apache Sling Sample Integration Tests ............. SUCCESS [59.267s]
[INFO] Apache Sling Testing Modules Reactor .............. SUCCESS [1.146s]
[INFO] Apache Sling Installer ............................ SUCCESS [3.717s]
[INFO] Apache Sling Installer WebConsole Plugin .......... SUCCESS [2.140s]
[INFO] Apache Sling File Installer ....................... SUCCESS [2.099s]
[INFO] Apache Sling JCR Installer ........................ SUCCESS [1:54.746s]
[INFO] Apache Sling Installer Configuration Admin Support  SUCCESS [2.133s]
[INFO] Apache Sling Deployment Package Installer ......... SUCCESS [2.077s]
[INFO] Apache Sling Subsystems Installer ................. SUCCESS [2.121s]
[INFO] Apache Sling Installer Integration Tests .......... SUCCESS [37.344s]
[INFO] Apache Sling Launchpad API ........................ SUCCESS [2.026s]
[INFO] Apache Sling Launchpad Base ....................... SUCCESS [10.507s]
[INFO] Apache Sling Launchpad Installer .................. SUCCESS [2:29.449s]
[INFO] Apache Sling Launchpad Content .................... SUCCESS [2.049s]
[INFO] Apache Sling Launchpad Testing Services ........... SUCCESS [4.308s]
[INFO] Apache Sling Launchpad Testing Services WAR ....... SUCCESS [2.567s]
[INFO] Apache Sling Launchpad Testing Fragment Bundle .... SUCCESS [2.116s]
[INFO] Apache Sling Launchpad Test Bundles ............... SUCCESS [2.710s]
[INFO] Apache Sling Integration Tests .................... FAILURE [0.212s]
[INFO] Apache Sling Launchpad Testing .................... SKIPPED
[INFO] Apache Sling (Builder) ............................ SKIPPED
[INFO] ------------------------------------------------------------------------
[INFO] BUILD FAILURE
[INFO] ------------------------------------------------------------------------
[INFO] Total time: 32:30.110s
[INFO] Finished at: Mon Dec 15 13:15:50 UTC 2014
[INFO] Final Memory: 177M/460M
[INFO] ------------------------------------------------------------------------
[JENKINS] Archiving disabled
[JENKINS] Archiving disabled
[JENKINS] Archiving disabled
[JENKINS] Archiving disabled
[JENKINS] Archiving disabled
[JENKINS] Archiving disabled
[JENKINS] Archiving disabled
[JENKINS] Archiving disabled
[JENKINS] Archiving disabled
[JENKINS] Archiving disabled
[JENKINS] Archiving disabled
[JENKINS] Archiving disabled
[JENKINS] Archiving disabled
[JENKINS] Archiving disabled
[JENKINS] Archiving disabled
[JENKINS] Archiving disabled
[JENKINS] Archiving disabled
[JENKINS] Archiving disabled
[JENKINS] Archiving disabled
[JENKINS] Archiving disabled
[JENKINS] Archiving disabled
[JENKINS] Archiving disabled
[JENKINS] Archiving disabled
[JENKINS] Archiving disabled
[JENKINS] Archiving disabled
[JENKINS] Archiving disabled
[JENKINS] Archiving disabled
[JENKINS] Archiving disabled
[JENKINS] Archiving disabled
[JENKINS] Archiving disabled
[JENKINS] Archiving disabled
[JENKINS] Archiving disabled
[JENKINS] Archiving disabled
[JENKINS] Archiving disabled
[JENKINS] Archiving disabled
[JENKINS] Archiving disabled
[JENKINS] Archiving disabled
[JENKINS] Archiving disabled
[JENKINS] Archiving disabled
[JENKINS] Archiving disabled
[JENKINS] Archiving disabled
[JENKINS] Archiving disabled
[JENKINS] Archiving disabled
[JENKINS] Archiving disabled
[JENKINS] Archiving disabled
[JENKINS] Archiving disabled
[JENKINS] Archiving disabled
[JENKINS] Archiving disabled
[JENKINS] Archiving disabled
[JENKINS] Archiving disabled
[JENKINS] Archiving disabled
[JENKINS] Archiving disabled
[JENKINS] Archiving disabled
[JENKINS] Archiving disabled
[JENKINS] Archiving disabled
[JENKINS] Archiving disabled
[JENKINS] Archiving disabled
[JENKINS] Archiving disabled
[JENKINS] Archiving disabled
[JENKINS] Archiving disabled
[JENKINS] Archiving disabled
[JENKINS] Archiving disabled
[JENKINS] Archiving disabled
[JENKINS] Archiving disabled
[JENKINS] Archiving disabled
[JENKINS] Archiving disabled
[JENKINS] Archiving disabled
[JENKINS] Archiving disabled
[JENKINS] Archiving disabled
[JENKINS] Archiving disabled
[JENKINS] Archiving disabled
[JENKINS] Archiving disabled
[JENKINS] Archiving disabled
[JENKINS] Archiving disabled
[JENKINS] Archiving disabled
[JENKINS] Archiving disabled
[JENKINS] Archiving disabled
[JENKINS] Archiving disabled
[JENKINS] Archiving disabled
[JENKINS] Archiving disabled
[JENKINS] Archiving disabled
[JENKINS] Archiving disabled
[JENKINS] Archiving disabled
[JENKINS] Archiving disabled
[JENKINS] Archiving disabled
[JENKINS] Archiving disabled
[JENKINS] Archiving disabled
[JENKINS] Archiving disabled
[JENKINS] Archiving disabled
[JENKINS] Archiving disabled
[JENKINS] Archiving disabled
[JENKINS] Archiving disabled
[JENKINS] Archiving disabled
[JENKINS] Archiving disabled
[JENKINS] Archiving disabled
[JENKINS] Archiving disabled
[JENKINS] Archiving disabled
[JENKINS] Archiving disabled
[JENKINS] Archiving disabled
[JENKINS] Archiving disabled
[JENKINS] Archiving disabled
[JENKINS] Archiving disabled
[JENKINS] Archiving disabled
[JENKINS] Archiving disabled
[JENKINS] Archiving disabled
[JENKINS] Archiving disabled
[JENKINS] Archiving disabled
[JENKINS] Archiving disabled
[JENKINS] Archiving disabled
[JENKINS] Archiving disabled
[JENKINS] Archiving disabled
[JENKINS] Archiving disabled
[JENKINS] Archiving disabled
[JENKINS] Archiving disabled
[JENKINS] Archiving disabled
[JENKINS] Archiving disabled
[JENKINS] Archiving disabled
[JENKINS] Archiving disabled
[JENKINS] Archiving disabled
[JENKINS] Archiving disabled
[JENKINS] Archiving disabled
[JENKINS] Archiving disabled
[JENKINS] Archiving disabled
[JENKINS] Archiving disabled
[JENKINS] Archiving disabled
[JENKINS] Archiving disabled
Waiting for Jenkins to finish collecting data[ERROR] Failed to execute goal on project org.apache.sling.launchpad.integration-tests: Could not resolve dependencies for project org.apache.sling:org.apache.sling.launchpad.integration-tests:jar:1.0.1-SNAPSHOT: Could not find artifact org.apache.sling:org.apache.sling.junit.core:jar:1.0.10 in central (http://repo.maven.apache.org/maven2) -> [Help 1]
[ERROR] 
[ERROR] To see the full stack trace of the errors, re-run Maven with the -e switch.
[ERROR] Re-run Maven using the -X switch to enable full debug logging.
[ERROR] 
[ERROR] For more information about the errors and possible solutions, please read the following articles:
[ERROR] [Help 1] http://cwiki.apache.org/confluence/display/MAVEN/DependencyResolutionException
[ERROR] 
[ERROR] After correcting the problems, you can resume the build with the command
[ERROR]   mvn <goals> -rf :org.apache.sling.launchpad.integration-tests

Sending e-mails to: dev@sling.apache.org
Sending e-mails to: dev@sling.apache.org
Sending e-mails to: dev@sling.apache.org
channel stopped

Build failed in Jenkins: sling-trunk-1.8 #533

Posted by Apache Jenkins Server <je...@builds.apache.org>.
See <https://builds.apache.org/job/sling-trunk-1.8/533/changes>

Changes:

[cziegeler] SLING-4246 : Update to latest http service release

------------------------------------------
[...truncated 53177 lines...]
[INFO] Apache Sling OSGi LogService Implementation ....... SUCCESS [2.446s]
[INFO] Apache Sling MIME type mapping support ............ SUCCESS [3.597s]
[INFO] Apache Sling Commons OSGi support ................. SUCCESS [3.318s]
[INFO] Apache Sling Scheduler Support .................... SUCCESS [2.740s]
[INFO] Apache Sling Testing Utilities .................... SUCCESS [11.132s]
[INFO] Apache Sling Thread Dumper ........................ SUCCESS [2.165s]
[INFO] Apache Sling Thread Support ....................... SUCCESS [2.796s]
[INFO] Apache Sling Authentication Service ............... SUCCESS [3.539s]
[INFO] Apache Sling Form Based Authentication Handler .... SUCCESS [5.024s]
[INFO] Apache Sling Engine Implementation ................ SUCCESS [12.587s]
[INFO] Apache Sling Repository API Bundle ................ SUCCESS [2.119s]
[INFO] Apache Sling JCR Base Bundle ...................... SUCCESS [3.198s]
[INFO] Apache Sling JCR ClassLoader ...................... SUCCESS [2.423s]
[INFO] Apache Sling Initial Content Loader ............... SUCCESS [3.906s]
[INFO] Apache Sling Jackrabbit Embedded Repository ....... SUCCESS [11.452s]
[INFO] Apache Sling Jackrabbit UserManager Support ....... SUCCESS [2.834s]
[INFO] Apache Sling Jackrabbit JSR-283 Access Control Manager Support  SUCCESS [2.455s]
[INFO] Apache Sling Wrapper Bundle for the JCR API ....... SUCCESS [2.078s]
[INFO] Apache Sling JCR Resource Resolver ................ SUCCESS [34.419s]
[INFO] Apache Sling JCR Repository Registration .......... SUCCESS [3.943s]
[INFO] Apache Sling Simple WebDAV Access to repositories . SUCCESS [3.010s]
[INFO] Apache Sling DavEx Access to repositories ......... SUCCESS [3.463s]
[INFO] Apache Sling JCR WebConsole Bundle ................ SUCCESS [2.300s]
[INFO] Apache Sling Oak Repository Server ................ SUCCESS [3.019s]
[INFO] Apache Sling SlingRepository Integration Tests .... SUCCESS [43.280s]
[INFO] Apache Sling Servlet Resolver ..................... SUCCESS [3.918s]
[INFO] Apache Sling Default GET Servlets ................. SUCCESS [3.776s]
[INFO] Apache Sling Default POST Servlets ................ SUCCESS [4.275s]
[INFO] Apache Sling Compat Servlets ...................... SUCCESS [2.423s]
[INFO] Apache Sling Scripting Implementation API ......... SUCCESS [2.239s]
[INFO] Apache Sling Scripting Core implementation ........ SUCCESS [10.932s]
[INFO] Apache Sling Scripting JavaScript Support ......... SUCCESS [8.810s]
[INFO] Apache Sling Scripting JSP Support ................ SUCCESS [5.866s]
[INFO] Apache Sling JSP Tag Library ...................... SUCCESS [4.529s]
[INFO] Apache Sling JSP Standard Tag Library ............. SUCCESS [2.312s]
[INFO] Apache Sling Adapter Manager Implementation ....... SUCCESS [3.100s]
[INFO] Apache Sling Bundle Resource Provider ............. SUCCESS [2.196s]
[INFO] Apache Sling Distributed Event Admin .............. SUCCESS [4.692s]
[INFO] Apache Sling Discovery API ........................ SUCCESS [2.161s]
[INFO] Apache Sling Resource-Based Discovery Service ..... SUCCESS [2:46.928s]
[INFO] Apache Sling Discovery Support Bundle ............. SUCCESS [2.251s]
[INFO] Apache Sling Discovery Standalone Implementation .. SUCCESS [2.179s]
[INFO] Apache Sling Event Support ........................ SUCCESS [11:07.746s]
[INFO] Apache Sling Feature Flags ........................ SUCCESS [2.288s]
[INFO] Apache Sling Filesystem Resource Provider ......... SUCCESS [2.521s]
[INFO] Apache Sling javax.activation bundle .............. SUCCESS [2.258s]
[INFO] Apache Sling Service User Mapper .................. SUCCESS [3.182s]
[INFO] Apache Sling Settings ............................. SUCCESS [3.081s]
[INFO] Apache Sling Web Console Branding ................. SUCCESS [2.060s]
[INFO] Apache Sling Web Console Security Provider ........ SUCCESS [2.268s]
[INFO] Apache Sling Explorer ............................. SUCCESS [2.255s]
[INFO] Apache Sling Health Check Core .................... SUCCESS [7.861s]
[INFO] Apache Sling Health Check Annotations ............. SUCCESS [1.994s]
[INFO] Apache Sling Health Check Samples ................. SUCCESS [3.163s]
[INFO] Apache Sling Health Check Support Components ...... SUCCESS [3.151s]
[INFO] Apache Sling Health Check Webconsole Plugin ....... SUCCESS [2.285s]
[INFO] Apache Sling Health Check JUnit Bridge ............ SUCCESS [3.025s]
[INFO] Apache Sling Health Check Integration Tests ....... SUCCESS [15.110s]
[INFO] Apache Sling Health Check Reactor POM ............. SUCCESS [1.354s]
[INFO] Apache Sling Resource Access Security ............. SUCCESS [2.604s]
[INFO] Apache Sling Resource Access Security Integration Tests  SUCCESS [20.415s]
[INFO] Apache Sling Models API ........................... SUCCESS [2.396s]
[INFO] Apache Sling Models Implementation ................ SUCCESS [5.691s]
[INFO] Apache Sling Test Tools ........................... SUCCESS [3.358s]
[INFO] Apache Sling Models Integration Tests ............. SUCCESS [25.011s]
[INFO] Apache Sling JUnit Core ........................... SUCCESS [3.213s]
[INFO] Apache Sling JUnit Scriptable Tests Provider ...... SUCCESS [3.544s]
[INFO] Apache Sling JUnit Health Checks .................. SUCCESS [2.705s]
[INFO] Apache Sling JUnit Remote Tests Runners ........... SUCCESS [2.402s]
[INFO] Apache Sling JUnit Performance .................... SUCCESS [2.786s]
[INFO] Apache Sling Testing Resource Resolver Mock ....... SUCCESS [2.882s]
[INFO] Apache Sling Testing JCR Mock ..................... SUCCESS [3.671s]
[INFO] Apache Sling Testing OSGi Mock .................... SUCCESS [4.049s]
[INFO] Apache Sling Testing Sling Mock ................... SUCCESS [7.181s]
[INFO] Apache Sling Testing Sling Mock Jackrabbit-based Resource Resolver  SUCCESS [10.798s]
[INFO] Apache Sling Pax Exam Utilities ................... SUCCESS [20.082s]
[INFO] Apache Sling Sample Server-Side Tests ............. SUCCESS [2.243s]
[INFO] Apache Sling Failing Server-Side Tests ............ SUCCESS [2.186s]
[INFO] Apache Sling Launchpad Application Builder ........ SUCCESS [38.140s]
[INFO] Apache Sling Sample Integration Tests ............. SUCCESS [54.039s]
[INFO] Apache Sling Testing Modules Reactor .............. SUCCESS [1.208s]
[INFO] Apache Sling Installer ............................ SUCCESS [3.828s]
[INFO] Apache Sling Installer WebConsole Plugin .......... SUCCESS [2.196s]
[INFO] Apache Sling File Installer ....................... SUCCESS [2.221s]
[INFO] Apache Sling JCR Installer ........................ SUCCESS [1:55.198s]
[INFO] Apache Sling Installer Configuration Admin Support  SUCCESS [2.196s]
[INFO] Apache Sling Deployment Package Installer ......... SUCCESS [2.156s]
[INFO] Apache Sling Subsystems Installer ................. SUCCESS [2.051s]
[INFO] Apache Sling Installer Integration Tests .......... SUCCESS [36.943s]
[INFO] Apache Sling Launchpad API ........................ SUCCESS [2.119s]
[INFO] Apache Sling Launchpad Base ....................... SUCCESS [10.767s]
[INFO] Apache Sling Launchpad Installer .................. SUCCESS [54.330s]
[INFO] Apache Sling Launchpad Content .................... SUCCESS [2.099s]
[INFO] Apache Sling Launchpad Testing Services ........... SUCCESS [4.076s]
[INFO] Apache Sling Launchpad Testing Services WAR ....... SUCCESS [2.566s]
[INFO] Apache Sling Launchpad Testing Fragment Bundle .... SUCCESS [2.122s]
[INFO] Apache Sling Launchpad Test Bundles ............... SUCCESS [2.790s]
[INFO] Apache Sling Integration Tests .................... FAILURE [0.306s]
[INFO] Apache Sling Launchpad Testing .................... SKIPPED
[INFO] Apache Sling (Builder) ............................ SKIPPED
[INFO] ------------------------------------------------------------------------
[INFO] BUILD FAILURE
[INFO] ------------------------------------------------------------------------
[INFO] Total time: 30:29.796s
[INFO] Finished at: Mon Dec 15 11:12:20 UTC 2014
[INFO] Final Memory: 181M/462M
[INFO] ------------------------------------------------------------------------
[JENKINS] Archiving disabled
[JENKINS] Archiving disabled
[JENKINS] Archiving disabled
[JENKINS] Archiving disabled
[JENKINS] Archiving disabled
[JENKINS] Archiving disabled
[JENKINS] Archiving disabled
[JENKINS] Archiving disabled
[JENKINS] Archiving disabled
[JENKINS] Archiving disabled
[JENKINS] Archiving disabled
[JENKINS] Archiving disabled
[JENKINS] Archiving disabled
[JENKINS] Archiving disabled
[JENKINS] Archiving disabled
[JENKINS] Archiving disabled
[JENKINS] Archiving disabled
[JENKINS] Archiving disabled
[JENKINS] Archiving disabled
[JENKINS] Archiving disabled
[JENKINS] Archiving disabled
[JENKINS] Archiving disabled
[JENKINS] Archiving disabled
[JENKINS] Archiving disabled
[JENKINS] Archiving disabled
[JENKINS] Archiving disabled
[JENKINS] Archiving disabled
[JENKINS] Archiving disabled
[JENKINS] Archiving disabled
[JENKINS] Archiving disabled
[JENKINS] Archiving disabled
[JENKINS] Archiving disabled
[JENKINS] Archiving disabled
[JENKINS] Archiving disabled
[JENKINS] Archiving disabled
[JENKINS] Archiving disabled
[JENKINS] Archiving disabled
[JENKINS] Archiving disabled
[JENKINS] Archiving disabled
[JENKINS] Archiving disabled
[JENKINS] Archiving disabled
[JENKINS] Archiving disabled
[JENKINS] Archiving disabled
[JENKINS] Archiving disabled
[JENKINS] Archiving disabled
[JENKINS] Archiving disabled
[JENKINS] Archiving disabled
[JENKINS] Archiving disabled
[JENKINS] Archiving disabled
[JENKINS] Archiving disabled
[JENKINS] Archiving disabled
[JENKINS] Archiving disabled
[JENKINS] Archiving disabled
[JENKINS] Archiving disabled
[JENKINS] Archiving disabled
[JENKINS] Archiving disabled
[JENKINS] Archiving disabled
[JENKINS] Archiving disabled
[JENKINS] Archiving disabled
[JENKINS] Archiving disabled
[JENKINS] Archiving disabled
[JENKINS] Archiving disabled
[JENKINS] Archiving disabled
[JENKINS] Archiving disabled
[JENKINS] Archiving disabled
[JENKINS] Archiving disabled
[JENKINS] Archiving disabled
[JENKINS] Archiving disabled
[JENKINS] Archiving disabled
[JENKINS] Archiving disabled
[JENKINS] Archiving disabled
[JENKINS] Archiving disabled
[JENKINS] Archiving disabled
[JENKINS] Archiving disabled
[JENKINS] Archiving disabled
[JENKINS] Archiving disabled
[JENKINS] Archiving disabled
[JENKINS] Archiving disabled
[JENKINS] Archiving disabled
[JENKINS] Archiving disabled
[JENKINS] Archiving disabled
[JENKINS] Archiving disabled
[JENKINS] Archiving disabled
[JENKINS] Archiving disabled
[JENKINS] Archiving disabled
[JENKINS] Archiving disabled
[JENKINS] Archiving disabled
[JENKINS] Archiving disabled
[JENKINS] Archiving disabled
[JENKINS] Archiving disabled
[JENKINS] Archiving disabled
[JENKINS] Archiving disabled
[JENKINS] Archiving disabled
[JENKINS] Archiving disabled
[JENKINS] Archiving disabled
[JENKINS] Archiving disabled
[JENKINS] Archiving disabled
[JENKINS] Archiving disabled
[JENKINS] Archiving disabled
[JENKINS] Archiving disabled
[JENKINS] Archiving disabled
[JENKINS] Archiving disabled
[JENKINS] Archiving disabled
[JENKINS] Archiving disabled
[JENKINS] Archiving disabled
[JENKINS] Archiving disabled
[JENKINS] Archiving disabled
[JENKINS] Archiving disabled
[JENKINS] Archiving disabled
[JENKINS] Archiving disabled
[JENKINS] Archiving disabled
[JENKINS] Archiving disabled
[JENKINS] Archiving disabled
[JENKINS] Archiving disabled
[JENKINS] Archiving disabled
[JENKINS] Archiving disabled
[JENKINS] Archiving disabled
[JENKINS] Archiving disabled
[JENKINS] Archiving disabled
[JENKINS] Archiving disabled
[JENKINS] Archiving disabled
[JENKINS] Archiving disabled
[JENKINS] Archiving disabled
[JENKINS] Archiving disabled
[JENKINS] Archiving disabled
[JENKINS] Archiving disabled
Waiting for Jenkins to finish collecting data[ERROR] Failed to execute goal on project org.apache.sling.launchpad.integration-tests: Could not resolve dependencies for project org.apache.sling:org.apache.sling.launchpad.integration-tests:jar:1.0.1-SNAPSHOT: Could not find artifact org.apache.sling:org.apache.sling.junit.core:jar:1.0.10 in central (http://repo.maven.apache.org/maven2) -> [Help 1]
[ERROR] 
[ERROR] To see the full stack trace of the errors, re-run Maven with the -e switch.
[ERROR] Re-run Maven using the -X switch to enable full debug logging.
[ERROR] 
[ERROR] For more information about the errors and possible solutions, please read the following articles:
[ERROR] [Help 1] http://cwiki.apache.org/confluence/display/MAVEN/DependencyResolutionException
[ERROR] 
[ERROR] After correcting the problems, you can resume the build with the command
[ERROR]   mvn <goals> -rf :org.apache.sling.launchpad.integration-tests

Sending e-mails to: dev@sling.apache.org
Sending e-mails to: dev@sling.apache.org
Sending e-mails to: dev@sling.apache.org
Sending e-mails to: dev@sling.apache.org
channel stopped

Build failed in Jenkins: sling-trunk-1.8 #532

Posted by Apache Jenkins Server <je...@builds.apache.org>.
See <https://builds.apache.org/job/sling-trunk-1.8/532/changes>

Changes:

[mpetria] SLING-4153: adding distributor type and making DistributionRequest and interface

------------------------------------------
[...truncated 102607 lines...]
[INFO] Apache Sling SLF4J Implementation (Logback) ....... SUCCESS [27.531s]
[INFO] Apache Sling OSGi LogService Implementation ....... SUCCESS [2.749s]
[INFO] Apache Sling MIME type mapping support ............ SUCCESS [4.358s]
[INFO] Apache Sling Commons OSGi support ................. SUCCESS [3.616s]
[INFO] Apache Sling Scheduler Support .................... SUCCESS [4.722s]
[INFO] Apache Sling Testing Utilities .................... SUCCESS [12.420s]
[INFO] Apache Sling Thread Dumper ........................ SUCCESS [2.627s]
[INFO] Apache Sling Thread Support ....................... SUCCESS [3.009s]
[INFO] Apache Sling Authentication Service ............... SUCCESS [4.497s]
[INFO] Apache Sling Form Based Authentication Handler .... SUCCESS [9.051s]
[INFO] Apache Sling Engine Implementation ................ SUCCESS [16.726s]
[INFO] Apache Sling Repository API Bundle ................ SUCCESS [2.344s]
[INFO] Apache Sling JCR Base Bundle ...................... SUCCESS [3.443s]
[INFO] Apache Sling JCR ClassLoader ...................... SUCCESS [3.327s]
[INFO] Apache Sling Initial Content Loader ............... SUCCESS [5.990s]
[INFO] Apache Sling Jackrabbit Embedded Repository ....... SUCCESS [12.965s]
[INFO] Apache Sling Jackrabbit UserManager Support ....... SUCCESS [3.264s]
[INFO] Apache Sling Jackrabbit JSR-283 Access Control Manager Support  SUCCESS [2.835s]
[INFO] Apache Sling Wrapper Bundle for the JCR API ....... SUCCESS [2.292s]
[INFO] Apache Sling JCR Resource Resolver ................ SUCCESS [39.807s]
[INFO] Apache Sling JCR Repository Registration .......... SUCCESS [4.292s]
[INFO] Apache Sling Simple WebDAV Access to repositories . SUCCESS [3.614s]
[INFO] Apache Sling DavEx Access to repositories ......... SUCCESS [4.020s]
[INFO] Apache Sling JCR WebConsole Bundle ................ SUCCESS [2.728s]
[INFO] Apache Sling Oak Repository Server ................ SUCCESS [3.594s]
[INFO] Apache Sling SlingRepository Integration Tests .... SUCCESS [47.024s]
[INFO] Apache Sling Servlet Resolver ..................... SUCCESS [10.234s]
[INFO] Apache Sling Default GET Servlets ................. SUCCESS [4.295s]
[INFO] Apache Sling Default POST Servlets ................ SUCCESS [4.925s]
[INFO] Apache Sling Compat Servlets ...................... SUCCESS [3.322s]
[INFO] Apache Sling Scripting Implementation API ......... SUCCESS [2.716s]
[INFO] Apache Sling Scripting Core implementation ........ SUCCESS [12.030s]
[INFO] Apache Sling Scripting JavaScript Support ......... SUCCESS [10.346s]
[INFO] Apache Sling Scripting JSP Support ................ SUCCESS [9.234s]
[INFO] Apache Sling JSP Tag Library ...................... SUCCESS [5.895s]
[INFO] Apache Sling JSP Standard Tag Library ............. SUCCESS [2.479s]
[INFO] Apache Sling Adapter Manager Implementation ....... SUCCESS [3.737s]
[INFO] Apache Sling Bundle Resource Provider ............. SUCCESS [2.571s]
[INFO] Apache Sling Distributed Event Admin .............. SUCCESS [4.924s]
[INFO] Apache Sling Discovery API ........................ SUCCESS [2.470s]
[INFO] Apache Sling Resource-Based Discovery Service ..... SUCCESS [1:26:02.539s]
[INFO] Apache Sling Discovery Support Bundle ............. SUCCESS [2.578s]
[INFO] Apache Sling Discovery Standalone Implementation .. SUCCESS [2.469s]
[INFO] Apache Sling Event Support ........................ SUCCESS [11:31.035s]
[INFO] Apache Sling Feature Flags ........................ SUCCESS [2.673s]
[INFO] Apache Sling Filesystem Resource Provider ......... SUCCESS [2.575s]
[INFO] Apache Sling javax.activation bundle .............. SUCCESS [2.769s]
[INFO] Apache Sling Service User Mapper .................. SUCCESS [3.880s]
[INFO] Apache Sling Settings ............................. SUCCESS [3.372s]
[INFO] Apache Sling Web Console Branding ................. SUCCESS [2.378s]
[INFO] Apache Sling Web Console Security Provider ........ SUCCESS [2.529s]
[INFO] Apache Sling Explorer ............................. SUCCESS [2.855s]
[INFO] Apache Sling Health Check Core .................... SUCCESS [9.256s]
[INFO] Apache Sling Health Check Annotations ............. SUCCESS [2.203s]
[INFO] Apache Sling Health Check Samples ................. SUCCESS [3.416s]
[INFO] Apache Sling Health Check Support Components ...... SUCCESS [3.493s]
[INFO] Apache Sling Health Check Webconsole Plugin ....... SUCCESS [2.534s]
[INFO] Apache Sling Health Check JUnit Bridge ............ SUCCESS [3.246s]
[INFO] Apache Sling Health Check Integration Tests ....... SUCCESS [16.249s]
[INFO] Apache Sling Health Check Reactor POM ............. SUCCESS [1.288s]
[INFO] Apache Sling Resource Access Security ............. SUCCESS [8.043s]
[INFO] Apache Sling Resource Access Security Integration Tests  SUCCESS [22.009s]
[INFO] Apache Sling Models API ........................... SUCCESS [3.068s]
[INFO] Apache Sling Models Implementation ................ SUCCESS [6.380s]
[INFO] Apache Sling Test Tools ........................... SUCCESS [5.822s]
[INFO] Apache Sling Models Integration Tests ............. SUCCESS [25.575s]
[INFO] Apache Sling JUnit Core ........................... SUCCESS [19.528s]
[INFO] Apache Sling JUnit Scriptable Tests Provider ...... SUCCESS [3.768s]
[INFO] Apache Sling JUnit Health Checks .................. SUCCESS [3.058s]
[INFO] Apache Sling JUnit Remote Tests Runners ........... SUCCESS [2.651s]
[INFO] Apache Sling JUnit Performance .................... SUCCESS [3.112s]
[INFO] Apache Sling Testing Resource Resolver Mock ....... SUCCESS [3.071s]
[INFO] Apache Sling Testing JCR Mock ..................... SUCCESS [15.550s]
[INFO] Apache Sling Testing OSGi Mock .................... SUCCESS [5.446s]
[INFO] Apache Sling Testing Sling Mock ................... SUCCESS [8.623s]
[INFO] Apache Sling Testing Sling Mock Jackrabbit-based Resource Resolver  SUCCESS [16.178s]
[INFO] Apache Sling Pax Exam Utilities ................... SUCCESS [20.356s]
[INFO] Apache Sling Sample Server-Side Tests ............. SUCCESS [2.822s]
[INFO] Apache Sling Failing Server-Side Tests ............ SUCCESS [2.581s]
[INFO] Apache Sling Launchpad Application Builder ........ SUCCESS [23.369s]
[INFO] Apache Sling Sample Integration Tests ............. SUCCESS [55.303s]
[INFO] Apache Sling Testing Modules Reactor .............. SUCCESS [1.314s]
[INFO] Apache Sling Installer ............................ SUCCESS [4.447s]
[INFO] Apache Sling Installer WebConsole Plugin .......... SUCCESS [2.435s]
[INFO] Apache Sling File Installer ....................... SUCCESS [2.374s]
[INFO] Apache Sling JCR Installer ........................ SUCCESS [1:55.713s]
[INFO] Apache Sling Installer Configuration Admin Support  SUCCESS [2.556s]
[INFO] Apache Sling Deployment Package Installer ......... SUCCESS [3.923s]
[INFO] Apache Sling Subsystems Installer ................. SUCCESS [3.031s]
[INFO] Apache Sling Installer Integration Tests .......... SUCCESS [37.745s]
[INFO] Apache Sling Launchpad API ........................ SUCCESS [12.692s]
[INFO] Apache Sling Launchpad Base ....................... SUCCESS [11.661s]
[INFO] Apache Sling Launchpad Installer .................. SUCCESS [26.632s]
[INFO] Apache Sling Launchpad Content .................... SUCCESS [2.994s]
[INFO] Apache Sling Launchpad Testing Services ........... SUCCESS [4.761s]
[INFO] Apache Sling Launchpad Testing Services WAR ....... SUCCESS [2.882s]
[INFO] Apache Sling Launchpad Testing Fragment Bundle .... SUCCESS [2.341s]
[INFO] Apache Sling Launchpad Test Bundles ............... SUCCESS [2.904s]
[INFO] Apache Sling Integration Tests .................... FAILURE [0.335s]
[INFO] Apache Sling Launchpad Testing .................... SKIPPED
[INFO] Apache Sling (Builder) ............................ SKIPPED
[INFO] ------------------------------------------------------------------------
[INFO] BUILD FAILURE
[INFO] ------------------------------------------------------------------------
[INFO] Total time: 1:55:51.534s
[INFO] Finished at: Mon Dec 15 10:39:44 UTC 2014
[INFO] Final Memory: 198M/463M
[INFO] ------------------------------------------------------------------------
[JENKINS] Archiving disabled
[JENKINS] Archiving disabled
[JENKINS] Archiving disabled
[JENKINS] Archiving disabled
[JENKINS] Archiving disabled
[JENKINS] Archiving disabled
[JENKINS] Archiving disabled
[JENKINS] Archiving disabled
[JENKINS] Archiving disabled
[JENKINS] Archiving disabled
[JENKINS] Archiving disabled
[JENKINS] Archiving disabled
[JENKINS] Archiving disabled
[JENKINS] Archiving disabled
[JENKINS] Archiving disabled
[JENKINS] Archiving disabled
[JENKINS] Archiving disabled
[JENKINS] Archiving disabled
[JENKINS] Archiving disabled
[JENKINS] Archiving disabled
[JENKINS] Archiving disabled
[JENKINS] Archiving disabled
[JENKINS] Archiving disabled
[JENKINS] Archiving disabled
[JENKINS] Archiving disabled
[JENKINS] Archiving disabled
[JENKINS] Archiving disabled
[JENKINS] Archiving disabled
[JENKINS] Archiving disabled
[JENKINS] Archiving disabled
[JENKINS] Archiving disabled
[JENKINS] Archiving disabled
[JENKINS] Archiving disabled
[JENKINS] Archiving disabled
[JENKINS] Archiving disabled
[JENKINS] Archiving disabled
[JENKINS] Archiving disabled
[JENKINS] Archiving disabled
[JENKINS] Archiving disabled
[JENKINS] Archiving disabled
[JENKINS] Archiving disabled
[JENKINS] Archiving disabled
[JENKINS] Archiving disabled
[JENKINS] Archiving disabled
[JENKINS] Archiving disabled
[JENKINS] Archiving disabled
[JENKINS] Archiving disabled
[JENKINS] Archiving disabled
[JENKINS] Archiving disabled
[JENKINS] Archiving disabled
[JENKINS] Archiving disabled
[JENKINS] Archiving disabled
[JENKINS] Archiving disabled
[JENKINS] Archiving disabled
[JENKINS] Archiving disabled
[JENKINS] Archiving disabled
[JENKINS] Archiving disabled
[JENKINS] Archiving disabled
[JENKINS] Archiving disabled
[JENKINS] Archiving disabled
[JENKINS] Archiving disabled
[JENKINS] Archiving disabled
[JENKINS] Archiving disabled
[JENKINS] Archiving disabled
[JENKINS] Archiving disabled
[JENKINS] Archiving disabled
[JENKINS] Archiving disabled
[JENKINS] Archiving disabled
[JENKINS] Archiving disabled
[JENKINS] Archiving disabled
[JENKINS] Archiving disabled
[JENKINS] Archiving disabled
[JENKINS] Archiving disabled
[JENKINS] Archiving disabled
[JENKINS] Archiving disabled
[JENKINS] Archiving disabled
[JENKINS] Archiving disabled
[JENKINS] Archiving disabled
[JENKINS] Archiving disabled
[JENKINS] Archiving disabled
[JENKINS] Archiving disabled
[JENKINS] Archiving disabled
[JENKINS] Archiving disabled
[JENKINS] Archiving disabled
[JENKINS] Archiving disabled
[JENKINS] Archiving disabled
[JENKINS] Archiving disabled
[JENKINS] Archiving disabled
[JENKINS] Archiving disabled
[JENKINS] Archiving disabled
[JENKINS] Archiving disabled
[JENKINS] Archiving disabled
[JENKINS] Archiving disabled
[JENKINS] Archiving disabled
[JENKINS] Archiving disabled
[JENKINS] Archiving disabled
[JENKINS] Archiving disabled
[JENKINS] Archiving disabled
[JENKINS] Archiving disabled
[JENKINS] Archiving disabled
[JENKINS] Archiving disabled
[JENKINS] Archiving disabled
[JENKINS] Archiving disabled
[JENKINS] Archiving disabled
[JENKINS] Archiving disabled
[JENKINS] Archiving disabled
[JENKINS] Archiving disabled
[JENKINS] Archiving disabled
[JENKINS] Archiving disabled
[JENKINS] Archiving disabled
[JENKINS] Archiving disabled
[JENKINS] Archiving disabled
[JENKINS] Archiving disabled
[JENKINS] Archiving disabled
[JENKINS] Archiving disabled
[JENKINS] Archiving disabled
[JENKINS] Archiving disabled
[JENKINS] Archiving disabled
[JENKINS] Archiving disabled
[JENKINS] Archiving disabled
[JENKINS] Archiving disabled
[JENKINS] Archiving disabled
[JENKINS] Archiving disabled
[JENKINS] Archiving disabled
[JENKINS] Archiving disabled
[JENKINS] Archiving disabled
Waiting for Jenkins to finish collecting data[ERROR] Failed to execute goal on project org.apache.sling.launchpad.integration-tests: Could not resolve dependencies for project org.apache.sling:org.apache.sling.launchpad.integration-tests:jar:1.0.1-SNAPSHOT: Could not find artifact org.apache.sling:org.apache.sling.junit.core:jar:1.0.10 in central (http://repo.maven.apache.org/maven2) -> [Help 1]
[ERROR] 
[ERROR] To see the full stack trace of the errors, re-run Maven with the -e switch.
[ERROR] Re-run Maven using the -X switch to enable full debug logging.
[ERROR] 
[ERROR] For more information about the errors and possible solutions, please read the following articles:
[ERROR] [Help 1] http://cwiki.apache.org/confluence/display/MAVEN/DependencyResolutionException
[ERROR] 
[ERROR] After correcting the problems, you can resume the build with the command
[ERROR]   mvn <goals> -rf :org.apache.sling.launchpad.integration-tests

Sending e-mails to: dev@sling.apache.org
Sending e-mails to: dev@sling.apache.org
Sending e-mails to: dev@sling.apache.org
channel stopped

Build failed in Jenkins: sling-trunk-1.8 #531

Posted by Apache Jenkins Server <je...@builds.apache.org>.
See <https://builds.apache.org/job/sling-trunk-1.8/531/changes>

Changes:

[jsedding] SLING-4237 - JCR Mock implementation should have "throws RepositoryException"
- add exceptions also to MockQuery* classes

------------------------------------------
[...truncated 63714 lines...]
[INFO] Apache Sling JSON Library ......................... SUCCESS [3.887s]
[INFO] Apache Sling SLF4J Implementation (Logback) ....... SUCCESS [26.194s]
[INFO] Apache Sling OSGi LogService Implementation ....... SUCCESS [2.479s]
[INFO] Apache Sling MIME type mapping support ............ SUCCESS [3.998s]
[INFO] Apache Sling Commons OSGi support ................. SUCCESS [3.631s]
[INFO] Apache Sling Scheduler Support .................... SUCCESS [3.110s]
[INFO] Apache Sling Testing Utilities .................... SUCCESS [11.021s]
[INFO] Apache Sling Thread Dumper ........................ SUCCESS [2.536s]
[INFO] Apache Sling Thread Support ....................... SUCCESS [2.666s]
[INFO] Apache Sling Authentication Service ............... SUCCESS [3.774s]
[INFO] Apache Sling Form Based Authentication Handler .... SUCCESS [6.171s]
[INFO] Apache Sling Engine Implementation ................ SUCCESS [12.832s]
[INFO] Apache Sling Repository API Bundle ................ SUCCESS [2.267s]
[INFO] Apache Sling JCR Base Bundle ...................... SUCCESS [3.301s]
[INFO] Apache Sling JCR ClassLoader ...................... SUCCESS [2.530s]
[INFO] Apache Sling Initial Content Loader ............... SUCCESS [4.039s]
[INFO] Apache Sling Jackrabbit Embedded Repository ....... SUCCESS [11.969s]
[INFO] Apache Sling Jackrabbit UserManager Support ....... SUCCESS [3.083s]
[INFO] Apache Sling Jackrabbit JSR-283 Access Control Manager Support  SUCCESS [2.676s]
[INFO] Apache Sling Wrapper Bundle for the JCR API ....... SUCCESS [2.340s]
[INFO] Apache Sling JCR Resource Resolver ................ SUCCESS [34.612s]
[INFO] Apache Sling JCR Repository Registration .......... SUCCESS [3.877s]
[INFO] Apache Sling Simple WebDAV Access to repositories . SUCCESS [3.362s]
[INFO] Apache Sling DavEx Access to repositories ......... SUCCESS [3.857s]
[INFO] Apache Sling JCR WebConsole Bundle ................ SUCCESS [2.543s]
[INFO] Apache Sling Oak Repository Server ................ SUCCESS [3.409s]
[INFO] Apache Sling SlingRepository Integration Tests .... SUCCESS [43.617s]
[INFO] Apache Sling Servlet Resolver ..................... SUCCESS [4.296s]
[INFO] Apache Sling Default GET Servlets ................. SUCCESS [3.923s]
[INFO] Apache Sling Default POST Servlets ................ SUCCESS [4.388s]
[INFO] Apache Sling Compat Servlets ...................... SUCCESS [2.493s]
[INFO] Apache Sling Scripting Implementation API ......... SUCCESS [2.415s]
[INFO] Apache Sling Scripting Core implementation ........ SUCCESS [11.141s]
[INFO] Apache Sling Scripting JavaScript Support ......... SUCCESS [9.637s]
[INFO] Apache Sling Scripting JSP Support ................ SUCCESS [8.231s]
[INFO] Apache Sling JSP Tag Library ...................... SUCCESS [5.387s]
[INFO] Apache Sling JSP Standard Tag Library ............. SUCCESS [2.449s]
[INFO] Apache Sling Adapter Manager Implementation ....... SUCCESS [3.648s]
[INFO] Apache Sling Bundle Resource Provider ............. SUCCESS [2.593s]
[INFO] Apache Sling Distributed Event Admin .............. SUCCESS [4.477s]
[INFO] Apache Sling Discovery API ........................ SUCCESS [2.380s]
[INFO] Apache Sling Resource-Based Discovery Service ..... SUCCESS [2:35.068s]
[INFO] Apache Sling Discovery Support Bundle ............. SUCCESS [2.501s]
[INFO] Apache Sling Discovery Standalone Implementation .. SUCCESS [2.387s]
[INFO] Apache Sling Event Support ........................ SUCCESS [10:34.993s]
[INFO] Apache Sling Feature Flags ........................ SUCCESS [3.062s]
[INFO] Apache Sling Filesystem Resource Provider ......... SUCCESS [2.528s]
[INFO] Apache Sling javax.activation bundle .............. SUCCESS [2.508s]
[INFO] Apache Sling Service User Mapper .................. SUCCESS [4.686s]
[INFO] Apache Sling Settings ............................. SUCCESS [3.291s]
[INFO] Apache Sling Web Console Branding ................. SUCCESS [2.205s]
[INFO] Apache Sling Web Console Security Provider ........ SUCCESS [2.561s]
[INFO] Apache Sling Explorer ............................. SUCCESS [2.521s]
[INFO] Apache Sling Health Check Core .................... SUCCESS [8.139s]
[INFO] Apache Sling Health Check Annotations ............. SUCCESS [2.094s]
[INFO] Apache Sling Health Check Samples ................. SUCCESS [3.340s]
[INFO] Apache Sling Health Check Support Components ...... SUCCESS [3.332s]
[INFO] Apache Sling Health Check Webconsole Plugin ....... SUCCESS [2.524s]
[INFO] Apache Sling Health Check JUnit Bridge ............ SUCCESS [3.329s]
[INFO] Apache Sling Health Check Integration Tests ....... SUCCESS [15.936s]
[INFO] Apache Sling Health Check Reactor POM ............. SUCCESS [1.360s]
[INFO] Apache Sling Resource Access Security ............. SUCCESS [3.652s]
[INFO] Apache Sling Resource Access Security Integration Tests  SUCCESS [38.491s]
[INFO] Apache Sling Models API ........................... SUCCESS [2.769s]
[INFO] Apache Sling Models Implementation ................ SUCCESS [6.072s]
[INFO] Apache Sling Test Tools ........................... SUCCESS [4.416s]
[INFO] Apache Sling Models Integration Tests ............. SUCCESS [24.589s]
[INFO] Apache Sling JUnit Core ........................... SUCCESS [3.428s]
[INFO] Apache Sling JUnit Scriptable Tests Provider ...... SUCCESS [3.064s]
[INFO] Apache Sling JUnit Health Checks .................. SUCCESS [3.154s]
[INFO] Apache Sling JUnit Remote Tests Runners ........... SUCCESS [2.650s]
[INFO] Apache Sling JUnit Performance .................... SUCCESS [3.083s]
[INFO] Apache Sling Testing Resource Resolver Mock ....... SUCCESS [2.845s]
[INFO] Apache Sling Testing JCR Mock ..................... SUCCESS [3.923s]
[INFO] Apache Sling Testing OSGi Mock .................... SUCCESS [5.683s]
[INFO] Apache Sling Testing Sling Mock ................... SUCCESS [7.674s]
[INFO] Apache Sling Testing Sling Mock Jackrabbit-based Resource Resolver  SUCCESS [18.640s]
[INFO] Apache Sling Pax Exam Utilities ................... SUCCESS [21.604s]
[INFO] Apache Sling Sample Server-Side Tests ............. SUCCESS [3.268s]
[INFO] Apache Sling Failing Server-Side Tests ............ SUCCESS [2.348s]
[INFO] Apache Sling Launchpad Application Builder ........ SUCCESS [22.236s]
[INFO] Apache Sling Sample Integration Tests ............. SUCCESS [55.362s]
[INFO] Apache Sling Testing Modules Reactor .............. SUCCESS [1.516s]
[INFO] Apache Sling Installer ............................ SUCCESS [4.133s]
[INFO] Apache Sling Installer WebConsole Plugin .......... SUCCESS [2.491s]
[INFO] Apache Sling File Installer ....................... SUCCESS [2.424s]
[INFO] Apache Sling JCR Installer ........................ SUCCESS [2:00.784s]
[INFO] Apache Sling Installer Configuration Admin Support  SUCCESS [2.551s]
[INFO] Apache Sling Deployment Package Installer ......... SUCCESS [2.589s]
[INFO] Apache Sling Subsystems Installer ................. SUCCESS [2.340s]
[INFO] Apache Sling Installer Integration Tests .......... SUCCESS [38.842s]
[INFO] Apache Sling Launchpad API ........................ SUCCESS [2.338s]
[INFO] Apache Sling Launchpad Base ....................... SUCCESS [10.998s]
[INFO] Apache Sling Launchpad Installer .................. SUCCESS [10.159s]
[INFO] Apache Sling Launchpad Content .................... SUCCESS [2.321s]
[INFO] Apache Sling Launchpad Testing Services ........... SUCCESS [4.759s]
[INFO] Apache Sling Launchpad Testing Services WAR ....... SUCCESS [2.777s]
[INFO] Apache Sling Launchpad Testing Fragment Bundle .... SUCCESS [2.931s]
[INFO] Apache Sling Launchpad Test Bundles ............... SUCCESS [3.438s]
[INFO] Apache Sling Integration Tests .................... FAILURE [0.547s]
[INFO] Apache Sling Launchpad Testing .................... SKIPPED
[INFO] Apache Sling (Builder) ............................ SKIPPED
[INFO] ------------------------------------------------------------------------
[INFO] BUILD FAILURE
[INFO] ------------------------------------------------------------------------
[INFO] Total time: 30:30.135s
[INFO] Finished at: Fri Dec 12 10:21:15 UTC 2014
[INFO] Final Memory: 183M/462M
[INFO] ------------------------------------------------------------------------
[JENKINS] Archiving disabled
[JENKINS] Archiving disabled
[JENKINS] Archiving disabled
[JENKINS] Archiving disabled
[JENKINS] Archiving disabled
[JENKINS] Archiving disabled
[JENKINS] Archiving disabled
[JENKINS] Archiving disabled
[JENKINS] Archiving disabled
[JENKINS] Archiving disabled
[JENKINS] Archiving disabled
[JENKINS] Archiving disabled
[JENKINS] Archiving disabled
[JENKINS] Archiving disabled
[JENKINS] Archiving disabled
[JENKINS] Archiving disabled
[JENKINS] Archiving disabled
[JENKINS] Archiving disabled
[JENKINS] Archiving disabled
[JENKINS] Archiving disabled
[JENKINS] Archiving disabled
[JENKINS] Archiving disabled
[JENKINS] Archiving disabled
[JENKINS] Archiving disabled
[JENKINS] Archiving disabled
[JENKINS] Archiving disabled
[JENKINS] Archiving disabled
[JENKINS] Archiving disabled
[JENKINS] Archiving disabled
[JENKINS] Archiving disabled
[JENKINS] Archiving disabled
[JENKINS] Archiving disabled
[JENKINS] Archiving disabled
[JENKINS] Archiving disabled
[JENKINS] Archiving disabled
[JENKINS] Archiving disabled
[JENKINS] Archiving disabled
[JENKINS] Archiving disabled
[JENKINS] Archiving disabled
[JENKINS] Archiving disabled
[JENKINS] Archiving disabled
[JENKINS] Archiving disabled
[JENKINS] Archiving disabled
[JENKINS] Archiving disabled
[JENKINS] Archiving disabled
[JENKINS] Archiving disabled
[JENKINS] Archiving disabled
[JENKINS] Archiving disabled
[JENKINS] Archiving disabled
[JENKINS] Archiving disabled
[JENKINS] Archiving disabled
[JENKINS] Archiving disabled
[JENKINS] Archiving disabled
[JENKINS] Archiving disabled
[JENKINS] Archiving disabled
[JENKINS] Archiving disabled
[JENKINS] Archiving disabled
[JENKINS] Archiving disabled
[JENKINS] Archiving disabled
[JENKINS] Archiving disabled
[JENKINS] Archiving disabled
[JENKINS] Archiving disabled
[JENKINS] Archiving disabled
[JENKINS] Archiving disabled
[JENKINS] Archiving disabled
[JENKINS] Archiving disabled
[JENKINS] Archiving disabled
[JENKINS] Archiving disabled
[JENKINS] Archiving disabled
[JENKINS] Archiving disabled
[JENKINS] Archiving disabled
[JENKINS] Archiving disabled
[JENKINS] Archiving disabled
[JENKINS] Archiving disabled
[JENKINS] Archiving disabled
[JENKINS] Archiving disabled
[JENKINS] Archiving disabled
[JENKINS] Archiving disabled
[JENKINS] Archiving disabled
[JENKINS] Archiving disabled
[JENKINS] Archiving disabled
[JENKINS] Archiving disabled
[JENKINS] Archiving disabled
[JENKINS] Archiving disabled
[JENKINS] Archiving disabled
[JENKINS] Archiving disabled
[JENKINS] Archiving disabled
[JENKINS] Archiving disabled
[JENKINS] Archiving disabled
[JENKINS] Archiving disabled
[JENKINS] Archiving disabled
[JENKINS] Archiving disabled
[JENKINS] Archiving disabled
[JENKINS] Archiving disabled
[JENKINS] Archiving disabled
[JENKINS] Archiving disabled
[JENKINS] Archiving disabled
[JENKINS] Archiving disabled
[JENKINS] Archiving disabled
[JENKINS] Archiving disabled
[JENKINS] Archiving disabled
[JENKINS] Archiving disabled
[JENKINS] Archiving disabled
[JENKINS] Archiving disabled
[JENKINS] Archiving disabled
[JENKINS] Archiving disabled
[JENKINS] Archiving disabled
[JENKINS] Archiving disabled
[JENKINS] Archiving disabled
[JENKINS] Archiving disabled
[JENKINS] Archiving disabled
[JENKINS] Archiving disabled
[JENKINS] Archiving disabled
[JENKINS] Archiving disabled
[JENKINS] Archiving disabled
[JENKINS] Archiving disabled
[JENKINS] Archiving disabled
[JENKINS] Archiving disabled
[JENKINS] Archiving disabled
[JENKINS] Archiving disabled
[JENKINS] Archiving disabled
[JENKINS] Archiving disabled
[JENKINS] Archiving disabled
[JENKINS] Archiving disabled
[JENKINS] Archiving disabled
[JENKINS] Archiving disabled
Waiting for Jenkins to finish collecting data[ERROR] Failed to execute goal on project org.apache.sling.launchpad.integration-tests: Could not resolve dependencies for project org.apache.sling:org.apache.sling.launchpad.integration-tests:jar:1.0.1-SNAPSHOT: Could not find artifact org.apache.sling:org.apache.sling.junit.core:jar:1.0.10 in central (http://repo.maven.apache.org/maven2) -> [Help 1]
[ERROR] 
[ERROR] To see the full stack trace of the errors, re-run Maven with the -e switch.
[ERROR] Re-run Maven using the -X switch to enable full debug logging.
[ERROR] 
[ERROR] For more information about the errors and possible solutions, please read the following articles:
[ERROR] [Help 1] http://cwiki.apache.org/confluence/display/MAVEN/DependencyResolutionException
[ERROR] 
[ERROR] After correcting the problems, you can resume the build with the command
[ERROR]   mvn <goals> -rf :org.apache.sling.launchpad.integration-tests

Sending e-mails to: dev@sling.apache.org
Sending e-mails to: dev@sling.apache.org
channel stopped

Jenkins build is unstable: sling-trunk-1.8 #530

Posted by Apache Jenkins Server <je...@builds.apache.org>.
See <https://builds.apache.org/job/sling-trunk-1.8/530/changes>