You are viewing a plain text version of this content. The canonical link for it is here.
Posted to builds@beam.apache.org by Apache Jenkins Server <je...@builds.apache.org> on 2022/08/30 21:13:57 UTC

Build failed in Jenkins: beam_PostCommit_Python37 #5658

See <https://ci-beam.apache.org/job/beam_PostCommit_Python37/5658/display/redirect?page=changes>

Changes:

[noreply] Fix yaml duplicated mapping key (#22952)

[noreply] [Playground] [Infrastructure] Adding the Cloud Datastore client to save

[noreply] Fix jdbc date conversion offset 1 day (#22738)

[noreply] Set state integration test (#22935)


------------------------------------------
[...truncated 734.43 KB...]
}
message: "No more requests from control plane"
log_location: "/usr/local/lib/python3.7/site-packages/apache_beam/runners/worker/sdk_worker.py:261"
thread: "MainThread"

INFO:root:severity: INFO
timestamp {
  seconds: 1661887890
  nanos: 385017395
}
message: "SDK Harness waiting for in-flight requests to complete"
log_location: "/usr/local/lib/python3.7/site-packages/apache_beam/runners/worker/sdk_worker.py:262"
thread: "MainThread"

INFO:root:severity: INFO
timestamp {
  seconds: 1661887890
  nanos: 385119199
}
message: "Closing all cached grpc data channels."
log_location: "/usr/local/lib/python3.7/site-packages/apache_beam/runners/worker/data_plane.py:805"
thread: "MainThread"

INFO:root:severity: INFO
timestamp {
  seconds: 1661887890
  nanos: 385225772
}
message: "Closing all cached gRPC state handlers."
log_location: "/usr/local/lib/python3.7/site-packages/apache_beam/runners/worker/sdk_worker.py:877"
thread: "MainThread"

INFO:root:severity: INFO
timestamp {
  seconds: 1661887890
  nanos: 385613679
}
message: "Done consuming work."
log_location: "/usr/local/lib/python3.7/site-packages/apache_beam/runners/worker/sdk_worker.py:274"
thread: "MainThread"

INFO:root:severity: INFO
timestamp {
  seconds: 1661887890
  nanos: 385725975
}
message: "Python sdk harness exiting."
log_location: "/usr/local/lib/python3.7/site-packages/apache_beam/runners/worker/sdk_worker_main.py:184"
thread: "MainThread"

INFO:apache_beam.runners.portability.local_job_service:Completed job in 31.249009609222412 seconds with state DONE.
INFO:root:Completed job in 31.249009609222412 seconds with state DONE.
INFO:apache_beam.runners.portability.portable_runner:Job state changed to DONE

> Task :sdks:python:test-suites:direct:py37:spannerioIT

> Task :sdks:python:test-suites:portable:py37:portableWordCountSparkRunnerBatch
INFO:apache_beam.runners.worker.worker_pool_main:Listening for workers at localhost:34037
INFO:root:Default Python SDK image for environment is apache/beam_python3.7_sdk:2.42.0.dev
INFO:apache_beam.runners.portability.fn_api_runner.translations:==================== <function pack_combiners at 0x7f1e5cd03b00> ====================
INFO:apache_beam.runners.portability.fn_api_runner.translations:==================== <function lift_combiners at 0x7f1e5cd03b90> ====================
INFO:apache_beam.runners.portability.fn_api_runner.translations:==================== <function sort_stages at 0x7f1e5cd04320> ====================
INFO:apache_beam.utils.subprocess_server:Starting service with ['java' '-jar' '/home/jenkins/jenkins-slave/workspace/beam_PostCommit_Python37/src/runners/spark/2/job-server/build/libs/beam-runners-spark-job-server-2.42.0-SNAPSHOT.jar' '--spark-master-url' 'local[4]' '--artifacts-dir' '/tmp/beam-temp5bvraa6e/artifactsa1z8gsxl' '--job-port' '35937' '--artifact-port' '0' '--expansion-port' '0']
E0830 19:31:46.881167189 4116445 fork_posix.cc:76]           Other threads are currently calling into gRPC, skipping fork() handlers
INFO:apache_beam.utils.subprocess_server:22/08/30 19:31:48 WARN software.amazon.awssdk.regions.internal.util.EC2MetadataUtils: Unable to retrieve the requested metadata.
INFO:apache_beam.utils.subprocess_server:22/08/30 19:31:48 INFO org.apache.beam.runners.jobsubmission.JobServerDriver: ArtifactStagingService started on localhost:33037
INFO:apache_beam.utils.subprocess_server:22/08/30 19:31:49 INFO org.apache.beam.runners.jobsubmission.JobServerDriver: Java ExpansionService started on localhost:37819
INFO:apache_beam.utils.subprocess_server:22/08/30 19:31:49 INFO org.apache.beam.runners.jobsubmission.JobServerDriver: JobService started on localhost:35937
INFO:apache_beam.utils.subprocess_server:22/08/30 19:31:49 INFO org.apache.beam.runners.jobsubmission.JobServerDriver: Job server now running, terminate with Ctrl+C
WARNING:apache_beam.options.pipeline_options:Discarding unparseable args: ['--parallelism=2']
INFO:apache_beam.utils.subprocess_server:22/08/30 19:31:50 INFO org.apache.beam.runners.fnexecution.artifact.ArtifactStagingService: Staging artifacts for job_d79b3be3-5c8b-4180-a9e2-e4358926bcaf.
INFO:apache_beam.utils.subprocess_server:22/08/30 19:31:50 INFO org.apache.beam.runners.fnexecution.artifact.ArtifactStagingService: Resolving artifacts for job_d79b3be3-5c8b-4180-a9e2-e4358926bcaf.ref_Environment_default_environment_1.
INFO:apache_beam.utils.subprocess_server:22/08/30 19:31:50 INFO org.apache.beam.runners.fnexecution.artifact.ArtifactStagingService: Getting 1 artifacts for job_d79b3be3-5c8b-4180-a9e2-e4358926bcaf.null.
INFO:apache_beam.utils.subprocess_server:22/08/30 19:31:50 INFO org.apache.beam.runners.fnexecution.artifact.ArtifactStagingService: Artifacts fully staged for job_d79b3be3-5c8b-4180-a9e2-e4358926bcaf.
INFO:apache_beam.utils.subprocess_server:22/08/30 19:31:50 INFO org.apache.beam.runners.spark.SparkJobInvoker: Invoking job BeamApp-jenkins-0830193150-350b1270_7c4decd8-507a-4781-8360-823e7eb05c59
INFO:apache_beam.runners.portability.portable_runner:Environment "LOOPBACK" has started a component necessary for the execution. Be sure to run the pipeline using
  with Pipeline() as p:
    p.apply(..)
This ensures that the pipeline finishes before this program exits.
INFO:apache_beam.runners.portability.portable_runner:Job state changed to STOPPED
INFO:apache_beam.runners.portability.portable_runner:Job state changed to STARTING
INFO:apache_beam.runners.portability.portable_runner:Job state changed to RUNNING
INFO:apache_beam.utils.subprocess_server:22/08/30 19:31:50 INFO org.apache.beam.runners.jobsubmission.JobInvocation: Starting job invocation BeamApp-jenkins-0830193150-350b1270_7c4decd8-507a-4781-8360-823e7eb05c59
INFO:apache_beam.utils.subprocess_server:22/08/30 19:31:50 INFO org.apache.beam.runners.spark.translation.SparkContextFactory: Creating a brand new Spark Context.
INFO:apache_beam.utils.subprocess_server:22/08/30 19:31:51 WARN org.apache.hadoop.util.NativeCodeLoader: Unable to load native-hadoop library for your platform... using builtin-java classes where applicable
INFO:apache_beam.utils.subprocess_server:22/08/30 19:31:51 WARN org.apache.beam.runners.spark.translation.SparkContextFactory: Support for Spark 2 is deprecated, this runner will be removed in a few releases.
INFO:apache_beam.utils.subprocess_server:Spark 2 is reaching its EOL, consider migrating to Spark 3.
INFO:apache_beam.utils.subprocess_server:22/08/30 19:31:51 INFO org.apache.beam.runners.spark.aggregators.AggregatorsAccumulator: Instantiated aggregators accumulator:
INFO:apache_beam.utils.subprocess_server:22/08/30 19:31:51 INFO org.apache.beam.runners.spark.metrics.MetricsAccumulator: Instantiated metrics accumulator: MetricQueryResults()
INFO:apache_beam.utils.subprocess_server:22/08/30 19:31:51 WARN software.amazon.awssdk.regions.internal.util.EC2MetadataUtils: Unable to retrieve the requested metadata.
INFO:apache_beam.utils.subprocess_server:22/08/30 19:31:51 INFO org.apache.beam.runners.spark.SparkPipelineRunner: Running job BeamApp-jenkins-0830193150-350b1270_7c4decd8-507a-4781-8360-823e7eb05c59 on Spark master local[4]
INFO:apache_beam.utils.subprocess_server:22/08/30 19:31:52 WARN software.amazon.awssdk.regions.internal.util.EC2MetadataUtils: Unable to retrieve the requested metadata.
INFO:apache_beam.utils.subprocess_server:22/08/30 19:31:52 WARN software.amazon.awssdk.regions.internal.util.EC2MetadataUtils: Unable to retrieve the requested metadata.
INFO:apache_beam.utils.subprocess_server:22/08/30 19:31:52 WARN software.amazon.awssdk.regions.internal.util.EC2MetadataUtils: Unable to retrieve the requested metadata.
INFO:apache_beam.utils.subprocess_server:22/08/30 19:31:52 WARN software.amazon.awssdk.regions.internal.util.EC2MetadataUtils: Unable to retrieve the requested metadata.
INFO:apache_beam.runners.worker.statecache:Creating state cache with size 0
INFO:apache_beam.runners.worker.sdk_worker:Creating insecure control channel for localhost:38091.
INFO:apache_beam.runners.worker.sdk_worker:Control channel established.
INFO:apache_beam.runners.worker.sdk_worker:Initializing SDKHarness with unbounded number of workers.
INFO:apache_beam.utils.subprocess_server:22/08/30 19:31:53 INFO org.apache.beam.runners.fnexecution.control.FnApiControlClientPoolService: Beam Fn Control client connected with id 1-1
INFO:apache_beam.runners.worker.sdk_worker:Creating insecure state channel for localhost:45351.
INFO:apache_beam.runners.worker.sdk_worker:State channel established.
INFO:apache_beam.runners.worker.data_plane:Creating client data channel for localhost:37323
INFO:apache_beam.utils.subprocess_server:22/08/30 19:31:53 INFO org.apache.beam.runners.fnexecution.control.FnApiControlClientPoolService: getProcessBundleDescriptor request with id 1-2
INFO:apache_beam.utils.subprocess_server:22/08/30 19:31:53 INFO org.apache.beam.runners.fnexecution.data.GrpcDataService: Beam Fn Data client connected.
INFO:apache_beam.utils.subprocess_server:22/08/30 19:31:53 INFO org.apache.beam.runners.fnexecution.control.FnApiControlClientPoolService: getProcessBundleDescriptor request with id 1-3
INFO:apache_beam.utils.subprocess_server:22/08/30 19:31:53 WARN software.amazon.awssdk.regions.internal.util.EC2MetadataUtils: Unable to retrieve the requested metadata.
INFO:apache_beam.utils.subprocess_server:22/08/30 19:31:53 WARN software.amazon.awssdk.regions.internal.util.EC2MetadataUtils: Unable to retrieve the requested metadata.
INFO:apache_beam.utils.subprocess_server:22/08/30 19:31:53 WARN software.amazon.awssdk.regions.internal.util.EC2MetadataUtils: Unable to retrieve the requested metadata.
INFO:apache_beam.utils.subprocess_server:22/08/30 19:31:53 WARN software.amazon.awssdk.regions.internal.util.EC2MetadataUtils: Unable to retrieve the requested metadata.
INFO:apache_beam.utils.subprocess_server:22/08/30 19:31:53 INFO org.apache.beam.runners.fnexecution.control.FnApiControlClientPoolService: getProcessBundleDescriptor request with id 1-4
INFO:apache_beam.utils.subprocess_server:22/08/30 19:31:53 INFO org.apache.beam.runners.fnexecution.control.FnApiControlClientPoolService: getProcessBundleDescriptor request with id 1-5
INFO:apache_beam.utils.subprocess_server:22/08/30 19:31:53 WARN software.amazon.awssdk.regions.internal.util.EC2MetadataUtils: Unable to retrieve the requested metadata.
INFO:apache_beam.utils.subprocess_server:22/08/30 19:31:53 WARN software.amazon.awssdk.regions.internal.util.EC2MetadataUtils: Unable to retrieve the requested metadata.
INFO:apache_beam.utils.subprocess_server:22/08/30 19:31:53 WARN software.amazon.awssdk.regions.internal.util.EC2MetadataUtils: Unable to retrieve the requested metadata.
INFO:apache_beam.utils.subprocess_server:22/08/30 19:31:53 WARN software.amazon.awssdk.regions.internal.util.EC2MetadataUtils: Unable to retrieve the requested metadata.
INFO:apache_beam.utils.subprocess_server:22/08/30 19:31:53 INFO org.apache.beam.runners.fnexecution.control.FnApiControlClientPoolService: getProcessBundleDescriptor request with id 1-6
INFO:apache_beam.utils.subprocess_server:22/08/30 19:31:53 INFO org.apache.beam.runners.fnexecution.control.FnApiControlClientPoolService: getProcessBundleDescriptor request with id 1-7
INFO:apache_beam.utils.subprocess_server:22/08/30 19:31:53 INFO org.apache.beam.runners.fnexecution.control.FnApiControlClientPoolService: getProcessBundleDescriptor request with id 1-9
INFO:apache_beam.utils.subprocess_server:22/08/30 19:31:53 INFO org.apache.beam.runners.fnexecution.control.FnApiControlClientPoolService: getProcessBundleDescriptor request with id 1-8
INFO:apache_beam.utils.subprocess_server:22/08/30 19:31:53 INFO org.apache.beam.runners.fnexecution.control.FnApiControlClientPoolService: getProcessBundleDescriptor request with id 1-10
INFO:apache_beam.utils.subprocess_server:22/08/30 19:31:53 INFO org.apache.beam.runners.fnexecution.control.FnApiControlClientPoolService: getProcessBundleDescriptor request with id 1-11
INFO:apache_beam.utils.subprocess_server:22/08/30 19:31:53 INFO org.apache.beam.runners.fnexecution.control.FnApiControlClientPoolService: getProcessBundleDescriptor request with id 1-12
INFO:apache_beam.utils.subprocess_server:22/08/30 19:31:53 INFO org.apache.beam.runners.fnexecution.control.FnApiControlClientPoolService: getProcessBundleDescriptor request with id 1-13
INFO:apache_beam.utils.subprocess_server:22/08/30 19:31:53 WARN software.amazon.awssdk.regions.internal.util.EC2MetadataUtils: Unable to retrieve the requested metadata.
INFO:apache_beam.utils.subprocess_server:22/08/30 19:31:53 WARN software.amazon.awssdk.regions.internal.util.EC2MetadataUtils: Unable to retrieve the requested metadata.
INFO:apache_beam.utils.subprocess_server:22/08/30 19:31:53 WARN software.amazon.awssdk.regions.internal.util.EC2MetadataUtils: Unable to retrieve the requested metadata.
INFO:apache_beam.utils.subprocess_server:22/08/30 19:31:53 WARN software.amazon.awssdk.regions.internal.util.EC2MetadataUtils: Unable to retrieve the requested metadata.
INFO:apache_beam.utils.subprocess_server:22/08/30 19:31:53 INFO org.apache.beam.runners.fnexecution.control.FnApiControlClientPoolService: getProcessBundleDescriptor request with id 1-14
INFO:apache_beam.utils.subprocess_server:22/08/30 19:31:54 WARN software.amazon.awssdk.regions.internal.util.EC2MetadataUtils: Unable to retrieve the requested metadata.
INFO:apache_beam.utils.subprocess_server:22/08/30 19:31:54 WARN software.amazon.awssdk.regions.internal.util.EC2MetadataUtils: Unable to retrieve the requested metadata.
INFO:apache_beam.utils.subprocess_server:22/08/30 19:31:54 WARN software.amazon.awssdk.regions.internal.util.EC2MetadataUtils: Unable to retrieve the requested metadata.
INFO:apache_beam.utils.subprocess_server:22/08/30 19:31:54 WARN software.amazon.awssdk.regions.internal.util.EC2MetadataUtils: Unable to retrieve the requested metadata.
INFO:apache_beam.utils.subprocess_server:22/08/30 19:31:54 INFO org.apache.beam.runners.fnexecution.control.FnApiControlClientPoolService: getProcessBundleDescriptor request with id 1-15
INFO:apache_beam.utils.subprocess_server:22/08/30 19:31:54 INFO org.apache.beam.runners.spark.SparkPipelineRunner: Job BeamApp-jenkins-0830193150-350b1270_7c4decd8-507a-4781-8360-823e7eb05c59: Pipeline translated successfully. Computing outputs
INFO:apache_beam.utils.subprocess_server:22/08/30 19:31:54 WARN software.amazon.awssdk.regions.internal.util.EC2MetadataUtils: Unable to retrieve the requested metadata.
INFO:apache_beam.utils.subprocess_server:22/08/30 19:31:54 WARN software.amazon.awssdk.regions.internal.util.EC2MetadataUtils: Unable to retrieve the requested metadata.
INFO:apache_beam.utils.subprocess_server:22/08/30 19:31:54 WARN software.amazon.awssdk.regions.internal.util.EC2MetadataUtils: Unable to retrieve the requested metadata.
INFO:apache_beam.utils.subprocess_server:22/08/30 19:31:54 WARN software.amazon.awssdk.regions.internal.util.EC2MetadataUtils: Unable to retrieve the requested metadata.
INFO:apache_beam.io.filebasedsink:Starting finalize_write threads with num_shards: 4 (skipped: 0), batches: 4, num_threads: 4
INFO:apache_beam.utils.subprocess_server:22/08/30 19:31:54 INFO org.apache.beam.runners.fnexecution.control.FnApiControlClientPoolService: getProcessBundleDescriptor request with id 1-16
INFO:apache_beam.io.filebasedsink:Renamed 4 shards in 0.10 seconds.
INFO:apache_beam.utils.subprocess_server:22/08/30 19:31:54 INFO org.apache.beam.runners.spark.SparkPipelineRunner: Job BeamApp-jenkins-0830193150-350b1270_7c4decd8-507a-4781-8360-823e7eb05c59 finished.
INFO:apache_beam.runners.portability.portable_runner:Job state changed to DONE
ERROR:apache_beam.runners.worker.data_plane:Failed to read inputs in the data plane.
Traceback (most recent call last):
  File "/home/jenkins/jenkins-slave/workspace/beam_PostCommit_Python37/src/sdks/python/apache_beam/runners/worker/data_plane.py", line 654, in _read_inputs
    for elements in elements_iterator:
  File "/home/jenkins/jenkins-slave/workspace/beam_PostCommit_Python37/src/build/gradleenv/2022703441/lib/python3.7/site-packages/grpc/_channel.py", line 426, in __next__
    return self._next()
  File "/home/jenkins/jenkins-slave/workspace/beam_PostCommit_Python37/src/build/gradleenv/2022703441/lib/python3.7/site-packages/grpc/_channel.py", line 826, in _next
    raise self
grpc._channel._MultiThreadedRendezvous: <_MultiThreadedRendezvous of RPC that terminated with:
	status = StatusCode.UNAVAILABLE
	details = "Socket closed"
	debug_error_string = "{"created":"@1661887914.773261459","description":"Error received from peer ipv6:[::1]:37323","file":"src/core/lib/surface/call.cc","file_line":966,"grpc_message":"Socket closed","grpc_status":14}"
>
Exception in thread run_worker_1-1:
Traceback (most recent call last):
  File "/usr/lib/python3.7/threading.py", line 926, in _bootstrap_inner
    self.run()
  File "/usr/lib/python3.7/threading.py", line 870, in run
    self._target(*self._args, **self._kwargs)
  File "/home/jenkins/jenkins-slave/workspace/beam_PostCommit_Python37/src/sdks/python/apache_beam/runners/worker/sdk_worker.py", line 251, in run
    for work_request in self._control_stub.Control(get_responses()):
  File "/home/jenkins/jenkins-slave/workspace/beam_PostCommit_Python37/src/build/gradleenv/2022703441/lib/python3.7/site-packages/grpc/_channel.py", line 426, in __next__
    return self._next()
  File "/home/jenkins/jenkins-slave/workspace/beam_PostCommit_Python37/src/build/gradleenv/2022703441/lib/python3.7/site-packages/grpc/_channel.py", line 826, in _next
    raise self
grpc._channel._MultiThreadedRendezvous: <_MultiThreadedRendezvous of RPC that terminated with:
	status = StatusCode.UNAVAILABLE
	details = "Connection reset by peer"
	debug_error_string = "{"created":"@1661887914.774284582","description":"Error received from peer ipv6:[::1]:38091","file":"src/core/lib/surface/call.cc","file_line":966,"grpc_message":"Connection reset by peer","grpc_status":14}"
>

Exception in thread read_grpc_client_inputs:
Traceback (most recent call last):
  File "/usr/lib/python3.7/threading.py", line 926, in _bootstrap_inner
    self.run()
  File "/usr/lib/python3.7/threading.py", line 870, in run
    self._target(*self._args, **self._kwargs)
  File "/home/jenkins/jenkins-slave/workspace/beam_PostCommit_Python37/src/sdks/python/apache_beam/runners/worker/data_plane.py", line 671, in <lambda>
    target=lambda: self._read_inputs(elements_iterator),
  File "/home/jenkins/jenkins-slave/workspace/beam_PostCommit_Python37/src/sdks/python/apache_beam/runners/worker/data_plane.py", line 654, in _read_inputs
    for elements in elements_iterator:
  File "/home/jenkins/jenkins-slave/workspace/beam_PostCommit_Python37/src/build/gradleenv/2022703441/lib/python3.7/site-packages/grpc/_channel.py", line 426, in __next__
    return self._next()
  File "/home/jenkins/jenkins-slave/workspace/beam_PostCommit_Python37/src/build/gradleenv/2022703441/lib/python3.7/site-packages/grpc/_channel.py", line 826, in _next
    raise self
grpc._channel._MultiThreadedRendezvous: <_MultiThreadedRendezvous of RPC that terminated with:
	status = StatusCode.UNAVAILABLE
	details = "Socket closed"
	debug_error_string = "{"created":"@1661887914.773261459","description":"Error received from peer ipv6:[::1]:37323","file":"src/core/lib/surface/call.cc","file_line":966,"grpc_message":"Socket closed","grpc_status":14}"
>

Exception in thread read_state:
Traceback (most recent call last):
  File "/usr/lib/python3.7/threading.py", line 926, in _bootstrap_inner
    self.run()
  File "/usr/lib/python3.7/threading.py", line 870, in run
    self._target(*self._args, **self._kwargs)
  File "/home/jenkins/jenkins-slave/workspace/beam_PostCommit_Python37/src/sdks/python/apache_beam/runners/worker/sdk_worker.py", line 1008, in pull_responses
    for response in responses:
  File "/home/jenkins/jenkins-slave/workspace/beam_PostCommit_Python37/src/build/gradleenv/2022703441/lib/python3.7/site-packages/grpc/_channel.py", line 426, in __next__
    return self._next()
  File "/home/jenkins/jenkins-slave/workspace/beam_PostCommit_Python37/src/build/gradleenv/2022703441/lib/python3.7/site-packages/grpc/_channel.py", line 826, in _next
    raise self
grpc._channel._MultiThreadedRendezvous: <_MultiThreadedRendezvous of RPC that terminated with:
	status = StatusCode.UNAVAILABLE
	details = "Socket closed"
	debug_error_string = "{"created":"@1661887914.773325667","description":"Error received from peer ipv6:[::1]:45351","file":"src/core/lib/surface/call.cc","file_line":966,"grpc_message":"Socket closed","grpc_status":14}"
>


> Task :sdks:python:test-suites:portable:py37:postCommitPy37
> Task :sdks:python:test-suites:portable:py37:xlangSpannerIOIT
FATAL: command execution failed
java.io.IOException: Backing channel 'apache-beam-jenkins-3' is disconnected.
	at hudson.remoting.RemoteInvocationHandler.channelOrFail(RemoteInvocationHandler.java:215)
	at hudson.remoting.RemoteInvocationHandler.invoke(RemoteInvocationHandler.java:285)
	at com.sun.proxy.$Proxy138.isAlive(Unknown Source)
	at hudson.Launcher$RemoteLauncher$ProcImpl.isAlive(Launcher.java:1215)
	at hudson.Launcher$RemoteLauncher$ProcImpl.join(Launcher.java:1207)
	at hudson.Launcher$ProcStarter.join(Launcher.java:524)
	at hudson.plugins.gradle.Gradle.perform(Gradle.java:317)
	at hudson.tasks.BuildStepMonitor$1.perform(BuildStepMonitor.java:20)
	at hudson.model.AbstractBuild$AbstractBuildExecution.perform(AbstractBuild.java:814)
	at hudson.model.Build$BuildExecution.build(Build.java:199)
	at hudson.model.Build$BuildExecution.doRun(Build.java:164)
	at hudson.model.AbstractBuild$AbstractBuildExecution.run(AbstractBuild.java:522)
	at hudson.model.Run.execute(Run.java:1896)
	at hudson.model.FreeStyleBuild.run(FreeStyleBuild.java:44)
	at hudson.model.ResourceController.execute(ResourceController.java:101)
	at hudson.model.Executor.run(Executor.java:442)
Caused by: java.io.IOException: Unexpected termination of the channel
	at hudson.remoting.SynchronousCommandTransport$ReaderThread.run(SynchronousCommandTransport.java:75)
Caused by: java.io.EOFException
	at java.base/java.io.ObjectInputStream$PeekInputStream.readFully(ObjectInputStream.java:2905)
	at java.base/java.io.ObjectInputStream$BlockDataInputStream.readShort(ObjectInputStream.java:3400)
	at java.base/java.io.ObjectInputStream.readStreamHeader(ObjectInputStream.java:936)
	at java.base/java.io.ObjectInputStream.<init>(ObjectInputStream.java:379)
	at hudson.remoting.ObjectInputStreamEx.<init>(ObjectInputStreamEx.java:49)
	at hudson.remoting.Command.readFrom(Command.java:142)
	at hudson.remoting.Command.readFrom(Command.java:128)
	at hudson.remoting.AbstractSynchronousByteArrayCommandTransport.read(AbstractSynchronousByteArrayCommandTransport.java:35)
	at hudson.remoting.SynchronousCommandTransport$ReaderThread.run(SynchronousCommandTransport.java:61)
Build step 'Invoke Gradle script' changed build result to FAILURE
Build step 'Invoke Gradle script' marked build as failure
ERROR: apache-beam-jenkins-3 is offline; cannot locate jdk_1.8_latest

---------------------------------------------------------------------
To unsubscribe, e-mail: builds-unsubscribe@beam.apache.org
For additional commands, e-mail: builds-help@beam.apache.org


Jenkins build is back to normal : beam_PostCommit_Python37 #5660

Posted by Apache Jenkins Server <je...@builds.apache.org>.
See <https://ci-beam.apache.org/job/beam_PostCommit_Python37/5660/display/redirect?page=changes>


---------------------------------------------------------------------
To unsubscribe, e-mail: builds-unsubscribe@beam.apache.org
For additional commands, e-mail: builds-help@beam.apache.org


beam_PostCommit_Python37 - Build # 5659 - Aborted!

Posted by Apache Jenkins Server <je...@builds.apache.org>.
beam_PostCommit_Python37 - Build # 5659 - Aborted:

Check console output at https://ci-beam.apache.org/job/beam_PostCommit_Python37/5659/ to view the results.