You are viewing a plain text version of this content. The canonical link for it is here.
Posted to notification@tuscany.apache.org by Apache Jenkins Server <je...@builds.apache.org> on 2013/07/21 14:42:25 UTC

Build failed in Jenkins: Tuscany-2x #1088

See <https://builds.apache.org/job/Tuscany-2x/1088/>

------------------------------------------
[...truncated 22720 lines...]
[INFO] Using 'UTF-8' encoding to copy filtered resources.
[INFO] Copying 0 resource
[INFO] Copying 3 resources
[INFO] [compiler:testCompile {execution: default-testCompile}]
[INFO] Compiling 1 source file to <https://builds.apache.org/job/Tuscany-2x/ws/sca-2x/modules/implementation-widget/target/test-classes>
[INFO] [surefire:test {execution: default-test}]
[INFO] Surefire report directory: <https://builds.apache.org/job/Tuscany-2x/ws/sca-2x/modules/implementation-widget/target/surefire-reports>

-------------------------------------------------------
 T E S T S
-------------------------------------------------------
Running org.apache.tuscany.sca.implementation.widget.ImplementationWidgetProcessorTestCase
Tests run: 1, Failures: 0, Errors: 0, Skipped: 0, Time elapsed: 0.165 sec

Results :

Tests run: 1, Failures: 0, Errors: 0, Skipped: 0

[JENKINS] Recording test results
[INFO] [jar:jar {execution: default-jar}]
[INFO] Building jar: <https://builds.apache.org/job/Tuscany-2x/ws/sca-2x/modules/implementation-widget/target/tuscany-implementation-widget-2.5-SNAPSHOT.jar>
[INFO] [source:jar-no-fork {execution: attach-sources}]
[INFO] Building jar: <https://builds.apache.org/job/Tuscany-2x/ws/sca-2x/modules/implementation-widget/target/tuscany-implementation-widget-2.5-SNAPSHOT-sources.jar>
[INFO] [install:install {execution: default-install}]
[INFO] Installing <https://builds.apache.org/job/Tuscany-2x/ws/sca-2x/modules/implementation-widget/target/tuscany-implementation-widget-2.5-SNAPSHOT.jar> to <https://builds.apache.org/job/Tuscany-2x/ws/.repository/org/apache/tuscany/sca/tuscany-implementation-widget/2.5-SNAPSHOT/tuscany-implementation-widget-2.5-SNAPSHOT.jar>
[INFO] Installing <https://builds.apache.org/job/Tuscany-2x/ws/sca-2x/modules/implementation-widget/target/tuscany-implementation-widget-2.5-SNAPSHOT-sources.jar> to <https://builds.apache.org/job/Tuscany-2x/ws/.repository/org/apache/tuscany/sca/tuscany-implementation-widget/2.5-SNAPSHOT/tuscany-implementation-widget-2.5-SNAPSHOT-sources.jar>
[JENKINS] Archiving disabled
[INFO] ------------------------------------------------------------------------
[INFO] Building Apache Tuscany SCA Base Runtime Jar
[INFO]    task-segment: [clean, install]
[INFO] ------------------------------------------------------------------------
[INFO] [clean:clean {execution: default-clean}]
[INFO] [enforcer:enforce {execution: enforce-plugin-versions}]
[INFO] [remote-resources:process {execution: default}]
[INFO] [resources:resources {execution: default-resources}]
[INFO] Using 'UTF-8' encoding to copy filtered resources.
[INFO] Copying 3 resources
[INFO] Copying 1 resource
[INFO] Copying 3 resources
[INFO] [compiler:compile {execution: default-compile}]
[INFO] No sources to compile
[INFO] [resources:testResources {execution: default-testResources}]
[INFO] Using 'UTF-8' encoding to copy filtered resources.
[INFO] skip non existing resourceDirectory <https://builds.apache.org/job/Tuscany-2x/ws/sca-2x/modules/base-runtime/src/test/resources>
[INFO] Copying 3 resources
[INFO] [compiler:testCompile {execution: default-testCompile}]
[INFO] No sources to compile
[INFO] [surefire:test {execution: default-test}]
[INFO] Surefire report directory: <https://builds.apache.org/job/Tuscany-2x/ws/sca-2x/modules/base-runtime/target/surefire-reports>

-------------------------------------------------------
 T E S T S
-------------------------------------------------------
There are no tests to run.

Results :

Tests run: 0, Failures: 0, Errors: 0, Skipped: 0

[JENKINS] Recording test results
[INFO] [jar:jar {execution: default-jar}]
[INFO] Building jar: <https://builds.apache.org/job/Tuscany-2x/ws/sca-2x/modules/base-runtime/target/tuscany-base-runtime-2.5-SNAPSHOT.jar>
[INFO] [source:jar-no-fork {execution: attach-sources}]
[INFO] Building jar: <https://builds.apache.org/job/Tuscany-2x/ws/sca-2x/modules/base-runtime/target/tuscany-base-runtime-2.5-SNAPSHOT-sources.jar>
[INFO] [shade:shade {execution: default}]
[INFO] Including org.apache.tuscany.sca:tuscany-domain-node:jar:2.5-SNAPSHOT in the shaded jar.
[INFO] snapshot org.apache.tuscany.sca:tuscany-domain-node:2.5-SNAPSHOT: checking for updates from apache.nexus
[INFO] snapshot org.apache.tuscany.sca:tuscany-domain-node:2.5-SNAPSHOT: checking for updates from apache.snapshots
[INFO] Including org.apache.tuscany.sca:tuscany-node-impl:jar:2.5-SNAPSHOT in the shaded jar.
[INFO] snapshot org.apache.tuscany.sca:tuscany-node-impl:2.5-SNAPSHOT: checking for updates from apache.nexus
[INFO] snapshot org.apache.tuscany.sca:tuscany-node-impl:2.5-SNAPSHOT: checking for updates from apache.snapshots
[INFO] Including org.apache.tuscany.sca:tuscany-assembly:jar:2.5-SNAPSHOT in the shaded jar.
[INFO] snapshot org.apache.tuscany.sca:tuscany-assembly:2.5-SNAPSHOT: checking for updates from apache.nexus
[INFO] snapshot org.apache.tuscany.sca:tuscany-assembly:2.5-SNAPSHOT: checking for updates from apache.snapshots
[INFO] Including org.apache.tuscany.sca:tuscany-monitor:jar:2.5-SNAPSHOT in the shaded jar.
[INFO] snapshot org.apache.tuscany.sca:tuscany-monitor:2.5-SNAPSHOT: checking for updates from apache.nexus
[INFO] snapshot org.apache.tuscany.sca:tuscany-monitor:2.5-SNAPSHOT: checking for updates from apache.snapshots
[INFO] Including org.apache.tuscany.sca:tuscany-extensibility:jar:2.5-SNAPSHOT in the shaded jar.
[INFO] snapshot org.apache.tuscany.sca:tuscany-extensibility:2.5-SNAPSHOT: checking for updates from apache.nexus
[INFO] snapshot org.apache.tuscany.sca:tuscany-extensibility:2.5-SNAPSHOT: checking for updates from apache.snapshots
[INFO] Including org.apache.tuscany.sca:tuscany-contribution:jar:2.5-SNAPSHOT in the shaded jar.
[INFO] snapshot org.apache.tuscany.sca:tuscany-contribution:2.5-SNAPSHOT: checking for updates from apache.nexus
[INFO] snapshot org.apache.tuscany.sca:tuscany-contribution:2.5-SNAPSHOT: checking for updates from apache.snapshots
[INFO] Including org.apache.tuscany.sca:tuscany-assembly-xsd:jar:2.5-SNAPSHOT in the shaded jar.
[INFO] snapshot org.apache.tuscany.sca:tuscany-assembly-xsd:2.5-SNAPSHOT: checking for updates from apache.nexus
[INFO] snapshot org.apache.tuscany.sca:tuscany-assembly-xsd:2.5-SNAPSHOT: checking for updates from apache.snapshots
[INFO] Including org.apache.tuscany.sca:tuscany-common-xml:jar:2.5-SNAPSHOT in the shaded jar.
[INFO] snapshot org.apache.tuscany.sca:tuscany-common-xml:2.5-SNAPSHOT: checking for updates from apache.nexus
[INFO] snapshot org.apache.tuscany.sca:tuscany-common-xml:2.5-SNAPSHOT: checking for updates from apache.snapshots
[INFO] Including org.apache.tuscany.sca:tuscany-common-java:jar:2.5-SNAPSHOT in the shaded jar.
[INFO] snapshot org.apache.tuscany.sca:tuscany-common-java:2.5-SNAPSHOT: checking for updates from apache.nexus
[INFO] snapshot org.apache.tuscany.sca:tuscany-common-java:2.5-SNAPSHOT: checking for updates from apache.snapshots
[INFO] Including org.apache.tuscany.sca:tuscany-sca-api:jar:2.5-SNAPSHOT in the shaded jar.
[INFO] snapshot org.apache.tuscany.sca:tuscany-sca-api:2.5-SNAPSHOT: checking for updates from apache.nexus
[INFO] snapshot org.apache.tuscany.sca:tuscany-sca-api:2.5-SNAPSHOT: checking for updates from apache.snapshots
[INFO] Including org.apache.tuscany.sca:tuscany-node-api:jar:2.5-SNAPSHOT in the shaded jar.
[INFO] snapshot org.apache.tuscany.sca:tuscany-node-api:2.5-SNAPSHOT: checking for updates from apache.nexus
[INFO] snapshot org.apache.tuscany.sca:tuscany-node-api:2.5-SNAPSHOT: checking for updates from apache.snapshots
[INFO] Including org.apache.tuscany.sca:tuscany-core:jar:2.5-SNAPSHOT in the shaded jar.
[INFO] snapshot org.apache.tuscany.sca:tuscany-core:2.5-SNAPSHOT: checking for updates from apache.nexus
[INFO] snapshot org.apache.tuscany.sca:tuscany-core:2.5-SNAPSHOT: checking for updates from apache.snapshots
[INFO] Including org.apache.tuscany.sca:tuscany-core-spi:jar:2.5-SNAPSHOT in the shaded jar.
[INFO] snapshot org.apache.tuscany.sca:tuscany-core-spi:2.5-SNAPSHOT: checking for updates from apache.nexus
[INFO] snapshot org.apache.tuscany.sca:tuscany-core-spi:2.5-SNAPSHOT: checking for updates from apache.snapshots
[INFO] Including org.apache.tuscany.sca:tuscany-interface-java:jar:2.5-SNAPSHOT in the shaded jar.
[INFO] snapshot org.apache.tuscany.sca:tuscany-interface-java:2.5-SNAPSHOT: checking for updates from apache.nexus
[INFO] snapshot org.apache.tuscany.sca:tuscany-interface-java:2.5-SNAPSHOT: checking for updates from apache.snapshots
[INFO] Including org.apache.tuscany.sca:tuscany-assembly-xml:jar:2.5-SNAPSHOT in the shaded jar.
[INFO] snapshot org.apache.tuscany.sca:tuscany-assembly-xml:2.5-SNAPSHOT: checking for updates from apache.nexus
[INFO] snapshot org.apache.tuscany.sca:tuscany-assembly-xml:2.5-SNAPSHOT: checking for updates from apache.snapshots
[INFO] Including org.apache.tuscany.sca:tuscany-xsd:jar:2.5-SNAPSHOT in the shaded jar.
[INFO] snapshot org.apache.tuscany.sca:tuscany-xsd:2.5-SNAPSHOT: checking for updates from apache.nexus
[INFO] snapshot org.apache.tuscany.sca:tuscany-xsd:2.5-SNAPSHOT: checking for updates from apache.snapshots
[INFO] Excluding org.apache.ws.commons.schema:XmlSchema:jar:1.4.3 from the shaded jar.
[INFO] Including org.apache.tuscany.sca:tuscany-interface-wsdl:jar:2.5-SNAPSHOT in the shaded jar.
[INFO] snapshot org.apache.tuscany.sca:tuscany-interface-wsdl:2.5-SNAPSHOT: checking for updates from apache.nexus
[INFO] snapshot org.apache.tuscany.sca:tuscany-interface-wsdl:2.5-SNAPSHOT: checking for updates from apache.snapshots
[INFO] Excluding wsdl4j:wsdl4j:jar:1.6.2 from the shaded jar.
[INFO] Excluding cglib:cglib:jar:2.2 from the shaded jar.
[INFO] Excluding asm:asm:jar:3.1 from the shaded jar.
[INFO] Including org.apache.tuscany.sca:tuscany-deployment:jar:2.5-SNAPSHOT in the shaded jar.
[INFO] snapshot org.apache.tuscany.sca:tuscany-deployment:2.5-SNAPSHOT: checking for updates from apache.nexus
[INFO] snapshot org.apache.tuscany.sca:tuscany-deployment:2.5-SNAPSHOT: checking for updates from apache.snapshots
[INFO] Including org.apache.tuscany.sca:tuscany-builder:jar:2.5-SNAPSHOT in the shaded jar.
[INFO] snapshot org.apache.tuscany.sca:tuscany-builder:2.5-SNAPSHOT: checking for updates from apache.nexus
[INFO] snapshot org.apache.tuscany.sca:tuscany-builder:2.5-SNAPSHOT: checking for updates from apache.snapshots
[INFO] Including org.apache.tuscany.sca:tuscany-databinding-jaxb:jar:2.5-SNAPSHOT in the shaded jar.
[INFO] snapshot org.apache.tuscany.sca:tuscany-databinding-jaxb:2.5-SNAPSHOT: checking for updates from apache.nexus
[INFO] snapshot org.apache.tuscany.sca:tuscany-databinding-jaxb:2.5-SNAPSHOT: checking for updates from apache.snapshots
[INFO] Including org.apache.tuscany.sca:tuscany-databinding:jar:2.5-SNAPSHOT in the shaded jar.
[INFO] snapshot org.apache.tuscany.sca:tuscany-databinding:2.5-SNAPSHOT: checking for updates from apache.nexus
[INFO] snapshot org.apache.tuscany.sca:tuscany-databinding:2.5-SNAPSHOT: checking for updates from apache.snapshots
[INFO] Including org.apache.tuscany.sca:tuscany-binding-sca-runtime:jar:2.5-SNAPSHOT in the shaded jar.
[INFO] snapshot org.apache.tuscany.sca:tuscany-binding-sca-runtime:2.5-SNAPSHOT: checking for updates from apache.nexus
[INFO] snapshot org.apache.tuscany.sca:tuscany-binding-sca-runtime:2.5-SNAPSHOT: checking for updates from apache.snapshots
[INFO] Including org.apache.tuscany.sca:tuscany-binding-ws-wsdlgen:jar:2.5-SNAPSHOT in the shaded jar.
[INFO] snapshot org.apache.tuscany.sca:tuscany-binding-ws-wsdlgen:2.5-SNAPSHOT: checking for updates from apache.nexus
[INFO] snapshot org.apache.tuscany.sca:tuscany-binding-ws-wsdlgen:2.5-SNAPSHOT: checking for updates from apache.snapshots
[INFO] Including org.apache.tuscany.sca:tuscany-binding-ws:jar:2.5-SNAPSHOT in the shaded jar.
[INFO] snapshot org.apache.tuscany.sca:tuscany-binding-ws:2.5-SNAPSHOT: checking for updates from apache.nexus
[INFO] snapshot org.apache.tuscany.sca:tuscany-binding-ws:2.5-SNAPSHOT: checking for updates from apache.snapshots
[INFO] Including org.apache.tuscany.sca:tuscany-interface-java-jaxws:jar:2.5-SNAPSHOT in the shaded jar.
[INFO] snapshot org.apache.tuscany.sca:tuscany-interface-java-jaxws:2.5-SNAPSHOT: checking for updates from apache.nexus
[INFO] snapshot org.apache.tuscany.sca:tuscany-interface-java-jaxws:2.5-SNAPSHOT: checking for updates from apache.snapshots
[INFO] Including org.apache.tuscany.sca:tuscany-core-databinding:jar:2.5-SNAPSHOT in the shaded jar.
[INFO] snapshot org.apache.tuscany.sca:tuscany-core-databinding:2.5-SNAPSHOT: checking for updates from apache.nexus
[INFO] snapshot org.apache.tuscany.sca:tuscany-core-databinding:2.5-SNAPSHOT: checking for updates from apache.snapshots
[INFO] Including org.apache.tuscany.sca:tuscany-implementation-web-runtime:jar:2.5-SNAPSHOT in the shaded jar.
[INFO] snapshot org.apache.tuscany.sca:tuscany-implementation-web-runtime:2.5-SNAPSHOT: checking for updates from apache.nexus
[INFO] snapshot org.apache.tuscany.sca:tuscany-implementation-web-runtime:2.5-SNAPSHOT: checking for updates from apache.snapshots
[INFO] Including org.apache.tuscany.sca:tuscany-implementation-web:jar:2.5-SNAPSHOT in the shaded jar.
[INFO] snapshot org.apache.tuscany.sca:tuscany-implementation-web:2.5-SNAPSHOT: checking for updates from apache.nexus
[INFO] snapshot org.apache.tuscany.sca:tuscany-implementation-web:2.5-SNAPSHOT: checking for updates from apache.snapshots
[INFO] Including org.apache.tuscany.sca:tuscany-implementation-java-runtime:jar:2.5-SNAPSHOT in the shaded jar.
[INFO] snapshot org.apache.tuscany.sca:tuscany-implementation-java-runtime:2.5-SNAPSHOT: checking for updates from apache.nexus
[INFO] snapshot org.apache.tuscany.sca:tuscany-implementation-java-runtime:2.5-SNAPSHOT: checking for updates from apache.snapshots
[INFO] Including org.apache.tuscany.sca:tuscany-implementation-java:jar:2.5-SNAPSHOT in the shaded jar.
[INFO] snapshot org.apache.tuscany.sca:tuscany-implementation-java:2.5-SNAPSHOT: checking for updates from apache.nexus
[INFO] snapshot org.apache.tuscany.sca:tuscany-implementation-java:2.5-SNAPSHOT: checking for updates from apache.snapshots
[INFO] Including org.apache.tuscany.sca:tuscany-host-webapp:jar:2.5-SNAPSHOT in the shaded jar.
[INFO] snapshot org.apache.tuscany.sca:tuscany-host-webapp:2.5-SNAPSHOT: checking for updates from apache.nexus
[INFO] snapshot org.apache.tuscany.sca:tuscany-host-webapp:2.5-SNAPSHOT: checking for updates from apache.snapshots
[INFO] Including org.apache.tuscany.sca:tuscany-host-http:jar:2.5-SNAPSHOT in the shaded jar.
[INFO] snapshot org.apache.tuscany.sca:tuscany-host-http:2.5-SNAPSHOT: checking for updates from apache.nexus
[INFO] snapshot org.apache.tuscany.sca:tuscany-host-http:2.5-SNAPSHOT: checking for updates from apache.snapshots
[INFO] Including org.apache.tuscany.sca:tuscany-launcher:jar:2.5-SNAPSHOT in the shaded jar.
[INFO] snapshot org.apache.tuscany.sca:tuscany-launcher:2.5-SNAPSHOT: checking for updates from apache.nexus
[INFO] snapshot org.apache.tuscany.sca:tuscany-launcher:2.5-SNAPSHOT: checking for updates from apache.snapshots
[INFO] Including org.apache.tuscany.sca:tuscany-sca-client-impl:jar:2.5-SNAPSHOT in the shaded jar.
[INFO] snapshot org.apache.tuscany.sca:tuscany-sca-client-impl:2.5-SNAPSHOT: checking for updates from apache.nexus
[INFO] snapshot org.apache.tuscany.sca:tuscany-sca-client-impl:2.5-SNAPSHOT: checking for updates from apache.snapshots
[INFO] Including org.apache.tuscany.sca:tuscany-host-jetty:jar:2.5-SNAPSHOT in the shaded jar.
[INFO] snapshot org.apache.tuscany.sca:tuscany-host-jetty:2.5-SNAPSHOT: checking for updates from apache.nexus
[INFO] snapshot org.apache.tuscany.sca:tuscany-host-jetty:2.5-SNAPSHOT: checking for updates from apache.snapshots
[INFO] Including org.apache.tuscany.sca:tuscany-shell:jar:2.5-SNAPSHOT in the shaded jar.
[INFO] snapshot org.apache.tuscany.sca:tuscany-shell:2.5-SNAPSHOT: checking for updates from apache.nexus
[INFO] snapshot org.apache.tuscany.sca:tuscany-shell:2.5-SNAPSHOT: checking for updates from apache.snapshots
[INFO] Including org.apache.tuscany.sca:tuscany-stripes:jar:2.5-SNAPSHOT in the shaded jar.
[INFO] snapshot org.apache.tuscany.sca:tuscany-stripes:2.5-SNAPSHOT: checking for updates from apache.nexus
[INFO] snapshot org.apache.tuscany.sca:tuscany-stripes:2.5-SNAPSHOT: checking for updates from apache.snapshots
[INFO] Including org.apache.tuscany.sca:tuscany-wink:jar:2.5-SNAPSHOT in the shaded jar.
[INFO] snapshot org.apache.tuscany.sca:tuscany-wink:2.5-SNAPSHOT: checking for updates from apache.nexus
[INFO] snapshot org.apache.tuscany.sca:tuscany-wink:2.5-SNAPSHOT: checking for updates from apache.snapshots
[INFO] Including org.apache.tuscany.sca:tuscany-binding-ws-runtime-jaxws-ri:jar:2.5-SNAPSHOT in the shaded jar.
[INFO] snapshot org.apache.tuscany.sca:tuscany-binding-ws-runtime-jaxws-ri:2.5-SNAPSHOT: checking for updates from apache.nexus
[INFO] snapshot org.apache.tuscany.sca:tuscany-binding-ws-runtime-jaxws-ri:2.5-SNAPSHOT: checking for updates from apache.snapshots
[INFO] Including org.apache.tuscany.sca:tuscany-binding-ws-runtime-jaxws:jar:2.5-SNAPSHOT in the shaded jar.
[INFO] snapshot org.apache.tuscany.sca:tuscany-binding-ws-runtime-jaxws:2.5-SNAPSHOT: checking for updates from apache.nexus
[INFO] snapshot org.apache.tuscany.sca:tuscany-binding-ws-runtime-jaxws:2.5-SNAPSHOT: checking for updates from apache.snapshots
[INFO] Including org.apache.tuscany.sca:tuscany-data-api:jar:2.5-SNAPSHOT in the shaded jar.
[INFO] snapshot org.apache.tuscany.sca:tuscany-data-api:2.5-SNAPSHOT: checking for updates from apache.nexus
[INFO] snapshot org.apache.tuscany.sca:tuscany-data-api:2.5-SNAPSHOT: checking for updates from apache.snapshots
[INFO] Including org.apache.tuscany.sca:tuscany-policy-security:jar:2.5-SNAPSHOT in the shaded jar.
[INFO] snapshot org.apache.tuscany.sca:tuscany-policy-security:2.5-SNAPSHOT: checking for updates from apache.nexus
[INFO] snapshot org.apache.tuscany.sca:tuscany-policy-security:2.5-SNAPSHOT: checking for updates from apache.snapshots
[INFO] Including org.apache.tuscany.sca:tuscany-binding-atom:jar:2.5-SNAPSHOT in the shaded jar.
[INFO] snapshot org.apache.tuscany.sca:tuscany-binding-atom:2.5-SNAPSHOT: checking for updates from apache.nexus
[INFO] snapshot org.apache.tuscany.sca:tuscany-binding-atom:2.5-SNAPSHOT: checking for updates from apache.snapshots
[INFO] Including org.apache.tuscany.sca:tuscany-binding-corba:jar:2.5-SNAPSHOT in the shaded jar.
[INFO] snapshot org.apache.tuscany.sca:tuscany-binding-corba:2.5-SNAPSHOT: checking for updates from apache.nexus
[INFO] snapshot org.apache.tuscany.sca:tuscany-binding-corba:2.5-SNAPSHOT: checking for updates from apache.snapshots
[INFO] Including org.apache.tuscany.sca:tuscany-host-corba:jar:2.5-SNAPSHOT in the shaded jar.
[INFO] snapshot org.apache.tuscany.sca:tuscany-host-corba:2.5-SNAPSHOT: checking for updates from apache.nexus
[INFO] snapshot org.apache.tuscany.sca:tuscany-host-corba:2.5-SNAPSHOT: checking for updates from apache.snapshots
[INFO] Including org.apache.tuscany.sca:tuscany-binding-ejb:jar:2.5-SNAPSHOT in the shaded jar.
[INFO] snapshot org.apache.tuscany.sca:tuscany-binding-ejb:2.5-SNAPSHOT: checking for updates from apache.nexus
[INFO] snapshot org.apache.tuscany.sca:tuscany-binding-ejb:2.5-SNAPSHOT: checking for updates from apache.snapshots
[INFO] Including org.apache.tuscany.sca:tuscany-binding-http:jar:2.5-SNAPSHOT in the shaded jar.
[INFO] snapshot org.apache.tuscany.sca:tuscany-binding-http:2.5-SNAPSHOT: checking for updates from apache.nexus
[INFO] snapshot org.apache.tuscany.sca:tuscany-binding-http:2.5-SNAPSHOT: checking for updates from apache.snapshots
[INFO] Including org.apache.tuscany.sca:tuscany-binding-jms:jar:2.5-SNAPSHOT in the shaded jar.
[INFO] snapshot org.apache.tuscany.sca:tuscany-binding-jms:2.5-SNAPSHOT: checking for updates from apache.nexus
[INFO] snapshot org.apache.tuscany.sca:tuscany-binding-jms:2.5-SNAPSHOT: checking for updates from apache.snapshots
[INFO] Including org.apache.tuscany.sca:tuscany-binding-jsonp:jar:2.5-SNAPSHOT in the shaded jar.
[INFO] snapshot org.apache.tuscany.sca:tuscany-binding-jsonp:2.5-SNAPSHOT: checking for updates from apache.nexus
[INFO] snapshot org.apache.tuscany.sca:tuscany-binding-jsonp:2.5-SNAPSHOT: checking for updates from apache.snapshots
[INFO] Including org.apache.tuscany.sca:tuscany-binding-jsonrpc:jar:2.5-SNAPSHOT in the shaded jar.
[INFO] snapshot org.apache.tuscany.sca:tuscany-binding-jsonrpc:2.5-SNAPSHOT: checking for updates from apache.nexus
[INFO] snapshot org.apache.tuscany.sca:tuscany-binding-jsonrpc:2.5-SNAPSHOT: checking for updates from apache.snapshots
[INFO] Including org.apache.tuscany.sca:tuscany-binding-rest:jar:2.5-SNAPSHOT in the shaded jar.
[INFO] snapshot org.apache.tuscany.sca:tuscany-binding-rest:2.5-SNAPSHOT: checking for updates from apache.nexus
[INFO] snapshot org.apache.tuscany.sca:tuscany-binding-rest:2.5-SNAPSHOT: checking for updates from apache.snapshots
[INFO] Including org.apache.tuscany.sca:tuscany-common-http:jar:2.5-SNAPSHOT in the shaded jar.
[INFO] snapshot org.apache.tuscany.sca:tuscany-common-http:2.5-SNAPSHOT: checking for updates from apache.nexus
[INFO] snapshot org.apache.tuscany.sca:tuscany-common-http:2.5-SNAPSHOT: checking for updates from apache.snapshots
[INFO] Including org.apache.tuscany.sca:tuscany-binding-rmi:jar:2.5-SNAPSHOT in the shaded jar.
[INFO] snapshot org.apache.tuscany.sca:tuscany-binding-rmi:2.5-SNAPSHOT: checking for updates from apache.nexus
[INFO] snapshot org.apache.tuscany.sca:tuscany-binding-rmi:2.5-SNAPSHOT: checking for updates from apache.snapshots
[INFO] Including org.apache.tuscany.sca:tuscany-implementation-bpel:jar:2.5-SNAPSHOT in the shaded jar.
[INFO] snapshot org.apache.tuscany.sca:tuscany-implementation-bpel:2.5-SNAPSHOT: checking for updates from apache.nexus
[INFO] snapshot org.apache.tuscany.sca:tuscany-implementation-bpel:2.5-SNAPSHOT: checking for updates from apache.snapshots
[INFO] Including org.apache.tuscany.sca:tuscany-implementation-script:jar:2.5-SNAPSHOT in the shaded jar.
[INFO] snapshot org.apache.tuscany.sca:tuscany-implementation-script:2.5-SNAPSHOT: checking for updates from apache.nexus
[INFO] snapshot org.apache.tuscany.sca:tuscany-implementation-script:2.5-SNAPSHOT: checking for updates from apache.snapshots
[INFO] Including org.apache.tuscany.sca:tuscany-implementation-spring:jar:2.5-SNAPSHOT in the shaded jar.
[INFO] snapshot org.apache.tuscany.sca:tuscany-implementation-spring:2.5-SNAPSHOT: checking for updates from apache.nexus
[INFO] snapshot org.apache.tuscany.sca:tuscany-implementation-spring:2.5-SNAPSHOT: checking for updates from apache.snapshots
[INFO] Including org.apache.tuscany.sca:tuscany-implementation-widget:jar:2.5-SNAPSHOT in the shaded jar.
[INFO] snapshot org.apache.tuscany.sca:tuscany-implementation-widget:2.5-SNAPSHOT: checking for updates from apache.nexus
[INFO] snapshot org.apache.tuscany.sca:tuscany-implementation-widget:2.5-SNAPSHOT: checking for updates from apache.snapshots
[INFO] Replacing original artifact with shaded artifact.
[INFO] Replacing <https://builds.apache.org/job/Tuscany-2x/ws/sca-2x/modules/base-runtime/target/tuscany-base-runtime-2.5-SNAPSHOT.jar> with <https://builds.apache.org/job/Tuscany-2x/ws/sca-2x/modules/base-runtime/target/tuscany-base-runtime-2.5-SNAPSHOT-shaded.jar>
[INFO] Replacing <https://builds.apache.org/job/Tuscany-2x/ws/sca-2x/modules/base-runtime/target/tuscany-base-runtime-2.5-SNAPSHOT-sources.jar> with <https://builds.apache.org/job/Tuscany-2x/ws/sca-2x/modules/base-runtime/target/tuscany-base-runtime-2.5-SNAPSHOT-shaded-sources.jar>
[INFO] [install:install {execution: default-install}]
[INFO] Installing <https://builds.apache.org/job/Tuscany-2x/ws/sca-2x/modules/base-runtime/target/tuscany-base-runtime-2.5-SNAPSHOT.jar> to <https://builds.apache.org/job/Tuscany-2x/ws/.repository/org/apache/tuscany/sca/tuscany-base-runtime/2.5-SNAPSHOT/tuscany-base-runtime-2.5-SNAPSHOT.jar>
[INFO] Installing <https://builds.apache.org/job/Tuscany-2x/ws/sca-2x/modules/base-runtime/target/tuscany-base-runtime-2.5-SNAPSHOT-sources.jar> to <https://builds.apache.org/job/Tuscany-2x/ws/.repository/org/apache/tuscany/sca/tuscany-base-runtime/2.5-SNAPSHOT/tuscany-base-runtime-2.5-SNAPSHOT-sources.jar>
[INFO] Installing <https://builds.apache.org/job/Tuscany-2x/ws/sca-2x/modules/base-runtime/target/tuscany-base-runtime-2.5-SNAPSHOT-sources.jar> to <https://builds.apache.org/job/Tuscany-2x/ws/.repository/org/apache/tuscany/sca/tuscany-base-runtime/2.5-SNAPSHOT/tuscany-base-runtime-2.5-SNAPSHOT-sources.jar>
ERROR: Maven JVM terminated unexpectedly with exit code 143


Build failed in Jenkins: Tuscany-2x #1090

Posted by Apache Jenkins Server <je...@builds.apache.org>.
See <https://builds.apache.org/job/Tuscany-2x/1090/>

------------------------------------------
[...truncated 101577 lines...]
Jul 23, 2013 5:00:57 AM org.apache.tuscany.sca.core.assembly.impl.DomainRegistryImpl removeEndpoint
INFO: Remove endpoint - binding.sca - TEST_BWS_5001Component1/Service1
Jul 23, 2013 5:00:57 AM org.apache.tuscany.sca.core.assembly.impl.DomainRegistryImpl removeEndpoint
INFO: Remove endpoint - binding.ws - http://67.195.138.58:8080/TEST_BWS_5001Component1/Reference1
Jul 23, 2013 5:00:57 AM org.apache.tuscany.sca.http.jetty.JettyServer removeServletMapping
INFO: Removed Servlet mapping: /TEST_BWS_5001Component1/Reference1
Jul 23, 2013 5:00:57 AM org.apache.tuscany.sca.core.assembly.impl.DomainRegistryImpl removeEndpoint
INFO: Remove endpoint - binding.sca - TEST_BWS_5001Component1/TestComposite54TestComponent1/Service1
Jul 23, 2013 5:00:57 AM org.apache.tuscany.sca.core.assembly.impl.DomainRegistryImpl removeEndpoint
INFO: Remove endpoint - binding.sca - TEST_BWS_5001Component1/TestComposite54TestComponent1/reference1
Tests run: 1, Failures: 0, Errors: 0, Skipped: 0, Time elapsed: 0.33 sec
Running client_bws.BWS_4001_TestCase
Implementation language set to: _Java
Jul 23, 2013 5:00:57 AM org.apache.tuscany.sca.node.impl.NodeImpl start
INFO: Starting node: http://tuscany.apache.org/sca/1.1/nodes/default0 domain: default
Jul 23, 2013 5:00:57 AM org.apache.tuscany.sca.node.impl.NodeFactoryImpl loadContributions
INFO: Loading contribution: <https://builds.apache.org/job/Tuscany-2x/ws/sca-2x/testing/compliance-tests/binding-ws/target/oasis-contributions/BWS_General/target/BWS_General.zip>
Jul 23, 2013 5:00:57 AM org.apache.tuscany.sca.node.impl.NodeFactoryImpl loadContributions
INFO: Loading contribution: <https://builds.apache.org/job/Tuscany-2x/ws/sca-2x/testing/compliance-tests/binding-ws/target/oasis-contributions/BWS_General_Java/target/BWS_General_Java.zip>
Jul 23, 2013 5:00:57 AM org.apache.tuscany.sca.core.assembly.impl.DomainRegistryImpl addEndpoint
INFO: Add endpoint - binding.sca - TestClient/TestClient_0002TestClient/TestInvocation
Jul 23, 2013 5:00:57 AM org.apache.tuscany.sca.http.jetty.JettyLogger info
INFO: jetty-6.1.19
Jul 23, 2013 5:00:57 AM org.apache.tuscany.sca.http.jetty.JettyLogger info
INFO: Started SelectChannelConnector@0.0.0.0:8080
Jul 23, 2013 5:00:57 AM org.apache.tuscany.sca.http.jetty.JettyServer addServletMapping
INFO: Added Servlet mapping: http://67.195.138.58:8080/TestClient/TestInvocation
Jul 23, 2013 5:00:57 AM org.apache.tuscany.sca.core.assembly.impl.DomainRegistryImpl addEndpoint
INFO: Add endpoint - binding.ws - http://67.195.138.58:8080/TestClient/TestInvocation
Jul 23, 2013 5:00:57 AM org.apache.tuscany.sca.core.assembly.impl.DomainRegistryImpl addEndpoint
INFO: Add endpoint - binding.sca - TEST_BWS_4001Component1/TestComposite1Component1/Service1
Jul 23, 2013 5:00:57 AM org.apache.tuscany.sca.core.assembly.impl.DomainRegistryImpl addEndpoint
INFO: Add endpoint - binding.sca - TEST_BWS_4001Component1/Service1
Test BWS_4001 completed successfully
Jul 23, 2013 5:00:57 AM org.apache.tuscany.sca.node.impl.NodeImpl stop
INFO: Stopping node: http://tuscany.apache.org/sca/1.1/nodes/default0
Jul 23, 2013 5:00:57 AM org.apache.tuscany.sca.core.assembly.impl.DomainRegistryImpl removeEndpoint
INFO: Remove endpoint - binding.ws - http://67.195.138.58:8080/TestClient/TestInvocation
Jul 23, 2013 5:00:57 AM org.apache.tuscany.sca.http.jetty.JettyServer removeServletMapping
INFO: Removed Servlet mapping: /TestClient/TestInvocation
Jul 23, 2013 5:00:57 AM org.apache.tuscany.sca.core.assembly.impl.DomainRegistryImpl removeEndpoint
INFO: Remove endpoint - binding.sca - TestClient/TestClient_0002TestClient/TestInvocation
Jul 23, 2013 5:00:57 AM org.apache.tuscany.sca.core.assembly.impl.DomainRegistryImpl removeEndpoint
INFO: Remove endpoint - binding.sca - TEST_BWS_4001Component1/Service1
Jul 23, 2013 5:00:57 AM org.apache.tuscany.sca.core.assembly.impl.DomainRegistryImpl removeEndpoint
INFO: Remove endpoint - binding.sca - TEST_BWS_4001Component1/TestComposite1Component1/Service1
Tests run: 1, Failures: 0, Errors: 0, Skipped: 0, Time elapsed: 0.257 sec
Running client_bws.BWS_5006_TestCase
Implementation language set to: _Java
Jul 23, 2013 5:00:57 AM org.apache.tuscany.sca.node.impl.NodeImpl start
INFO: Starting node: http://tuscany.apache.org/sca/1.1/nodes/default0 domain: default
Jul 23, 2013 5:00:57 AM org.apache.tuscany.sca.node.impl.NodeFactoryImpl loadContributions
INFO: Loading contribution: <https://builds.apache.org/job/Tuscany-2x/ws/sca-2x/testing/compliance-tests/binding-ws/target/oasis-contributions/BWS_General/target/BWS_General.zip>
Jul 23, 2013 5:00:57 AM org.apache.tuscany.sca.node.impl.NodeFactoryImpl loadContributions
INFO: Loading contribution: <https://builds.apache.org/job/Tuscany-2x/ws/sca-2x/testing/compliance-tests/binding-ws/target/oasis-contributions/BWS_General_Java/target/BWS_General_Java.zip>
Jul 23, 2013 5:00:57 AM org.apache.tuscany.sca.core.assembly.impl.DomainRegistryImpl addEndpoint
INFO: Add endpoint - binding.sca - TEST_BWS_5006Component1/TestComposite55TestComponent1/Service5
Jul 23, 2013 5:00:57 AM org.apache.tuscany.sca.http.jetty.JettyLogger info
INFO: jetty-6.1.19
Jul 23, 2013 5:00:57 AM org.apache.tuscany.sca.http.jetty.JettyLogger info
INFO: Started SelectChannelConnector@0.0.0.0:8080
Jul 23, 2013 5:00:57 AM org.apache.tuscany.sca.http.jetty.JettyServer addServletMapping
INFO: Added Servlet mapping: http://67.195.138.58:8080/TEST_BWS_5006Component1/Service1
Jul 23, 2013 5:00:57 AM org.apache.tuscany.sca.core.assembly.impl.DomainRegistryImpl addEndpoint
INFO: Add endpoint - binding.ws - http://67.195.138.58:8080/TEST_BWS_5006Component1/Service1
>>> Starting external JAXWS service at: http://localhost:9081/JAXWS/Service5Callback
Service5 client - call address is: http://localhost:8080/TEST_BWS_5006Component1/Service1
wsa:To address found: http://localhost:9081/JAXWS/Service5Callback
wsa:Action value found: http://test.sca.oasisopen.org/TEST_BWS_5006Component1/Service1/Service5Callback/callback1Request
test:SCAProps value found: d85b3937-07c0-4a7f-a0dd-6d7f54c8413a
Test BWS_5006 completed successfully
Jul 23, 2013 5:00:57 AM org.apache.tuscany.sca.node.impl.NodeImpl stop
INFO: Stopping node: http://tuscany.apache.org/sca/1.1/nodes/default0
Jul 23, 2013 5:00:57 AM org.apache.tuscany.sca.core.assembly.impl.DomainRegistryImpl removeEndpoint
INFO: Remove endpoint - binding.ws - http://67.195.138.58:8080/TEST_BWS_5006Component1/Service1
Jul 23, 2013 5:00:57 AM org.apache.tuscany.sca.http.jetty.JettyServer removeServletMapping
INFO: Removed Servlet mapping: /TEST_BWS_5006Component1/Service1
Jul 23, 2013 5:00:57 AM org.apache.tuscany.sca.core.assembly.impl.DomainRegistryImpl removeEndpoint
INFO: Remove endpoint - binding.sca - TEST_BWS_5006Component1/TestComposite55TestComponent1/Service5
Tests run: 1, Failures: 0, Errors: 0, Skipped: 0, Time elapsed: 0.265 sec
Running client_bws.BWS_4005_TestCase
Implementation language set to: _Java
Jul 23, 2013 5:00:57 AM org.apache.tuscany.sca.node.impl.NodeImpl start
INFO: Starting node: http://tuscany.apache.org/sca/1.1/nodes/default0 domain: default
Jul 23, 2013 5:00:57 AM org.apache.tuscany.sca.node.impl.NodeFactoryImpl loadContributions
INFO: Loading contribution: <https://builds.apache.org/job/Tuscany-2x/ws/sca-2x/testing/compliance-tests/binding-ws/target/oasis-contributions/BWS_General/target/BWS_General.zip>
Jul 23, 2013 5:00:58 AM org.apache.tuscany.sca.node.impl.NodeFactoryImpl loadContributions
INFO: Loading contribution: <https://builds.apache.org/job/Tuscany-2x/ws/sca-2x/testing/compliance-tests/binding-ws/target/oasis-contributions/BWS_General_Java/target/BWS_General_Java.zip>
Jul 23, 2013 5:00:58 AM org.apache.tuscany.sca.core.assembly.impl.DomainRegistryImpl addEndpoint
INFO: Add endpoint - binding.sca - TestClient/TestClient_0002TestClient/TestInvocation
Jul 23, 2013 5:00:58 AM org.apache.tuscany.sca.http.jetty.JettyLogger info
INFO: jetty-6.1.19
Jul 23, 2013 5:00:58 AM org.apache.tuscany.sca.http.jetty.JettyLogger info
INFO: Started SelectChannelConnector@0.0.0.0:8080
Jul 23, 2013 5:00:58 AM org.apache.tuscany.sca.http.jetty.JettyServer addServletMapping
INFO: Added Servlet mapping: http://67.195.138.58:8080/TestClient/TestInvocation
Jul 23, 2013 5:00:58 AM org.apache.tuscany.sca.core.assembly.impl.DomainRegistryImpl addEndpoint
INFO: Add endpoint - binding.ws - http://67.195.138.58:8080/TestClient/TestInvocation
Jul 23, 2013 5:00:58 AM org.apache.tuscany.sca.core.assembly.impl.DomainRegistryImpl addEndpoint
INFO: Add endpoint - binding.sca - TEST_BWS_4005Component1/Composite4Component1/Service1
Jul 23, 2013 5:00:58 AM org.apache.tuscany.sca.core.assembly.impl.DomainRegistryImpl addEndpoint
INFO: Add endpoint - binding.sca - TEST_BWS_4005Component1/Service1
>>> Starting external JAXWS service at: http://localhost:9081/JAXWS/Service1
Test BWS_4005 completed successfully
Jul 23, 2013 5:00:58 AM org.apache.tuscany.sca.node.impl.NodeImpl stop
INFO: Stopping node: http://tuscany.apache.org/sca/1.1/nodes/default0
Jul 23, 2013 5:00:58 AM org.apache.tuscany.sca.core.assembly.impl.DomainRegistryImpl removeEndpoint
INFO: Remove endpoint - binding.ws - http://67.195.138.58:8080/TestClient/TestInvocation
Jul 23, 2013 5:00:58 AM org.apache.tuscany.sca.http.jetty.JettyServer removeServletMapping
INFO: Removed Servlet mapping: /TestClient/TestInvocation
Jul 23, 2013 5:00:58 AM org.apache.tuscany.sca.core.assembly.impl.DomainRegistryImpl removeEndpoint
INFO: Remove endpoint - binding.sca - TestClient/TestClient_0002TestClient/TestInvocation
Jul 23, 2013 5:00:58 AM org.apache.tuscany.sca.core.assembly.impl.DomainRegistryImpl removeEndpoint
INFO: Remove endpoint - binding.sca - TEST_BWS_4005Component1/Service1
Jul 23, 2013 5:00:58 AM org.apache.tuscany.sca.core.assembly.impl.DomainRegistryImpl removeEndpoint
INFO: Remove endpoint - binding.sca - TEST_BWS_4005Component1/Composite4Component1/Service1
Tests run: 1, Failures: 0, Errors: 0, Skipped: 0, Time elapsed: 0.279 sec

Results :

Tests run: 37, Failures: 0, Errors: 0, Skipped: 0

[JENKINS] Recording test results
[INFO] [jar:jar {execution: default-jar}]
[INFO] Building jar: <https://builds.apache.org/job/Tuscany-2x/ws/sca-2x/testing/compliance-tests/binding-ws/target/tuscany-compliance-test-binding-ws.jar>
[INFO] [install:install {execution: default-install}]
[INFO] Installing <https://builds.apache.org/job/Tuscany-2x/ws/sca-2x/testing/compliance-tests/binding-ws/target/tuscany-compliance-test-binding-ws.jar> to <https://builds.apache.org/job/Tuscany-2x/ws/.repository/org/apache/tuscany/sca/tuscany-compliance-test-binding-ws/2.5-SNAPSHOT/tuscany-compliance-test-binding-ws-2.5-SNAPSHOT.jar>
[JENKINS] Archiving disabled
[INFO] ------------------------------------------------------------------------
[INFO] Building Apache Tuscany SCA Specification Compliance Tests Binding JMS
[INFO]    task-segment: [clean, install]
[INFO] ------------------------------------------------------------------------
[INFO] [clean:clean {execution: default-clean}]
[INFO] snapshot org.apache.tuscany.sca:tuscany-otests-sca-jms-tests:2.0-SNAPSHOT: checking for updates from oasis.contributions
[INFO] snapshot org.apache.tuscany.sca:tuscany-otests-sca-jms-tests:2.0-SNAPSHOT: checking for updates from apache.snapshots
[INFO] snapshot org.apache.tuscany.sca:tuscany-otests-sca-jms-tests:2.0-SNAPSHOT: checking for updates from apache.nexus
Downloading: http://svn.apache.org/repos/asf/tuscany/maven/org/apache/tuscany/sca/tuscany-otests-sca-jms-tests/2.0-SNAPSHOT/tuscany-otests-sca-jms-tests-2.0-SNAPSHOT.pom
1K downloaded  (tuscany-otests-sca-jms-tests-2.0-SNAPSHOT.pom)
[WARNING] *** CHECKSUM FAILED - Error retrieving checksum file for org/apache/tuscany/sca/tuscany-otests-sca-jms-tests/2.0-SNAPSHOT/tuscany-otests-sca-jms-tests-2.0-SNAPSHOT.pom - IGNORING
[INFO] snapshot org.apache.tuscany.sca:tuscany-base-runtime:2.0-SNAPSHOT: checking for updates from oasis.contributions
[INFO] snapshot org.apache.tuscany.sca:tuscany-base-runtime:2.0-SNAPSHOT: checking for updates from apache.snapshots
[INFO] snapshot org.apache.tuscany.sca:tuscany-base-runtime:2.0-SNAPSHOT: checking for updates from apache.nexus
Downloading: https://repository.apache.org/content/groups/public//org/apache/tuscany/sca/tuscany-base-runtime/2.0-SNAPSHOT/tuscany-base-runtime-2.0-20120722.002354-261.pom

[INFO] snapshot org.apache.tuscany.sca:tuscany-binding-jms-runtime:2.0-SNAPSHOT: checking for updates from oasis.contributions
[INFO] snapshot org.apache.tuscany.sca:tuscany-binding-jms-runtime:2.0-SNAPSHOT: checking for updates from apache.snapshots
[INFO] snapshot org.apache.tuscany.sca:tuscany-binding-jms-runtime:2.0-SNAPSHOT: checking for updates from apache.nexus
Downloading: https://repository.apache.org/content/groups/public//org/apache/tuscany/sca/tuscany-binding-jms-runtime/2.0-SNAPSHOT/tuscany-binding-jms-runtime-2.0-20120722.002602-258.pom

Downloading: http://svn.apache.org/repos/asf/tuscany/maven/org/apache/activemq/activemq-all/5.2.0/activemq-all-5.2.0.pom
[INFO] Unable to find resource 'org.apache.activemq:activemq-all:pom:5.2.0' in repository oasis.contributions (http://svn.apache.org/repos/asf/tuscany/maven)
Downloading: http://repository.apache.org/snapshots/org/apache/activemq/activemq-all/5.2.0/activemq-all-5.2.0.pom
[INFO] Unable to find resource 'org.apache.activemq:activemq-all:pom:5.2.0' in repository apache.snapshots (http://repository.apache.org/snapshots)
Downloading: http://svn.apache.org/repos/asf/tuscany/maven/org/apache/activemq/activemq-all/5.2.0/activemq-all-5.2.0.pom
[INFO] Unable to find resource 'org.apache.activemq:activemq-all:pom:5.2.0' in repository tuscany.repo (http://svn.apache.org/repos/asf/tuscany/maven)
Downloading: https://repository.apache.org/content/groups/public//org/apache/activemq/activemq-all/5.2.0/activemq-all-5.2.0.pom

Downloading: http://svn.apache.org/repos/asf/tuscany/maven/org/apache/ws/security/wss4j/1.5.10/wss4j-1.5.10.jar
Downloading: http://svn.apache.org/repos/asf/tuscany/maven/org/apache/activemq/activemq-all/5.2.0/activemq-all-5.2.0.jar
Downloading: http://svn.apache.org/repos/asf/tuscany/maven/org/apache/tuscany/sca/tuscany-otests-sca-jms-tests/2.0-SNAPSHOT/tuscany-otests-sca-jms-tests-2.0-SNAPSHOT.jar
[INFO] Unable to find resource 'org.apache.ws.security:wss4j:jar:1.5.10' in repository oasis.contributions (http://svn.apache.org/repos/asf/tuscany/maven)
[INFO] Unable to find resource 'org.apache.activemq:activemq-all:jar:5.2.0' in repository oasis.contributions (http://svn.apache.org/repos/asf/tuscany/maven)
Downloading: http://repository.apache.org/snapshots/org/apache/ws/security/wss4j/1.5.10/wss4j-1.5.10.jar
Downloading: http://repository.apache.org/snapshots/org/apache/activemq/activemq-all/5.2.0/activemq-all-5.2.0.jar
[INFO] Unable to find resource 'org.apache.activemq:activemq-all:jar:5.2.0' in repository apache.snapshots (http://repository.apache.org/snapshots)
Downloading: http://svn.apache.org/repos/asf/tuscany/maven/org/apache/activemq/activemq-all/5.2.0/activemq-all-5.2.0.jar
[INFO] Unable to find resource 'org.apache.ws.security:wss4j:jar:1.5.10' in repository apache.snapshots (http://repository.apache.org/snapshots)
Downloading: http://svn.apache.org/repos/asf/tuscany/maven/org/apache/ws/security/wss4j/1.5.10/wss4j-1.5.10.jar
[INFO] Unable to find resource 'org.apache.activemq:activemq-all:jar:5.2.0' in repository tuscany.repo (http://svn.apache.org/repos/asf/tuscany/maven)
Downloading: https://repository.apache.org/content/groups/public//org/apache/activemq/activemq-all/5.2.0/activemq-all-5.2.0.jar
[INFO] Unable to find resource 'org.apache.ws.security:wss4j:jar:1.5.10' in repository tuscany.repo (http://svn.apache.org/repos/asf/tuscany/maven)
Downloading: https://repository.apache.org/content/groups/public//org/apache/ws/security/wss4j/1.5.10/wss4j-1.5.10.jar

[INFO] Unable to find resource 'org.apache.ws.security:wss4j:jar:1.5.10' in repository apache.nexus (https://repository.apache.org/content/groups/public/)
Downloading: http://shibboleth.internet2.edu/downloads/maven2//org/apache/ws/security/wss4j/1.5.10/wss4j-1.5.10.jar
[WARNING] *** CHECKSUM FAILED - Error retrieving checksum file for org/apache/tuscany/sca/tuscany-otests-sca-jms-tests/2.0-SNAPSHOT/tuscany-otests-sca-jms-tests-2.0-SNAPSHOT.jar - IGNORING
Downloading: https://repository.apache.org/content/groups/public//org/apache/tuscany/sca/tuscany-base-runtime/2.0-SNAPSHOT/tuscany-base-runtime-2.0-20120722.002354-261.jar

[WARNING] *** CHECKSUM FAILED - Checksum failed on download: local = '420712511a1e1b9978e59a2cbbff75a911180f95'; remote = '<!DOCTYPE' - RETRYING
Downloading: http://shibboleth.internet2.edu/downloads/maven2//org/apache/ws/security/wss4j/1.5.10/wss4j-1.5.10.jar
2569K downloaded  (activemq-all-5.2.0.jar)

[WARNING] *** CHECKSUM FAILED - Checksum failed on download: local = '420712511a1e1b9978e59a2cbbff75a911180f95'; remote = '<!DOCTYPE' - IGNORING
2485K downloaded  (tuscany-base-runtime-2.0-20120722.002354-261.jar)
Downloading: https://repository.apache.org/content/groups/public//org/apache/tuscany/sca/tuscany-binding-ws-runtime-axis2/2.0-SNAPSHOT/tuscany-binding-ws-runtime-axis2-2.0-20120722.002715-258.jar
108K downloaded  (tuscany-binding-ws-runtime-axis2-2.0-20120722.002715-258.jar)
Downloading: https://repository.apache.org/content/groups/public//org/apache/tuscany/sca/tuscany-policy-wspolicy/2.0-SNAPSHOT/tuscany-policy-wspolicy-2.0-20120722.002657-258.jar
21K downloaded  (tuscany-policy-wspolicy-2.0-20120722.002657-258.jar)
Downloading: https://repository.apache.org/content/groups/public//org/apache/tuscany/sca/tuscany-databinding-axiom/2.0-SNAPSHOT/tuscany-databinding-axiom-2.0-20120722.002703-258.jar
35K downloaded  (tuscany-databinding-axiom-2.0-20120722.002703-258.jar)
Downloading: https://repository.apache.org/content/groups/public//org/apache/tuscany/sca/tuscany-databinding-jaxb-axiom/2.0-SNAPSHOT/tuscany-databinding-jaxb-axiom-2.0-20120722.002708-258.jar
38K downloaded  (tuscany-databinding-jaxb-axiom-2.0-20120722.002708-258.jar)
[INFO] [enforcer:enforce {execution: enforce-plugin-versions}]
[INFO] [remote-resources:process {execution: default}]
[WARNING] Invalid project model for artifact [wss4j:org.apache.ws.security:1.5.10]. It will be ignored by the remote resources Mojo.
[INFO] [resources:resources {execution: default-resources}]
[INFO] Using 'UTF-8' encoding to copy filtered resources.
[INFO] skip non existing resourceDirectory <https://builds.apache.org/job/Tuscany-2x/ws/sca-2x/testing/compliance-tests/binding-jms/src/main/resources>
[INFO] Copying 0 resource
[INFO] Copying 3 resources
[INFO] [compiler:compile {execution: default-compile}]
[INFO] No sources to compile
[INFO] [dependency:unpack {execution: unpack}]
[INFO] Configured Artifact: org.apache.tuscany.sca:oasis-jms-contributions:2.0-SNAPSHOT:zip
[INFO] snapshot org.apache.tuscany.sca:oasis-jms-contributions:2.0-SNAPSHOT: checking for updates from oasis.contributions
[INFO] snapshot org.apache.tuscany.sca:oasis-jms-contributions:2.0-SNAPSHOT: checking for updates from apache.snapshots
[INFO] snapshot org.apache.tuscany.sca:oasis-jms-contributions:2.0-SNAPSHOT: checking for updates from apache.nexus
Downloading: http://svn.apache.org/repos/asf/tuscany/maven/org/apache/tuscany/sca/oasis-jms-contributions/2.0-SNAPSHOT/oasis-jms-contributions-2.0-SNAPSHOT.zip

[WARNING] *** CHECKSUM FAILED - Error retrieving checksum file for org/apache/tuscany/sca/oasis-jms-contributions/2.0-SNAPSHOT/oasis-jms-contributions-2.0-SNAPSHOT.zip - IGNORING
[INFO] Configured Artifact: org.apache.tuscany.sca:tuscany-otests-sca-jms-tests:2.0-SNAPSHOT:jar
Downloading: http://svn.apache.org/repos/asf/tuscany/maven/org/apache/tuscany/sca/tuscany-otests-sca-jms-tests/2.0-SNAPSHOT/tuscany-otests-sca-jms-tests-2.0-SNAPSHOT.jar
[INFO] Unpacking <https://builds.apache.org/job/Tuscany-2x/ws/.repository/org/apache/tuscany/sca/oasis-jms-contributions/2.0-SNAPSHOT/oasis-jms-contributions-2.0-SNAPSHOT.zip> to
  <https://builds.apache.org/job/Tuscany-2x/ws/sca-2x/testing/compliance-tests/binding-jms/target/oasis-contributions>
   with includes null and excludes:null
[INFO] Unpacking <https://builds.apache.org/job/Tuscany-2x/ws/.repository/org/apache/tuscany/sca/tuscany-otests-sca-jms-tests/2.0-SNAPSHOT/tuscany-otests-sca-jms-tests-2.0-SNAPSHOT.jar> to
  <https://builds.apache.org/job/Tuscany-2x/ws/sca-2x/testing/compliance-tests/binding-jms/target/test-classes>
   with includes null and excludes:commons-logging.properties,oasis-sca-tests.properties,tuscany-oasis-sca-tests-errors.properties
[INFO] [resources:testResources {execution: default-testResources}]
[INFO] Using 'UTF-8' encoding to copy filtered resources.
[INFO] Copying 3 resources
[INFO] Copying 3 resources
[INFO] [compiler:testCompile {execution: default-testCompile}]
[INFO] Compiling 1 source file to <https://builds.apache.org/job/Tuscany-2x/ws/sca-2x/testing/compliance-tests/binding-jms/target/test-classes>
[INFO] -------------------------------------------------------------
[ERROR] COMPILATION ERROR : 
[INFO] -------------------------------------------------------------
[ERROR] error: error reading <https://builds.apache.org/job/Tuscany-2x/ws/.repository/org/apache/ws/security/wss4j/1.5.10/wss4j-1.5.10.jar;> error in opening zip file
[INFO] 1error
[INFO] -------------------------------------------------------------
[JENKINS] Archiving disabled
[INFO] ------------------------------------------------------------------------
[ERROR] BUILD FAILURE
[INFO] ------------------------------------------------------------------------
[INFO] Compilation failure
error: error reading <https://builds.apache.org/job/Tuscany-2x/ws/.repository/org/apache/ws/security/wss4j/1.5.10/wss4j-1.5.10.jar;> error in opening zip file

[INFO] ------------------------------------------------------------------------
[INFO] For more information, run Maven with the -e switch
[INFO] ------------------------------------------------------------------------
[INFO] Total time: 54 minutes 40 seconds
[INFO] Finished at: Tue Jul 23 05:01:11 UTC 2013
[INFO] Final Memory: 997M/1917M
[INFO] ------------------------------------------------------------------------
Maven failed with error.
Sending e-mails to: notification@tuscany.apache.org
channel stopped
2013-07-23 05:01:14.911:INFO::Shutdown hook executing
2013-07-23 05:01:14.912:INFO::Shutdown hook complete

Build failed in Jenkins: Tuscany-2x #1089

Posted by Apache Jenkins Server <je...@builds.apache.org>.
See <https://builds.apache.org/job/Tuscany-2x/1089/>

------------------------------------------
[...truncated 93149 lines...]
	at org.apache.tuscany.sca.node.impl.NodeImpl.load(NodeImpl.java:202)
	at org.apache.tuscany.sca.node.impl.NodeImpl.start(NodeImpl.java:118)
	... 29 more
Test BWS_2016 completed successfully
Jul 22, 2013 1:46:59 AM org.apache.tuscany.sca.node.impl.NodeImpl stop
INFO: Stopping node: http://tuscany.apache.org/sca/1.1/nodes/default0
Jul 22, 2013 1:46:59 AM org.apache.tuscany.sca.node.impl.NodeImpl stop
INFO: Stopping node: http://tuscany.apache.org/sca/1.1/nodes/default0
Tests run: 1, Failures: 0, Errors: 0, Skipped: 0, Time elapsed: 0.632 sec
Running client_bws.BWS_5001_TestCase
Implementation language set to: _Java
Jul 22, 2013 1:46:59 AM org.apache.tuscany.sca.node.impl.NodeImpl start
INFO: Starting node: http://tuscany.apache.org/sca/1.1/nodes/default0 domain: default
Jul 22, 2013 1:46:59 AM org.apache.tuscany.sca.node.impl.NodeFactoryImpl loadContributions
INFO: Loading contribution: <https://builds.apache.org/job/Tuscany-2x/ws/sca-2x/testing/compliance-tests/binding-ws/target/oasis-contributions/BWS_General/target/BWS_General.zip>
Jul 22, 2013 1:46:59 AM org.apache.tuscany.sca.node.impl.NodeFactoryImpl loadContributions
INFO: Loading contribution: <https://builds.apache.org/job/Tuscany-2x/ws/sca-2x/testing/compliance-tests/binding-ws/target/oasis-contributions/BWS_General_Java/target/BWS_General_Java.zip>
Jul 22, 2013 1:47:00 AM org.apache.tuscany.sca.core.assembly.impl.DomainRegistryImpl addEndpoint
INFO: Add endpoint - binding.sca - TestClient/TestClient_0002TestClient/TestInvocation
Jul 22, 2013 1:47:00 AM org.apache.tuscany.sca.http.jetty.JettyLogger info
INFO: jetty-6.1.19
Jul 22, 2013 1:47:00 AM org.apache.tuscany.sca.http.jetty.JettyLogger info
INFO: Started SelectChannelConnector@0.0.0.0:8080
Jul 22, 2013 1:47:00 AM org.apache.tuscany.sca.http.jetty.JettyServer addServletMapping
INFO: Added Servlet mapping: http://67.195.138.58:8080/TestClient/TestInvocation
Jul 22, 2013 1:47:00 AM org.apache.tuscany.sca.core.assembly.impl.DomainRegistryImpl addEndpoint
INFO: Add endpoint - binding.ws - http://67.195.138.58:8080/TestClient/TestInvocation
Jul 22, 2013 1:47:00 AM org.apache.tuscany.sca.core.assembly.impl.DomainRegistryImpl addEndpoint
INFO: Add endpoint - binding.sca - TEST_BWS_5001Component1/TestComposite54TestComponent1/Service1
Jul 22, 2013 1:47:00 AM org.apache.tuscany.sca.core.assembly.impl.DomainRegistryImpl addEndpoint
INFO: Add endpoint - binding.sca - TEST_BWS_5001Component1/TestComposite54TestComponent1/reference1
Jul 22, 2013 1:47:00 AM org.apache.tuscany.sca.core.assembly.impl.DomainRegistryImpl addEndpoint
INFO: Add endpoint - binding.sca - TEST_BWS_5001Component1/Service1
Jul 22, 2013 1:47:00 AM org.apache.tuscany.sca.http.jetty.JettyServer addServletMapping
INFO: Added Servlet mapping: http://67.195.138.58:8080/TEST_BWS_5001Component1/Reference1
Jul 22, 2013 1:47:00 AM org.apache.tuscany.sca.core.assembly.impl.DomainRegistryImpl addEndpoint
INFO: Add endpoint - binding.ws - http://67.195.138.58:8080/TEST_BWS_5001Component1/Reference1
>>> Starting external JAXWS service at: http://localhost:9081/JAXWS/Service1
wsa:Action value found: http://test.sca.oasisopen.org/TEST_BWS_5001Component1/Reference1/Service5/operation1Request
Address found: http://67.195.138.58:8080/TEST_BWS_5001Component1/Reference1
Service5Impl - callback address is: http://67.195.138.58:8080/TEST_BWS_5001Component1/Reference1
Jul 22, 2013 1:47:00 AM org.apache.tuscany.sca.node.impl.NodeImpl stop
INFO: Stopping node: http://tuscany.apache.org/sca/1.1/nodes/default0
Test BWS_5001 completed successfully
Jul 22, 2013 1:47:00 AM org.apache.tuscany.sca.core.assembly.impl.DomainRegistryImpl removeEndpoint
INFO: Remove endpoint - binding.ws - http://67.195.138.58:8080/TestClient/TestInvocation
Jul 22, 2013 1:47:00 AM org.apache.tuscany.sca.http.jetty.JettyServer removeServletMapping
INFO: Removed Servlet mapping: /TestClient/TestInvocation
Jul 22, 2013 1:47:00 AM org.apache.tuscany.sca.core.assembly.impl.DomainRegistryImpl removeEndpoint
INFO: Remove endpoint - binding.sca - TestClient/TestClient_0002TestClient/TestInvocation
Jul 22, 2013 1:47:00 AM org.apache.tuscany.sca.core.assembly.impl.DomainRegistryImpl removeEndpoint
INFO: Remove endpoint - binding.sca - TEST_BWS_5001Component1/Service1
Jul 22, 2013 1:47:00 AM org.apache.tuscany.sca.core.assembly.impl.DomainRegistryImpl removeEndpoint
INFO: Remove endpoint - binding.ws - http://67.195.138.58:8080/TEST_BWS_5001Component1/Reference1
Jul 22, 2013 1:47:00 AM org.apache.tuscany.sca.http.jetty.JettyServer removeServletMapping
INFO: Removed Servlet mapping: /TEST_BWS_5001Component1/Reference1
Jul 22, 2013 1:47:00 AM org.apache.tuscany.sca.core.assembly.impl.DomainRegistryImpl removeEndpoint
INFO: Remove endpoint - binding.sca - TEST_BWS_5001Component1/TestComposite54TestComponent1/Service1
Jul 22, 2013 1:47:00 AM org.apache.tuscany.sca.core.assembly.impl.DomainRegistryImpl removeEndpoint
INFO: Remove endpoint - binding.sca - TEST_BWS_5001Component1/TestComposite54TestComponent1/reference1
Tests run: 1, Failures: 0, Errors: 0, Skipped: 0, Time elapsed: 0.363 sec
Running client_bws.BWS_4001_TestCase
Implementation language set to: _Java
Jul 22, 2013 1:47:00 AM org.apache.tuscany.sca.node.impl.NodeImpl start
INFO: Starting node: http://tuscany.apache.org/sca/1.1/nodes/default0 domain: default
Jul 22, 2013 1:47:00 AM org.apache.tuscany.sca.node.impl.NodeFactoryImpl loadContributions
INFO: Loading contribution: <https://builds.apache.org/job/Tuscany-2x/ws/sca-2x/testing/compliance-tests/binding-ws/target/oasis-contributions/BWS_General/target/BWS_General.zip>
Jul 22, 2013 1:47:00 AM org.apache.tuscany.sca.node.impl.NodeFactoryImpl loadContributions
INFO: Loading contribution: <https://builds.apache.org/job/Tuscany-2x/ws/sca-2x/testing/compliance-tests/binding-ws/target/oasis-contributions/BWS_General_Java/target/BWS_General_Java.zip>
Jul 22, 2013 1:47:00 AM org.apache.tuscany.sca.core.assembly.impl.DomainRegistryImpl addEndpoint
INFO: Add endpoint - binding.sca - TestClient/TestClient_0002TestClient/TestInvocation
Jul 22, 2013 1:47:00 AM org.apache.tuscany.sca.http.jetty.JettyLogger info
INFO: jetty-6.1.19
Jul 22, 2013 1:47:00 AM org.apache.tuscany.sca.http.jetty.JettyLogger info
INFO: Started SelectChannelConnector@0.0.0.0:8080
Jul 22, 2013 1:47:00 AM org.apache.tuscany.sca.http.jetty.JettyServer addServletMapping
INFO: Added Servlet mapping: http://67.195.138.58:8080/TestClient/TestInvocation
Jul 22, 2013 1:47:00 AM org.apache.tuscany.sca.core.assembly.impl.DomainRegistryImpl addEndpoint
INFO: Add endpoint - binding.ws - http://67.195.138.58:8080/TestClient/TestInvocation
Jul 22, 2013 1:47:00 AM org.apache.tuscany.sca.core.assembly.impl.DomainRegistryImpl addEndpoint
INFO: Add endpoint - binding.sca - TEST_BWS_4001Component1/TestComposite1Component1/Service1
Jul 22, 2013 1:47:00 AM org.apache.tuscany.sca.core.assembly.impl.DomainRegistryImpl addEndpoint
INFO: Add endpoint - binding.sca - TEST_BWS_4001Component1/Service1
Test BWS_4001 completed successfully
Jul 22, 2013 1:47:00 AM org.apache.tuscany.sca.node.impl.NodeImpl stop
INFO: Stopping node: http://tuscany.apache.org/sca/1.1/nodes/default0
Jul 22, 2013 1:47:00 AM org.apache.tuscany.sca.core.assembly.impl.DomainRegistryImpl removeEndpoint
INFO: Remove endpoint - binding.ws - http://67.195.138.58:8080/TestClient/TestInvocation
Jul 22, 2013 1:47:00 AM org.apache.tuscany.sca.http.jetty.JettyServer removeServletMapping
INFO: Removed Servlet mapping: /TestClient/TestInvocation
Jul 22, 2013 1:47:00 AM org.apache.tuscany.sca.core.assembly.impl.DomainRegistryImpl removeEndpoint
INFO: Remove endpoint - binding.sca - TestClient/TestClient_0002TestClient/TestInvocation
Jul 22, 2013 1:47:00 AM org.apache.tuscany.sca.core.assembly.impl.DomainRegistryImpl removeEndpoint
INFO: Remove endpoint - binding.sca - TEST_BWS_4001Component1/Service1
Jul 22, 2013 1:47:00 AM org.apache.tuscany.sca.core.assembly.impl.DomainRegistryImpl removeEndpoint
INFO: Remove endpoint - binding.sca - TEST_BWS_4001Component1/TestComposite1Component1/Service1
Tests run: 1, Failures: 0, Errors: 0, Skipped: 0, Time elapsed: 0.268 sec
Running client_bws.BWS_5006_TestCase
Implementation language set to: _Java
Jul 22, 2013 1:47:00 AM org.apache.tuscany.sca.node.impl.NodeImpl start
INFO: Starting node: http://tuscany.apache.org/sca/1.1/nodes/default0 domain: default
Jul 22, 2013 1:47:00 AM org.apache.tuscany.sca.node.impl.NodeFactoryImpl loadContributions
INFO: Loading contribution: <https://builds.apache.org/job/Tuscany-2x/ws/sca-2x/testing/compliance-tests/binding-ws/target/oasis-contributions/BWS_General/target/BWS_General.zip>
Jul 22, 2013 1:47:00 AM org.apache.tuscany.sca.node.impl.NodeFactoryImpl loadContributions
INFO: Loading contribution: <https://builds.apache.org/job/Tuscany-2x/ws/sca-2x/testing/compliance-tests/binding-ws/target/oasis-contributions/BWS_General_Java/target/BWS_General_Java.zip>
Jul 22, 2013 1:47:00 AM org.apache.tuscany.sca.core.assembly.impl.DomainRegistryImpl addEndpoint
INFO: Add endpoint - binding.sca - TEST_BWS_5006Component1/TestComposite55TestComponent1/Service5
Jul 22, 2013 1:47:00 AM org.apache.tuscany.sca.http.jetty.JettyLogger info
INFO: jetty-6.1.19
Jul 22, 2013 1:47:00 AM org.apache.tuscany.sca.http.jetty.JettyLogger info
INFO: Started SelectChannelConnector@0.0.0.0:8080
Jul 22, 2013 1:47:00 AM org.apache.tuscany.sca.http.jetty.JettyServer addServletMapping
INFO: Added Servlet mapping: http://67.195.138.58:8080/TEST_BWS_5006Component1/Service1
Jul 22, 2013 1:47:00 AM org.apache.tuscany.sca.core.assembly.impl.DomainRegistryImpl addEndpoint
INFO: Add endpoint - binding.ws - http://67.195.138.58:8080/TEST_BWS_5006Component1/Service1
>>> Starting external JAXWS service at: http://localhost:9081/JAXWS/Service5Callback
Service5 client - call address is: http://localhost:8080/TEST_BWS_5006Component1/Service1
wsa:To address found: http://localhost:9081/JAXWS/Service5Callback
wsa:Action value found: http://test.sca.oasisopen.org/TEST_BWS_5006Component1/Service1/Service5Callback/callback1Request
test:SCAProps value found: a5c9799d-e2ec-4f3a-9d40-94ef6dd6ffc3
Test BWS_5006 completed successfully
Jul 22, 2013 1:47:00 AM org.apache.tuscany.sca.node.impl.NodeImpl stop
INFO: Stopping node: http://tuscany.apache.org/sca/1.1/nodes/default0
Jul 22, 2013 1:47:00 AM org.apache.tuscany.sca.core.assembly.impl.DomainRegistryImpl removeEndpoint
INFO: Remove endpoint - binding.ws - http://67.195.138.58:8080/TEST_BWS_5006Component1/Service1
Jul 22, 2013 1:47:00 AM org.apache.tuscany.sca.http.jetty.JettyServer removeServletMapping
INFO: Removed Servlet mapping: /TEST_BWS_5006Component1/Service1
Jul 22, 2013 1:47:00 AM org.apache.tuscany.sca.core.assembly.impl.DomainRegistryImpl removeEndpoint
INFO: Remove endpoint - binding.sca - TEST_BWS_5006Component1/TestComposite55TestComponent1/Service5
Tests run: 1, Failures: 0, Errors: 0, Skipped: 0, Time elapsed: 0.272 sec
Running client_bws.BWS_4005_TestCase
Implementation language set to: _Java
Jul 22, 2013 1:47:00 AM org.apache.tuscany.sca.node.impl.NodeImpl start
INFO: Starting node: http://tuscany.apache.org/sca/1.1/nodes/default0 domain: default
Jul 22, 2013 1:47:00 AM org.apache.tuscany.sca.node.impl.NodeFactoryImpl loadContributions
INFO: Loading contribution: <https://builds.apache.org/job/Tuscany-2x/ws/sca-2x/testing/compliance-tests/binding-ws/target/oasis-contributions/BWS_General/target/BWS_General.zip>
Jul 22, 2013 1:47:00 AM org.apache.tuscany.sca.node.impl.NodeFactoryImpl loadContributions
INFO: Loading contribution: <https://builds.apache.org/job/Tuscany-2x/ws/sca-2x/testing/compliance-tests/binding-ws/target/oasis-contributions/BWS_General_Java/target/BWS_General_Java.zip>
Jul 22, 2013 1:47:00 AM org.apache.tuscany.sca.core.assembly.impl.DomainRegistryImpl addEndpoint
INFO: Add endpoint - binding.sca - TestClient/TestClient_0002TestClient/TestInvocation
Jul 22, 2013 1:47:00 AM org.apache.tuscany.sca.http.jetty.JettyLogger info
INFO: jetty-6.1.19
Jul 22, 2013 1:47:00 AM org.apache.tuscany.sca.http.jetty.JettyLogger info
INFO: Started SelectChannelConnector@0.0.0.0:8080
Jul 22, 2013 1:47:00 AM org.apache.tuscany.sca.http.jetty.JettyServer addServletMapping
INFO: Added Servlet mapping: http://67.195.138.58:8080/TestClient/TestInvocation
Jul 22, 2013 1:47:00 AM org.apache.tuscany.sca.core.assembly.impl.DomainRegistryImpl addEndpoint
INFO: Add endpoint - binding.ws - http://67.195.138.58:8080/TestClient/TestInvocation
Jul 22, 2013 1:47:00 AM org.apache.tuscany.sca.core.assembly.impl.DomainRegistryImpl addEndpoint
INFO: Add endpoint - binding.sca - TEST_BWS_4005Component1/Composite4Component1/Service1
Jul 22, 2013 1:47:00 AM org.apache.tuscany.sca.core.assembly.impl.DomainRegistryImpl addEndpoint
INFO: Add endpoint - binding.sca - TEST_BWS_4005Component1/Service1
>>> Starting external JAXWS service at: http://localhost:9081/JAXWS/Service1
Test BWS_4005 completed successfully
Jul 22, 2013 1:47:01 AM org.apache.tuscany.sca.node.impl.NodeImpl stop
INFO: Stopping node: http://tuscany.apache.org/sca/1.1/nodes/default0
Jul 22, 2013 1:47:01 AM org.apache.tuscany.sca.core.assembly.impl.DomainRegistryImpl removeEndpoint
INFO: Remove endpoint - binding.ws - http://67.195.138.58:8080/TestClient/TestInvocation
Jul 22, 2013 1:47:01 AM org.apache.tuscany.sca.http.jetty.JettyServer removeServletMapping
INFO: Removed Servlet mapping: /TestClient/TestInvocation
Jul 22, 2013 1:47:01 AM org.apache.tuscany.sca.core.assembly.impl.DomainRegistryImpl removeEndpoint
INFO: Remove endpoint - binding.sca - TestClient/TestClient_0002TestClient/TestInvocation
Jul 22, 2013 1:47:01 AM org.apache.tuscany.sca.core.assembly.impl.DomainRegistryImpl removeEndpoint
INFO: Remove endpoint - binding.sca - TEST_BWS_4005Component1/Service1
Jul 22, 2013 1:47:01 AM org.apache.tuscany.sca.core.assembly.impl.DomainRegistryImpl removeEndpoint
INFO: Remove endpoint - binding.sca - TEST_BWS_4005Component1/Composite4Component1/Service1
Tests run: 1, Failures: 0, Errors: 0, Skipped: 0, Time elapsed: 0.279 sec

Results :

Tests run: 37, Failures: 0, Errors: 0, Skipped: 0

[JENKINS] Recording test results
[INFO] [jar:jar {execution: default-jar}]
[INFO] Building jar: <https://builds.apache.org/job/Tuscany-2x/ws/sca-2x/testing/compliance-tests/binding-ws/target/tuscany-compliance-test-binding-ws.jar>
[INFO] [install:install {execution: default-install}]
[INFO] Installing <https://builds.apache.org/job/Tuscany-2x/ws/sca-2x/testing/compliance-tests/binding-ws/target/tuscany-compliance-test-binding-ws.jar> to <https://builds.apache.org/job/Tuscany-2x/ws/.repository/org/apache/tuscany/sca/tuscany-compliance-test-binding-ws/2.5-SNAPSHOT/tuscany-compliance-test-binding-ws-2.5-SNAPSHOT.jar>
[JENKINS] Archiving disabled
[INFO] ------------------------------------------------------------------------
[INFO] Building Apache Tuscany SCA Specification Compliance Tests Binding JMS
[INFO]    task-segment: [clean, install]
[INFO] ------------------------------------------------------------------------
[INFO] [clean:clean {execution: default-clean}]
[INFO] snapshot org.apache.tuscany.sca:tuscany-otests-sca-jms-tests:2.0-SNAPSHOT: checking for updates from oasis.contributions
[INFO] snapshot org.apache.tuscany.sca:tuscany-otests-sca-jms-tests:2.0-SNAPSHOT: checking for updates from apache.snapshots
[INFO] snapshot org.apache.tuscany.sca:tuscany-otests-sca-jms-tests:2.0-SNAPSHOT: checking for updates from apache.nexus
Downloading: http://svn.apache.org/repos/asf/tuscany/maven/org/apache/tuscany/sca/tuscany-otests-sca-jms-tests/2.0-SNAPSHOT/tuscany-otests-sca-jms-tests-2.0-SNAPSHOT.pom
[INFO] snapshot org.apache.tuscany.sca:tuscany-base-runtime:2.0-SNAPSHOT: checking for updates from oasis.contributions
[INFO] snapshot org.apache.tuscany.sca:tuscany-base-runtime:2.0-SNAPSHOT: checking for updates from apache.snapshots
[INFO] snapshot org.apache.tuscany.sca:tuscany-base-runtime:2.0-SNAPSHOT: checking for updates from apache.nexus
[INFO] snapshot org.apache.tuscany.sca:tuscany-binding-jms-runtime:2.0-SNAPSHOT: checking for updates from oasis.contributions
[INFO] snapshot org.apache.tuscany.sca:tuscany-binding-jms-runtime:2.0-SNAPSHOT: checking for updates from apache.snapshots
[INFO] snapshot org.apache.tuscany.sca:tuscany-binding-jms-runtime:2.0-SNAPSHOT: checking for updates from apache.nexus
Downloading: http://svn.apache.org/repos/asf/tuscany/maven/org/apache/tuscany/sca/tuscany-otests-sca-jms-tests/2.0-SNAPSHOT/tuscany-otests-sca-jms-tests-2.0-SNAPSHOT.jar
[INFO] [enforcer:enforce {execution: enforce-plugin-versions}]
[INFO] [remote-resources:process {execution: default}]
[WARNING] Invalid project model for artifact [wss4j:org.apache.ws.security:1.5.10]. It will be ignored by the remote resources Mojo.
[INFO] [resources:resources {execution: default-resources}]
[INFO] Using 'UTF-8' encoding to copy filtered resources.
[INFO] skip non existing resourceDirectory <https://builds.apache.org/job/Tuscany-2x/ws/sca-2x/testing/compliance-tests/binding-jms/src/main/resources>
[INFO] Copying 0 resource
[INFO] Copying 3 resources
[INFO] [compiler:compile {execution: default-compile}]
[INFO] No sources to compile
[INFO] [dependency:unpack {execution: unpack}]
[INFO] Configured Artifact: org.apache.tuscany.sca:oasis-jms-contributions:2.0-SNAPSHOT:zip
[INFO] snapshot org.apache.tuscany.sca:oasis-jms-contributions:2.0-SNAPSHOT: checking for updates from oasis.contributions
[INFO] snapshot org.apache.tuscany.sca:oasis-jms-contributions:2.0-SNAPSHOT: checking for updates from apache.snapshots
[INFO] snapshot org.apache.tuscany.sca:oasis-jms-contributions:2.0-SNAPSHOT: checking for updates from apache.nexus
Downloading: http://svn.apache.org/repos/asf/tuscany/maven/org/apache/tuscany/sca/oasis-jms-contributions/2.0-SNAPSHOT/oasis-jms-contributions-2.0-SNAPSHOT.zip
[INFO] Configured Artifact: org.apache.tuscany.sca:tuscany-otests-sca-jms-tests:2.0-SNAPSHOT:jar
Downloading: http://svn.apache.org/repos/asf/tuscany/maven/org/apache/tuscany/sca/tuscany-otests-sca-jms-tests/2.0-SNAPSHOT/tuscany-otests-sca-jms-tests-2.0-SNAPSHOT.jar
[INFO] Unpacking <https://builds.apache.org/job/Tuscany-2x/ws/.repository/org/apache/tuscany/sca/oasis-jms-contributions/2.0-SNAPSHOT/oasis-jms-contributions-2.0-SNAPSHOT.zip> to
  <https://builds.apache.org/job/Tuscany-2x/ws/sca-2x/testing/compliance-tests/binding-jms/target/oasis-contributions>
   with includes null and excludes:null
[INFO] Unpacking <https://builds.apache.org/job/Tuscany-2x/ws/.repository/org/apache/tuscany/sca/tuscany-otests-sca-jms-tests/2.0-SNAPSHOT/tuscany-otests-sca-jms-tests-2.0-SNAPSHOT.jar> to
  <https://builds.apache.org/job/Tuscany-2x/ws/sca-2x/testing/compliance-tests/binding-jms/target/test-classes>
   with includes null and excludes:commons-logging.properties,oasis-sca-tests.properties,tuscany-oasis-sca-tests-errors.properties
[INFO] [resources:testResources {execution: default-testResources}]
[INFO] Using 'UTF-8' encoding to copy filtered resources.
[INFO] Copying 3 resources
[INFO] Copying 3 resources
[INFO] [compiler:testCompile {execution: default-testCompile}]
[INFO] Compiling 1 source file to <https://builds.apache.org/job/Tuscany-2x/ws/sca-2x/testing/compliance-tests/binding-jms/target/test-classes>
[INFO] -------------------------------------------------------------
[ERROR] COMPILATION ERROR : 
[INFO] -------------------------------------------------------------
[ERROR] error: error reading <https://builds.apache.org/job/Tuscany-2x/ws/.repository/org/apache/ws/security/wss4j/1.5.10/wss4j-1.5.10.jar;> error in opening zip file
[INFO] 1error
[INFO] -------------------------------------------------------------
[JENKINS] Archiving disabled
[INFO] ------------------------------------------------------------------------
[ERROR] BUILD FAILURE
[INFO] ------------------------------------------------------------------------
[INFO] Compilation failure
error: error reading <https://builds.apache.org/job/Tuscany-2x/ws/.repository/org/apache/ws/security/wss4j/1.5.10/wss4j-1.5.10.jar;> error in opening zip file

[INFO] ------------------------------------------------------------------------
[INFO] For more information, run Maven with the -e switch
[INFO] ------------------------------------------------------------------------
[INFO] Total time: 43 minutes 28 seconds
[INFO] Finished at: Mon Jul 22 01:47:06 UTC 2013
[INFO] Final Memory: 997M/1918M
[INFO] ------------------------------------------------------------------------
Maven failed with error.
Sending e-mails to: notification@tuscany.apache.org
channel stopped
2013-07-22 01:47:10.353:INFO::Shutdown hook executing
2013-07-22 01:47:10.353:INFO::Shutdown hook complete