You are viewing a plain text version of this content. The canonical link for it is here.
Posted to dev@cloudstack.apache.org by je...@cloudstack.org on 2015/01/07 07:44:23 UTC

Build failed in Jenkins: build-master-noredist #4013

See <http://jenkins.buildacloud.org/job/build-master-noredist/4013/changes>

Changes:

[kishan] Trigger user stats aggregation job at midnight in usage aggregation timezone

------------------------------------------
[...truncated 37769 lines...]
Downloading: http://repo.maven.apache.org/maven2/org/codehaus/plexus/plexus-io/1.0.1/plexus-io-1.0.1.jar
12/12 KB   13/13 KB   14/178 KB   1/31 KB    
12/12 KB   13/13 KB   14/178 KB   5/31 KB   
12/12 KB   13/13 KB   14/178 KB   9/31 KB   
12/12 KB   13/13 KB   14/178 KB   13/31 KB   
12/12 KB   13/13 KB   14/178 KB   14/31 KB   
                                             
Downloaded: http://repo.maven.apache.org/maven2/org/apache/maven/doxia/doxia-logging-api/1.1/doxia-logging-api-1.1.jar (12 KB at 425.8 KB/sec)
Downloading: http://repo.maven.apache.org/maven2/org/apache/maven/maven-archiver/2.4.1/maven-archiver-2.4.1.jar
13/13 KB   18/178 KB   14/31 KB              
13/13 KB   22/178 KB   14/31 KB   
13/13 KB   26/178 KB   14/31 KB   
13/13 KB   30/178 KB   14/31 KB   
13/13 KB   34/178 KB   14/31 KB   
13/13 KB   38/178 KB   14/31 KB   
13/13 KB   42/178 KB   14/31 KB   
13/13 KB   43/178 KB   14/31 KB   
13/13 KB   43/178 KB   16/31 KB   
13/13 KB   43/178 KB   20/31 KB   
13/13 KB   43/178 KB   24/31 KB   
13/13 KB   43/178 KB   28/31 KB   
13/13 KB   43/178 KB   31/31 KB   
                                  
Downloaded: http://repo.maven.apache.org/maven2/org/apache/maven/doxia/doxia-sink-api/1.1/doxia-sink-api-1.1.jar (13 KB at 357.6 KB/sec)
Downloading: http://repo.maven.apache.org/maven2/org/apache/maven/shared/maven-repository-builder/1.0-alpha-2/maven-repository-builder-1.0-alpha-2.jar
43/178 KB   31/31 KB   3/50 KB    
43/178 KB   31/31 KB   7/50 KB   
43/178 KB   31/31 KB   11/50 KB   
43/178 KB   31/31 KB   15/50 KB   
43/178 KB   31/31 KB   19/50 KB   
43/178 KB   31/31 KB   23/50 KB   
43/178 KB   31/31 KB   27/50 KB   
43/178 KB   31/31 KB   31/50 KB   
43/178 KB   31/31 KB   35/50 KB   
43/178 KB   31/31 KB   39/50 KB   
43/178 KB   31/31 KB   43/50 KB   
43/178 KB   31/31 KB   47/50 KB   
43/178 KB   31/31 KB   50/50 KB   
43/178 KB   31/31 KB   50/50 KB   4/20 KB   
43/178 KB   31/31 KB   50/50 KB   8/20 KB   
47/178 KB   31/31 KB   50/50 KB   8/20 KB   
47/178 KB   31/31 KB   50/50 KB   12/20 KB   
51/178 KB   31/31 KB   50/50 KB   12/20 KB   
51/178 KB   31/31 KB   50/50 KB   16/20 KB   
55/178 KB   31/31 KB   50/50 KB   16/20 KB   
55/178 KB   31/31 KB   50/50 KB   17/20 KB   
59/178 KB   31/31 KB   50/50 KB   17/20 KB   
63/178 KB   31/31 KB   50/50 KB   17/20 KB   
67/178 KB   31/31 KB   50/50 KB   17/20 KB   
71/178 KB   31/31 KB   50/50 KB   17/20 KB   
75/178 KB   31/31 KB   50/50 KB   17/20 KB   
79/178 KB   31/31 KB   50/50 KB   17/20 KB   
83/178 KB   31/31 KB   50/50 KB   17/20 KB   
84/178 KB   31/31 KB   50/50 KB   17/20 KB   
86/178 KB   31/31 KB   50/50 KB   17/20 KB   
90/178 KB   31/31 KB   50/50 KB   17/20 KB   
92/178 KB   31/31 KB   50/50 KB   17/20 KB   
92/178 KB   31/31 KB   50/50 KB   18/20 KB   
92/178 KB   31/31 KB   50/50 KB   20/20 KB   
95/178 KB   31/31 KB   50/50 KB   20/20 KB   
99/178 KB   31/31 KB   50/50 KB   20/20 KB   
103/178 KB   31/31 KB   50/50 KB   20/20 KB   
105/178 KB   31/31 KB   50/50 KB   20/20 KB   
108/178 KB   31/31 KB   50/50 KB   20/20 KB   
112/178 KB   31/31 KB   50/50 KB   20/20 KB   
116/178 KB   31/31 KB   50/50 KB   20/20 KB   
120/178 KB   31/31 KB   50/50 KB   20/20 KB   
124/178 KB   31/31 KB   50/50 KB   20/20 KB   
127/178 KB   31/31 KB   50/50 KB   20/20 KB   
                                              
Downloaded: http://repo.maven.apache.org/maven2/org/codehaus/plexus/plexus-io/1.0.1/plexus-io-1.0.1.jar (50 KB at 2257.9 KB/sec)
                                              
127/178 KB   4/23 KB   20/20 KB               
127/178 KB   8/23 KB   20/20 KB   
127/178 KB   12/23 KB   20/20 KB   
127/178 KB   16/23 KB   20/20 KB   
127/178 KB   17/23 KB   20/20 KB   
Downloaded: http://repo.maven.apache.org/maven2/org/apache/maven/shared/file-management/1.1/file-management-1.1.jar (31 KB at 676.4 KB/sec)
130/178 KB   17/23 KB   20/20 KB   
134/178 KB   17/23 KB   20/20 KB   
138/178 KB   17/23 KB   20/20 KB   
142/178 KB   17/23 KB   20/20 KB   
144/178 KB   17/23 KB   20/20 KB   
147/178 KB   17/23 KB   20/20 KB   
151/178 KB   17/23 KB   20/20 KB   
155/178 KB   17/23 KB   20/20 KB   
159/178 KB   17/23 KB   20/20 KB   
163/178 KB   17/23 KB   20/20 KB   
167/178 KB   17/23 KB   20/20 KB   
168/178 KB   17/23 KB   20/20 KB   
171/178 KB   17/23 KB   20/20 KB   
175/178 KB   17/23 KB   20/20 KB   
178/178 KB   17/23 KB   20/20 KB   
                                   
Downloaded: http://repo.maven.apache.org/maven2/org/apache/maven/maven-archiver/2.4.1/maven-archiver-2.4.1.jar (20 KB at 785.0 KB/sec)
178/178 KB   21/23 KB              
178/178 KB   23/23 KB   
                        
Downloaded: http://repo.maven.apache.org/maven2/org/codehaus/plexus/plexus-archiver/1.1/plexus-archiver-1.1.jar (178 KB at 3171.5 KB/sec)
                        
Downloaded: http://repo.maven.apache.org/maven2/org/apache/maven/shared/maven-repository-builder/1.0-alpha-2/maven-repository-builder-1.0-alpha-2.jar (23 KB at 646.0 KB/sec)
[INFO] Reading assembly descriptor: systemvm-descriptor.xml
[WARNING] Cannot include project artifact: org.apache.cloudstack:cloud-systemvm:pom:4.6.0-SNAPSHOT; it doesn't have an associated file or directory.
[INFO] 
[INFO] --- maven-resources-plugin:2.5:testResources (default-testResources) @ cloud-plugin-network-cisco-vnmc ---
[debug] execute contextualize
[INFO] Using 'UTF-8' encoding to copy filtered resources.
[INFO] skip non existing resourceDirectory <http://jenkins.buildacloud.org/job/build-master-noredist/ws/plugins/network-elements/cisco-vnmc/test/resources>
[INFO] Copying 3 resources
[INFO] 
[INFO] --- maven-compiler-plugin:3.2:testCompile (default-testCompile) @ cloud-plugin-network-cisco-vnmc ---
[INFO] Changes detected - recompiling the module!
[INFO] Compiling 3 source files to <http://jenkins.buildacloud.org/job/build-master-noredist/ws/plugins/network-elements/cisco-vnmc/target/test-classes>
[INFO] ------------------------------------------------------------------------
[INFO] Reactor Summary:
[INFO] 
[INFO] Apache CloudStack Developer Tools - Checkstyle Configuration  SUCCESS [1.355s]
[INFO] Apache CloudStack ................................. SUCCESS [4.032s]
[INFO] Apache CloudStack Maven Conventions Parent ........ SUCCESS [1.052s]
[INFO] Apache CloudStack Framework - Managed Context ..... SUCCESS [4.484s]
[INFO] Apache CloudStack Utils ........................... SUCCESS [11.511s]
[INFO] Apache CloudStack Framework ....................... SUCCESS [0.143s]
[INFO] Apache CloudStack Framework - Event Notification .. SUCCESS [9.449s]
[INFO] Apache CloudStack Framework - Configuration ....... SUCCESS [3.978s]
[INFO] Apache CloudStack API ............................. SUCCESS [11.656s]
[INFO] Apache CloudStack Framework - REST ................ SUCCESS [5.632s]
[INFO] Apache CloudStack Framework - IPC ................. SUCCESS [4.962s]
[INFO] Apache CloudStack Cloud Engine .................... SUCCESS [0.364s]
[INFO] Apache CloudStack Cloud Engine API ................ SUCCESS [4.759s]
[INFO] Apache CloudStack Framework - Security ............ SUCCESS [2.653s]
[INFO] Apache CloudStack Core ............................ SUCCESS [22.384s]
[INFO] Apache CloudStack Agents .......................... SUCCESS [9.042s]
[INFO] Apache CloudStack Framework - Clustering .......... SUCCESS [3.619s]
[INFO] Apache CloudStack Framework - Event Notification .. SUCCESS [3.207s]
[INFO] Apache CloudStack Cloud Engine Schema Component ... SUCCESS [15.947s]
[INFO] Apache CloudStack Framework - Jobs ................ SUCCESS [6.388s]
[INFO] Apache CloudStack Cloud Engine Internal Components API  SUCCESS [2.872s]
[INFO] Apache CloudStack Server .......................... SUCCESS [36.535s]
[INFO] Apache CloudStack Usage Server .................... SUCCESS [9.682s]
[INFO] Apache CloudStack Cloud Engine Orchestration Component  SUCCESS [11.131s]
[INFO] Apache CloudStack Cloud Services .................. SUCCESS [0.372s]
[INFO] Apache CloudStack Secondary Storage ............... SUCCESS [2.546s]
[INFO] Apache CloudStack Secondary Storage Service ....... SUCCESS [11.465s]
[INFO] Apache CloudStack Engine Storage Component ........ SUCCESS [14.534s]
[INFO] Apache CloudStack Engine Storage Volume Component . SUCCESS [14.672s]
[INFO] Apache CloudStack Engine Storage Image Component .. SUCCESS [10.081s]
[INFO] Apache CloudStack Engine Storage Data Motion Component  SUCCESS [7.331s]
[INFO] Apache CloudStack Engine Storage Cache Component .. SUCCESS [8.631s]
[INFO] Apache CloudStack Engine Storage Snapshot Component  SUCCESS [29.149s]
[INFO] Apache CloudStack Cloud Engine API ................ SUCCESS [3.194s]
[INFO] Apache CloudStack Cloud Engine Service ............ SUCCESS [18.134s]
[INFO] Apache CloudStack Plugin POM ...................... SUCCESS [0.388s]
[INFO] Apache CloudStack Plugin - API Rate Limit ......... SUCCESS [19.398s]
[INFO] Apache CloudStack Plugin - Storage Volume default provider  SUCCESS [7.501s]
[INFO] Apache CloudStack Plugin - Storage Volume SolidFire Provider  SUCCESS [16.038s]
[INFO] Apache CloudStack Plugin - API SolidFire .......... SUCCESS [4.570s]
[INFO] Apache CloudStack Plugin - API Discovery .......... SUCCESS [14.618s]
[INFO] Apache CloudStack Plugin - ACL Static Role Based .. SUCCESS [6.858s]
[INFO] Apache CloudStack Plugin - Host Anti-Affinity Processor  SUCCESS [7.208s]
[INFO] Apache CloudStack Plugin - Explicit Dedication Processor  SUCCESS [7.300s]
[INFO] Apache CloudStack Plugin - User Concentrated Pod Deployment Planner  SUCCESS [7.299s]
[INFO] Apache CloudStack Plugin - User Dispersing Deployment Planner  SUCCESS [6.918s]
[INFO] Apache CloudStack Plugin - Implicit Dedication Planner  SUCCESS [20.941s]
[INFO] Apache CloudStack Plugin - Skip Heurestics Planner  SUCCESS [6.661s]
[INFO] Apache CloudStack Plugin - Host Allocator Random .. SUCCESS [7.314s]
[INFO] Apache CloudStack Plugin - Dedicated Resources .... SUCCESS [20.964s]
[INFO] Apache CloudStack Plugin - Hypervisor OracleVM .... SUCCESS [9.276s]
[INFO] Apache CloudStack Plugin - Open vSwitch ........... SUCCESS [9.558s]
[INFO] Apache CloudStack Plugin - Hypervisor XenServer ... SUCCESS [27.496s]
[INFO] Apache CloudStack Plugin - Hypervisor KVM ......... SUCCESS [28.011s]
[INFO] Apache CloudStack Plugin - RabbitMQ Event Bus ..... SUCCESS [6.514s]
[INFO] Apache CloudStack Plugin - In Memory Event Bus .... SUCCESS [12.633s]
[INFO] Apache CloudStack Plugin - Hypervisor Baremetal ... SUCCESS [13.234s]
[INFO] Apache CloudStack Plugin - Hypervisor UCS ......... SUCCESS [8.612s]
[INFO] Apache CloudStack Plugin - Hypervisor Hyper-V ..... SUCCESS [15.851s]
[INFO] Apache CloudStack Plugin - Network Elastic Load Balancer  SUCCESS [15.134s]
[INFO] Apache CloudStack Plugin - Network Internal Load Balancer  SUCCESS [25.737s]
[INFO] Apache CloudStack Framework - Spring Life Cycle ... SUCCESS [2.230s]
[INFO] Apache CloudStack Plugin - Network Juniper Contrail  FAILURE [5.354s]
[INFO] Apache CloudStack Plugin - Palo Alto .............. SUCCESS [23.869s]
[INFO] Apache CloudStack Plugin - Network Netscaler ...... SUCCESS [14.530s]
[INFO] Apache CloudStack Plugin - Network Nicira NVP ..... SUCCESS [33.501s]
[INFO] Apache CloudStack Plugin - BigSwitch Virtual Network Segment  SUCCESS [20.482s]
[INFO] Apache CloudStack Plugin - Network Brocade VCS .... SUCCESS [27.671s]
[INFO] Apache CloudStack Plugin - Midokura Midonet ....... SUCCESS [26.381s]
[INFO] Apache CloudStack Plugin - Stratosphere SSP ....... SUCCESS [18.985s]
[INFO] Apache CloudStack Plugin - Network Opendaylight ... SUCCESS [18.362s]
[INFO] Apache CloudStack Plugin - Storage Allocator Random  SUCCESS [6.433s]
[INFO] Apache CloudStack Plugin - User Authenticator LDAP  SUCCESS [12.819s]
[INFO] Apache CloudStack Plugin - User Authenticator MD5 . SUCCESS [12.816s]
[INFO] Apache CloudStack Plugin - User Authenticator Plain Text  SUCCESS [5.475s]
[INFO] Apache CloudStack Plugin - User Authenticator SAML2  SUCCESS [32.025s]
[INFO] Apache CloudStack Plugin - User Authenticator SHA256 Salted  SUCCESS [14.863s]
[INFO] Apache CloudStack Plugin - Dns Notifier Example ... SUCCESS [6.232s]
[INFO] Apache CloudStack Plugin - Storage Image S3 ....... SUCCESS [8.432s]
[INFO] Apache CloudStack Plugin - Storage Image Swift provider  SUCCESS [7.649s]
[INFO] Apache CloudStack Plugin - Storage Image default provider  SUCCESS [6.699s]
[INFO] Apache CloudStack Plugin - Storage Image sample provider  SUCCESS [4.153s]
[INFO] Apache CloudStack Plugin - Storage Volume Nexenta Provider  SUCCESS [13.365s]
[INFO] Apache CloudStack Plugin - Storage Volume CloudByte Provider  SUCCESS [11.357s]
[INFO] Apache CloudStack Plugin - Storage Volume sample provider  SUCCESS [7.004s]
[INFO] Apache CloudStack Plugin - SNMP Alerts ............ SUCCESS [14.351s]
[INFO] Apache CloudStack Plugin - Syslog Alerts .......... SUCCESS [13.366s]
[INFO] Apache CloudStack Plugin - Network VXLAN .......... SUCCESS [16.038s]
[INFO] Apache CloudStack Plugin - GloboDNS ............... SUCCESS [22.589s]
[INFO] Apache CloudStack Plugin - NetApp File System ..... SUCCESS [8.327s]
[INFO] Apache CloudStack Plugin - F5 ..................... SUCCESS [8.602s]
[INFO] Apache CloudStack Plugin - Juniper SRX ............ SUCCESS [8.485s]
[INFO] Apache CloudStack Plugin - Nuage VSP .............. SUCCESS [18.225s]
[INFO] Apache CloudStack VMware Base ..................... SUCCESS [7.712s]
[INFO] Apache CloudStack Plugin - Hypervisor VMware ...... SUCCESS [32.945s]
[INFO] Apache CloudStack Plugin - Cisco VNMC ............. SKIPPED
[INFO] Apache CloudStack Plugin - MySQL HA Strategy ...... SUCCESS [5.082s]
[INFO] Apache CloudStack Framework - Spring Module ....... SUCCESS [9.207s]
[INFO] Apache CloudStack Secondary Storage Controller .... SUCCESS [7.218s]
[INFO] Apache CloudStack Console Proxy - RDP Client ...... SUCCESS [11.226s]
[INFO] Apache CloudStack Console Proxy ................... SUCCESS [2.445s]
[INFO] Apache CloudStack Console Proxy - Server .......... SUCCESS [8.141s]
[INFO] Apache CloudStack System VM ....................... SKIPPED
[INFO] Apache CloudStack Client UI ....................... SKIPPED
[INFO] Apache CloudStack Framework - QuickCloud .......... SUCCESS [1.461s]
[INFO] Apache CloudStack AWS API Bridge .................. SKIPPED
[INFO] ------------------------------------------------------------------------
[INFO] BUILD FAILURE
[INFO] ------------------------------------------------------------------------
[INFO] Total time: 4:14.950s (Wall Clock)
[INFO] Finished at: Wed Jan 07 07:44:21 CET 2015
[INFO] Final Memory: 112M/455M
[INFO] ------------------------------------------------------------------------
[ERROR] Failed to execute goal org.apache.maven.plugins:maven-compiler-plugin:3.2:compile (default-compile) on project cloud-plugin-network-contrail: Compilation failure
[ERROR] error: error reading /jenkins/.m2/repository/org/apache/commons/commons-exec/1.3/commons-exec-1.3.jar; error in opening zip file
[ERROR] -> [Help 1]
[ERROR] 
[ERROR] To see the full stack trace of the errors, re-run Maven with the -e switch.
[ERROR] Re-run Maven using the -X switch to enable full debug logging.
[ERROR] 
[ERROR] For more information about the errors and possible solutions, please read the following articles:
[ERROR] [Help 1] http://cwiki.apache.org/confluence/display/MAVEN/MojoFailureException
[ERROR] 
[ERROR] After correcting the problems, you can resume the build with the command
[ERROR]   mvn <goals> -rf :cloud-plugin-network-contrail
Destroying 1 processes
Destroying process..
Destroyed 1 processes
Destroying 1 processes
Destroying process..
Destroyed 1 processes
Build step 'Invoke top-level Maven targets' marked build as failure
Archiving artifacts

Jenkins build is back to normal : build-master-noredist #4019

Posted by je...@cloudstack.org.
See <http://jenkins.buildacloud.org/job/build-master-noredist/4019/changes>


Build failed in Jenkins: build-master-noredist #4018

Posted by je...@cloudstack.org.
See <http://jenkins.buildacloud.org/job/build-master-noredist/4018/changes>

Changes:

[brian.federle] UI validation: Fix asterisk showing up on non-required fields

------------------------------------------
[...truncated 7710 lines...]
[INFO] Tests are skipped.
[INFO] 
[INFO] --- maven-install-plugin:2.3.1:install (default-install) @ cloud-plugin-storage-volume-solidfire ---
[INFO] Installing <http://jenkins.buildacloud.org/job/build-master-noredist/ws/plugins/storage/volume/solidfire/target/cloud-plugin-storage-volume-solidfire-4.6.0-SNAPSHOT.jar> to /jenkins/.m2/repository/org/apache/cloudstack/cloud-plugin-storage-volume-solidfire/4.6.0-SNAPSHOT/cloud-plugin-storage-volume-solidfire-4.6.0-SNAPSHOT.jar
[INFO] Installing <http://jenkins.buildacloud.org/job/build-master-noredist/ws/plugins/storage/volume/solidfire/pom.xml> to /jenkins/.m2/repository/org/apache/cloudstack/cloud-plugin-storage-volume-solidfire/4.6.0-SNAPSHOT/cloud-plugin-storage-volume-solidfire-4.6.0-SNAPSHOT.pom
[INFO]                                                                         
[INFO] ------------------------------------------------------------------------
[INFO] Building Apache CloudStack Plugin - API SolidFire 4.6.0-SNAPSHOT
[INFO] ------------------------------------------------------------------------
[INFO] 
[INFO] --- maven-site-plugin:3.3:attach-descriptor (attach-descriptor) @ cloud-plugin-storage-volume-cloudbyte ---
[INFO] 
[INFO] --- maven-surefire-plugin:2.18.1:test (default) @ cloud-plugin-storage-volume-cloudbyte ---
[INFO] Tests are skipped.
[INFO] 
[INFO] --- maven-install-plugin:2.3.1:install (default-install) @ cloud-plugin-storage-volume-cloudbyte ---
[INFO] Installing <http://jenkins.buildacloud.org/job/build-master-noredist/ws/plugins/storage/volume/cloudbyte/target/cloud-plugin-storage-volume-cloudbyte-4.6.0-SNAPSHOT.jar> to /jenkins/.m2/repository/org/apache/cloudstack/cloud-plugin-storage-volume-cloudbyte/4.6.0-SNAPSHOT/cloud-plugin-storage-volume-cloudbyte-4.6.0-SNAPSHOT.jar
[INFO] Installing <http://jenkins.buildacloud.org/job/build-master-noredist/ws/plugins/storage/volume/cloudbyte/pom.xml> to /jenkins/.m2/repository/org/apache/cloudstack/cloud-plugin-storage-volume-cloudbyte/4.6.0-SNAPSHOT/cloud-plugin-storage-volume-cloudbyte-4.6.0-SNAPSHOT.pom
[INFO] 
[INFO] --- maven-clean-plugin:2.5:clean (default-clean) @ cloud-plugin-api-solidfire-intg-test ---
[INFO] Deleting <http://jenkins.buildacloud.org/job/build-master-noredist/ws/plugins/api/solidfire-intg-test/target> (includes = [**/*], excludes = [])
[INFO] Deleting <http://jenkins.buildacloud.org/job/build-master-noredist/ws/plugins/api/solidfire-intg-test> (includes = [target, dist], excludes = [])
[INFO] 
[INFO] --- maven-checkstyle-plugin:2.11:check (cloudstack-checkstyle) @ cloud-plugin-api-solidfire-intg-test ---
[INFO] 
[INFO] --- maven-resources-plugin:2.5:resources (default-resources) @ cloud-plugin-network-contrail ---
[debug] execute contextualize
[INFO] Using 'UTF-8' encoding to copy filtered resources.
[INFO] Copying 3 resources
[INFO] Copying 3 resources
[INFO] 
[INFO] --- maven-compiler-plugin:3.2:compile (default-compile) @ cloud-plugin-network-contrail ---
[INFO] Changes detected - recompiling the module!
[INFO] Compiling 30 source files to <http://jenkins.buildacloud.org/job/build-master-noredist/ws/plugins/network-elements/juniper-contrail/target/classes>
[INFO] Starting audit...
Audit done.

[INFO] 
[INFO] --- maven-remote-resources-plugin:1.3:process (default) @ cloud-plugin-api-solidfire-intg-test ---
[INFO] 
[INFO] --- maven-resources-plugin:2.5:testResources (default-testResources) @ cloud-plugin-storage-image-sample ---
[debug] execute contextualize
[INFO] Using 'UTF-8' encoding to copy filtered resources.
[INFO] skip non existing resourceDirectory <http://jenkins.buildacloud.org/job/build-master-noredist/ws/plugins/storage/image/sample/test/resources>
[INFO] Copying 3 resources
[INFO] 
[INFO] --- maven-compiler-plugin:3.2:testCompile (default-testCompile) @ cloud-plugin-storage-image-sample ---
[INFO] No sources to compile
[INFO] 
[INFO] --- maven-surefire-plugin:2.18.1:test (default-test) @ cloud-plugin-storage-image-sample ---
[INFO] Tests are skipped.
[INFO] 
[INFO] --- maven-jar-plugin:2.5:jar (default-jar) @ cloud-plugin-storage-image-sample ---
[INFO] Building jar: <http://jenkins.buildacloud.org/job/build-master-noredist/ws/plugins/storage/image/sample/target/cloud-plugin-storage-image-sample-4.6.0-SNAPSHOT.jar>
[INFO] 
[INFO] --- maven-site-plugin:3.3:attach-descriptor (attach-descriptor) @ cloud-plugin-storage-image-sample ---
[INFO] 
[INFO] --- maven-surefire-plugin:2.18.1:test (default) @ cloud-plugin-storage-image-sample ---
[INFO] Tests are skipped.
[INFO] 
[INFO] --- maven-install-plugin:2.3.1:install (default-install) @ cloud-plugin-storage-image-sample ---
[INFO] Installing <http://jenkins.buildacloud.org/job/build-master-noredist/ws/plugins/storage/image/sample/target/cloud-plugin-storage-image-sample-4.6.0-SNAPSHOT.jar> to /jenkins/.m2/repository/org/apache/cloudstack/cloud-plugin-storage-image-sample/4.6.0-SNAPSHOT/cloud-plugin-storage-image-sample-4.6.0-SNAPSHOT.jar
[INFO] Installing <http://jenkins.buildacloud.org/job/build-master-noredist/ws/plugins/storage/image/sample/pom.xml> to /jenkins/.m2/repository/org/apache/cloudstack/cloud-plugin-storage-image-sample/4.6.0-SNAPSHOT/cloud-plugin-storage-image-sample-4.6.0-SNAPSHOT.pom
[INFO] 
[INFO] --- maven-resources-plugin:2.5:resources (default-resources) @ cloud-plugin-api-solidfire-intg-test ---
[debug] execute contextualize
[INFO] Using 'UTF-8' encoding to copy filtered resources.
[INFO] Copying 2 resources
[INFO] Copying 3 resources
[INFO] 
[INFO] --- maven-compiler-plugin:3.2:compile (default-compile) @ cloud-plugin-api-solidfire-intg-test ---
[INFO] Changes detected - recompiling the module!
[INFO] Compiling 10 source files to <http://jenkins.buildacloud.org/job/build-master-noredist/ws/plugins/api/solidfire-intg-test/target/classes>
[INFO] -------------------------------------------------------------
[ERROR] COMPILATION ERROR : 
[INFO] -------------------------------------------------------------
[ERROR] error: error reading /jenkins/.m2/repository/org/apache/commons/commons-exec/1.3/commons-exec-1.3.jar; error in opening zip file
[INFO] 1 error
[INFO] -------------------------------------------------------------
Tests run: 3, Failures: 0, Errors: 0, Skipped: 0, Time elapsed: 2.648 sec - in com.cloud.hypervisor.vmware.VmwareDatacenterApiUnitTest
Running org.apache.cloudstack.storage.motion.VmwareStorageMotionStrategyTest
Tests run: 6, Failures: 0, Errors: 0, Skipped: 0, Time elapsed: 0.585 sec - in org.apache.cloudstack.storage.motion.VmwareStorageMotionStrategyTest

Results :

Tests run: 10, Failures: 0, Errors: 0, Skipped: 0

[INFO] 
[INFO] --- maven-jar-plugin:2.5:jar (default-jar) @ cloud-plugin-hypervisor-vmware ---
[INFO] Building jar: <http://jenkins.buildacloud.org/job/build-master-noredist/ws/plugins/hypervisors/vmware/target/cloud-plugin-hypervisor-vmware-4.6.0-SNAPSHOT.jar>
[INFO] 
[INFO] --- maven-site-plugin:3.3:attach-descriptor (attach-descriptor) @ cloud-plugin-hypervisor-vmware ---
[INFO] 
[INFO] --- maven-install-plugin:2.3.1:install (default-install) @ cloud-plugin-hypervisor-vmware ---
[INFO] Installing <http://jenkins.buildacloud.org/job/build-master-noredist/ws/plugins/hypervisors/vmware/target/cloud-plugin-hypervisor-vmware-4.6.0-SNAPSHOT.jar> to /jenkins/.m2/repository/org/apache/cloudstack/cloud-plugin-hypervisor-vmware/4.6.0-SNAPSHOT/cloud-plugin-hypervisor-vmware-4.6.0-SNAPSHOT.jar
[INFO] Installing <http://jenkins.buildacloud.org/job/build-master-noredist/ws/plugins/hypervisors/vmware/pom.xml> to /jenkins/.m2/repository/org/apache/cloudstack/cloud-plugin-hypervisor-vmware/4.6.0-SNAPSHOT/cloud-plugin-hypervisor-vmware-4.6.0-SNAPSHOT.pom
[INFO] 
[INFO] --- maven-resources-plugin:2.5:testResources (default-testResources) @ cloud-plugin-api-solidfire-intg-test ---
[debug] execute contextualize
[INFO] Using 'UTF-8' encoding to copy filtered resources.
[INFO] skip non existing resourceDirectory <http://jenkins.buildacloud.org/job/build-master-noredist/ws/plugins/api/solidfire-intg-test/test/resources>
[INFO] Copying 3 resources
[INFO] 
[INFO] --- maven-compiler-plugin:3.2:testCompile (default-testCompile) @ cloud-plugin-api-solidfire-intg-test ---
[INFO] No sources to compile
[INFO] 
[INFO] --- maven-surefire-plugin:2.18.1:test (default-test) @ cloud-plugin-api-solidfire-intg-test ---
[INFO] 
[INFO] --- maven-jar-plugin:2.5:jar (default-jar) @ cloud-plugin-api-solidfire-intg-test ---
[INFO] Building jar: <http://jenkins.buildacloud.org/job/build-master-noredist/ws/plugins/api/solidfire-intg-test/target/cloud-plugin-api-solidfire-intg-test-4.6.0-SNAPSHOT.jar>
[INFO] 
[INFO] --- maven-site-plugin:3.3:attach-descriptor (attach-descriptor) @ cloud-plugin-api-solidfire-intg-test ---
[INFO] 
[INFO] --- maven-install-plugin:2.3.1:install (default-install) @ cloud-plugin-api-solidfire-intg-test ---
[INFO] Installing <http://jenkins.buildacloud.org/job/build-master-noredist/ws/plugins/api/solidfire-intg-test/target/cloud-plugin-api-solidfire-intg-test-4.6.0-SNAPSHOT.jar> to /jenkins/.m2/repository/org/apache/cloudstack/cloud-plugin-api-solidfire-intg-test/4.6.0-SNAPSHOT/cloud-plugin-api-solidfire-intg-test-4.6.0-SNAPSHOT.jar
[INFO] Installing <http://jenkins.buildacloud.org/job/build-master-noredist/ws/plugins/api/solidfire-intg-test/pom.xml> to /jenkins/.m2/repository/org/apache/cloudstack/cloud-plugin-api-solidfire-intg-test/4.6.0-SNAPSHOT/cloud-plugin-api-solidfire-intg-test-4.6.0-SNAPSHOT.pom
[INFO] ------------------------------------------------------------------------
[INFO] Reactor Summary:
[INFO] 
[INFO] Apache CloudStack Developer Tools - Checkstyle Configuration  SUCCESS [0.777s]
[INFO] Apache CloudStack ................................. SUCCESS [1.318s]
[INFO] Apache CloudStack Maven Conventions Parent ........ SUCCESS [1.357s]
[INFO] Apache CloudStack Framework - Managed Context ..... SUCCESS [4.662s]
[INFO] Apache CloudStack Utils ........................... SUCCESS [12.451s]
[INFO] Apache CloudStack Framework ....................... SUCCESS [0.431s]
[INFO] Apache CloudStack Framework - Event Notification .. SUCCESS [9.406s]
[INFO] Apache CloudStack Framework - Configuration ....... SUCCESS [3.761s]
[INFO] Apache CloudStack API ............................. SUCCESS [12.380s]
[INFO] Apache CloudStack Framework - REST ................ SUCCESS [5.733s]
[INFO] Apache CloudStack Framework - IPC ................. SUCCESS [5.017s]
[INFO] Apache CloudStack Cloud Engine .................... SUCCESS [0.430s]
[INFO] Apache CloudStack Cloud Engine API ................ SUCCESS [4.744s]
[INFO] Apache CloudStack Framework - Security ............ SUCCESS [2.691s]
[INFO] Apache CloudStack Core ............................ SUCCESS [21.873s]
[INFO] Apache CloudStack Agents .......................... SUCCESS [7.773s]
[INFO] Apache CloudStack Framework - Clustering .......... SUCCESS [3.384s]
[INFO] Apache CloudStack Framework - Event Notification .. SUCCESS [3.301s]
[INFO] Apache CloudStack Cloud Engine Schema Component ... SUCCESS [14.080s]
[INFO] Apache CloudStack Framework - Jobs ................ SUCCESS [6.888s]
[INFO] Apache CloudStack Cloud Engine Internal Components API  SUCCESS [2.666s]
[INFO] Apache CloudStack Server .......................... SUCCESS [37.502s]
[INFO] Apache CloudStack Usage Server .................... SUCCESS [9.804s]
[INFO] Apache CloudStack Cloud Engine Orchestration Component  SUCCESS [11.739s]
[INFO] Apache CloudStack Cloud Services .................. SUCCESS [0.429s]
[INFO] Apache CloudStack Secondary Storage ............... SUCCESS [3.656s]
[INFO] Apache CloudStack Secondary Storage Service ....... SUCCESS [12.247s]
[INFO] Apache CloudStack Engine Storage Component ........ SUCCESS [16.524s]
[INFO] Apache CloudStack Engine Storage Volume Component . SUCCESS [13.849s]
[INFO] Apache CloudStack Engine Storage Image Component .. SUCCESS [9.543s]
[INFO] Apache CloudStack Engine Storage Data Motion Component  SUCCESS [8.905s]
[INFO] Apache CloudStack Engine Storage Cache Component .. SUCCESS [7.253s]
[INFO] Apache CloudStack Engine Storage Snapshot Component  SUCCESS [28.358s]
[INFO] Apache CloudStack Cloud Engine API ................ SUCCESS [3.340s]
[INFO] Apache CloudStack Cloud Engine Service ............ SUCCESS [18.722s]
[INFO] Apache CloudStack Plugin POM ...................... SUCCESS [0.434s]
[INFO] Apache CloudStack Plugin - API Rate Limit ......... SUCCESS [19.702s]
[INFO] Apache CloudStack Plugin - Storage Volume default provider  SUCCESS [9.220s]
[INFO] Apache CloudStack Plugin - Storage Volume SolidFire Provider  SUCCESS [14.925s]
[INFO] Apache CloudStack Plugin - API SolidFire .......... SUCCESS [3.495s]
[INFO] Apache CloudStack Plugin - API Discovery .......... SUCCESS [14.373s]
[INFO] Apache CloudStack Plugin - ACL Static Role Based .. SUCCESS [7.708s]
[INFO] Apache CloudStack Plugin - Host Anti-Affinity Processor  SUCCESS [8.288s]
[INFO] Apache CloudStack Plugin - Explicit Dedication Processor  SUCCESS [8.073s]
[INFO] Apache CloudStack Plugin - User Concentrated Pod Deployment Planner  SUCCESS [8.184s]
[INFO] Apache CloudStack Plugin - User Dispersing Deployment Planner  SUCCESS [6.409s]
[INFO] Apache CloudStack Plugin - Implicit Dedication Planner  SUCCESS [22.500s]
[INFO] Apache CloudStack Plugin - Skip Heurestics Planner  SUCCESS [7.033s]
[INFO] Apache CloudStack Plugin - Host Allocator Random .. SUCCESS [6.688s]
[INFO] Apache CloudStack Plugin - Dedicated Resources .... SUCCESS [21.480s]
[INFO] Apache CloudStack Plugin - Hypervisor OracleVM .... SUCCESS [8.539s]
[INFO] Apache CloudStack Plugin - Open vSwitch ........... SUCCESS [9.568s]
[INFO] Apache CloudStack Plugin - Hypervisor XenServer ... SUCCESS [29.116s]
[INFO] Apache CloudStack Plugin - Hypervisor KVM ......... SUCCESS [21.776s]
[INFO] Apache CloudStack Plugin - RabbitMQ Event Bus ..... SUCCESS [6.077s]
[INFO] Apache CloudStack Plugin - In Memory Event Bus .... SUCCESS [14.496s]
[INFO] Apache CloudStack Plugin - Hypervisor Baremetal ... SUCCESS [13.955s]
[INFO] Apache CloudStack Plugin - Hypervisor UCS ......... SUCCESS [8.854s]
[INFO] Apache CloudStack Plugin - Hypervisor Hyper-V ..... SUCCESS [14.312s]
[INFO] Apache CloudStack Plugin - Network Elastic Load Balancer  SUCCESS [17.943s]
[INFO] Apache CloudStack Plugin - Network Internal Load Balancer  SUCCESS [28.043s]
[INFO] Apache CloudStack Framework - Spring Life Cycle ... SUCCESS [2.247s]
[INFO] Apache CloudStack Plugin - Network Juniper Contrail  FAILURE [3.732s]
[INFO] Apache CloudStack Plugin - Palo Alto .............. SUCCESS [23.220s]
[INFO] Apache CloudStack Plugin - Network Netscaler ...... SUCCESS [12.083s]
[INFO] Apache CloudStack Plugin - Network Nicira NVP ..... SUCCESS [35.458s]
[INFO] Apache CloudStack Plugin - BigSwitch Virtual Network Segment  SUCCESS [19.065s]
[INFO] Apache CloudStack Plugin - Network Brocade VCS .... SUCCESS [26.511s]
[INFO] Apache CloudStack Plugin - Midokura Midonet ....... SUCCESS [21.039s]
[INFO] Apache CloudStack Plugin - Stratosphere SSP ....... SUCCESS [19.674s]
[INFO] Apache CloudStack Plugin - Network Opendaylight ... SUCCESS [18.585s]
[INFO] Apache CloudStack Plugin - Storage Allocator Random  SUCCESS [5.784s]
[INFO] Apache CloudStack Plugin - User Authenticator LDAP  SUCCESS [9.193s]
[INFO] Apache CloudStack Plugin - User Authenticator MD5 . SUCCESS [13.999s]
[INFO] Apache CloudStack Plugin - User Authenticator Plain Text  SUCCESS [5.009s]
[INFO] Apache CloudStack Plugin - User Authenticator SAML2  SUCCESS [31.914s]
[INFO] Apache CloudStack Plugin - User Authenticator SHA256 Salted  SUCCESS [15.268s]
[INFO] Apache CloudStack Plugin - Dns Notifier Example ... SUCCESS [5.929s]
[INFO] Apache CloudStack Plugin - Storage Image S3 ....... SUCCESS [6.598s]
[INFO] Apache CloudStack Plugin - Storage Image Swift provider  SUCCESS [6.721s]
[INFO] Apache CloudStack Plugin - Storage Image default provider  SUCCESS [6.292s]
[INFO] Apache CloudStack Plugin - Storage Image sample provider  SUCCESS [6.351s]
[INFO] Apache CloudStack Plugin - Storage Volume Nexenta Provider  SUCCESS [13.790s]
[INFO] Apache CloudStack Plugin - Storage Volume CloudByte Provider  SUCCESS [9.755s]
[INFO] Apache CloudStack Plugin - Storage Volume sample provider  SUCCESS [6.568s]
[INFO] Apache CloudStack Plugin - SNMP Alerts ............ SUCCESS [14.200s]
[INFO] Apache CloudStack Plugin - Syslog Alerts .......... SUCCESS [12.081s]
[INFO] Apache CloudStack Plugin - Network VXLAN .......... SUCCESS [16.118s]
[INFO] Apache CloudStack Plugin - GloboDNS ............... SUCCESS [23.798s]
[INFO] Apache CloudStack Plugin - NetApp File System ..... SUCCESS [8.589s]
[INFO] Apache CloudStack Plugin - F5 ..................... SUCCESS [8.665s]
[INFO] Apache CloudStack Plugin - Juniper SRX ............ SUCCESS [10.085s]
[INFO] Apache CloudStack Plugin - Nuage VSP .............. SUCCESS [18.520s]
[INFO] Apache CloudStack VMware Base ..................... SUCCESS [7.528s]
[INFO] Apache CloudStack Plugin - Hypervisor VMware ...... SUCCESS [34.019s]
[INFO] Apache CloudStack Plugin - Cisco VNMC ............. SKIPPED
[INFO] Apache CloudStack Plugin - MySQL HA Strategy ...... SUCCESS [6.065s]
[INFO] Apache CloudStack Framework - Spring Module ....... SUCCESS [9.347s]
[INFO] Apache CloudStack Secondary Storage Controller .... SUCCESS [6.477s]
[INFO] Apache CloudStack Console Proxy - RDP Client ...... SUCCESS [12.201s]
[INFO] Apache CloudStack Console Proxy ................... SUCCESS [3.437s]
[INFO] Apache CloudStack Console Proxy - Server .......... SUCCESS [7.536s]
[INFO] Apache CloudStack System VM ....................... SKIPPED
[INFO] Apache CloudStack Client UI ....................... SKIPPED
[INFO] Apache CloudStack Framework - QuickCloud .......... SUCCESS [1.412s]
[INFO] Apache CloudStack AWS API Bridge .................. SKIPPED
[INFO] ------------------------------------------------------------------------
[INFO] BUILD FAILURE
[INFO] ------------------------------------------------------------------------
[INFO] Total time: 4:12.983s (Wall Clock)
[INFO] Finished at: Wed Jan 07 18:07:59 CET 2015
[INFO] Final Memory: 105M/449M
[INFO] ------------------------------------------------------------------------
[ERROR] Failed to execute goal org.apache.maven.plugins:maven-compiler-plugin:3.2:compile (default-compile) on project cloud-plugin-network-contrail: Compilation failure
[ERROR] error: error reading /jenkins/.m2/repository/org/apache/commons/commons-exec/1.3/commons-exec-1.3.jar; error in opening zip file
[ERROR] -> [Help 1]
[ERROR] 
[ERROR] To see the full stack trace of the errors, re-run Maven with the -e switch.
[ERROR] Re-run Maven using the -X switch to enable full debug logging.
[ERROR] 
[ERROR] For more information about the errors and possible solutions, please read the following articles:
[ERROR] [Help 1] http://cwiki.apache.org/confluence/display/MAVEN/MojoFailureException
[ERROR] 
[ERROR] After correcting the problems, you can resume the build with the command
[ERROR]   mvn <goals> -rf :cloud-plugin-network-contrail
Destroying 1 processes
Destroying process..
Destroyed 1 processes
Build step 'Invoke top-level Maven targets' marked build as failure
Archiving artifacts

Build failed in Jenkins: build-master-noredist #4017

Posted by je...@cloudstack.org.
See <http://jenkins.buildacloud.org/job/build-master-noredist/4017/changes>

Changes:

[kishan] Bug-Id: CLOUDSTACK-3439: Include dynamically created nics in Prepare for migration command in KVM

[kishan] While deploying Vm with DataDisk in LXC, if the rbd image mapping on the host fails, deploy Vm should fail

------------------------------------------
[...truncated 7710 lines...]
[INFO] Using 'UTF-8' encoding to copy filtered resources.
[INFO] skip non existing resourceDirectory <http://jenkins.buildacloud.org/job/build-master-noredist/ws/plugins/storage/image/sample/test/resources>
[INFO] Copying 3 resources
[INFO] 
[INFO] --- maven-compiler-plugin:3.2:testCompile (default-testCompile) @ cloud-plugin-storage-image-sample ---
[INFO] No sources to compile
[INFO] 
[INFO] --- maven-surefire-plugin:2.18.1:test (default-test) @ cloud-plugin-storage-image-sample ---
[INFO] Tests are skipped.
[INFO] 
[INFO] --- maven-jar-plugin:2.5:jar (default-jar) @ cloud-plugin-storage-image-sample ---
[INFO] Building jar: <http://jenkins.buildacloud.org/job/build-master-noredist/ws/plugins/storage/image/sample/target/cloud-plugin-storage-image-sample-4.6.0-SNAPSHOT.jar>
[INFO] 
[INFO] --- maven-site-plugin:3.3:attach-descriptor (attach-descriptor) @ cloud-plugin-storage-image-sample ---
[INFO] 
[INFO] --- maven-surefire-plugin:2.18.1:test (default) @ cloud-plugin-storage-image-sample ---
[INFO] Tests are skipped.
[INFO] 
[INFO] --- maven-install-plugin:2.3.1:install (default-install) @ cloud-plugin-storage-image-sample ---
[INFO] Installing <http://jenkins.buildacloud.org/job/build-master-noredist/ws/plugins/storage/image/sample/target/cloud-plugin-storage-image-sample-4.6.0-SNAPSHOT.jar> to /jenkins/.m2/repository/org/apache/cloudstack/cloud-plugin-storage-image-sample/4.6.0-SNAPSHOT/cloud-plugin-storage-image-sample-4.6.0-SNAPSHOT.jar
[INFO] Installing <http://jenkins.buildacloud.org/job/build-master-noredist/ws/plugins/storage/image/sample/pom.xml> to /jenkins/.m2/repository/org/apache/cloudstack/cloud-plugin-storage-image-sample/4.6.0-SNAPSHOT/cloud-plugin-storage-image-sample-4.6.0-SNAPSHOT.pom
Tests run: 1, Failures: 0, Errors: 0, Skipped: 0, Time elapsed: 2.296 sec - in com.cloud.hypervisor.vmware.resource.VmwareResourceTest
Running com.cloud.hypervisor.vmware.VmwareDatacenterApiUnitTest
[INFO] 
[INFO] --- maven-surefire-plugin:2.18.1:test (default-test) @ cloud-plugin-storage-volume-solidfire ---
[INFO] Tests are skipped.
[INFO] 
[INFO] --- maven-jar-plugin:2.5:jar (default-jar) @ cloud-plugin-storage-volume-solidfire ---
[INFO] Building jar: <http://jenkins.buildacloud.org/job/build-master-noredist/ws/plugins/storage/volume/solidfire/target/cloud-plugin-storage-volume-solidfire-4.6.0-SNAPSHOT.jar>
[INFO] 
[INFO] --- maven-site-plugin:3.3:attach-descriptor (attach-descriptor) @ cloud-plugin-storage-volume-solidfire ---
[INFO] 
[INFO] --- maven-surefire-plugin:2.18.1:test (default) @ cloud-plugin-storage-volume-solidfire ---
[INFO] Tests are skipped.
[INFO] 
[INFO] --- maven-install-plugin:2.3.1:install (default-install) @ cloud-plugin-storage-volume-solidfire ---
[INFO] Installing <http://jenkins.buildacloud.org/job/build-master-noredist/ws/plugins/storage/volume/solidfire/target/cloud-plugin-storage-volume-solidfire-4.6.0-SNAPSHOT.jar> to /jenkins/.m2/repository/org/apache/cloudstack/cloud-plugin-storage-volume-solidfire/4.6.0-SNAPSHOT/cloud-plugin-storage-volume-solidfire-4.6.0-SNAPSHOT.jar
[INFO] Installing <http://jenkins.buildacloud.org/job/build-master-noredist/ws/plugins/storage/volume/solidfire/pom.xml> to /jenkins/.m2/repository/org/apache/cloudstack/cloud-plugin-storage-volume-solidfire/4.6.0-SNAPSHOT/cloud-plugin-storage-volume-solidfire-4.6.0-SNAPSHOT.pom
[INFO]                                                                         
[INFO] ------------------------------------------------------------------------
[INFO] Building Apache CloudStack Plugin - API SolidFire 4.6.0-SNAPSHOT
[INFO] ------------------------------------------------------------------------
[INFO] 
[INFO] --- maven-resources-plugin:2.5:resources (default-resources) @ cloud-plugin-network-contrail ---
[debug] execute contextualize
[INFO] Using 'UTF-8' encoding to copy filtered resources.
[INFO] Copying 3 resources
[INFO] Copying 3 resources
[INFO] 
[INFO] --- maven-compiler-plugin:3.2:compile (default-compile) @ cloud-plugin-network-contrail ---
[INFO] Changes detected - recompiling the module!
[INFO] Compiling 30 source files to <http://jenkins.buildacloud.org/job/build-master-noredist/ws/plugins/network-elements/juniper-contrail/target/classes>
[INFO] 
[INFO] --- maven-clean-plugin:2.5:clean (default-clean) @ cloud-plugin-api-solidfire-intg-test ---
[INFO] Deleting <http://jenkins.buildacloud.org/job/build-master-noredist/ws/plugins/api/solidfire-intg-test/target> (includes = [**/*], excludes = [])
[INFO] Deleting <http://jenkins.buildacloud.org/job/build-master-noredist/ws/plugins/api/solidfire-intg-test> (includes = [target, dist], excludes = [])
[INFO] 
[INFO] --- maven-checkstyle-plugin:2.11:check (cloudstack-checkstyle) @ cloud-plugin-api-solidfire-intg-test ---
[INFO] Starting audit...
Audit done.

[INFO] 
[INFO] --- maven-remote-resources-plugin:1.3:process (default) @ cloud-plugin-api-solidfire-intg-test ---
[INFO] 
[INFO] --- maven-resources-plugin:2.5:resources (default-resources) @ cloud-plugin-api-solidfire-intg-test ---
[debug] execute contextualize
[INFO] Using 'UTF-8' encoding to copy filtered resources.
[INFO] Copying 2 resources
[INFO] Copying 3 resources
[INFO] 
[INFO] --- maven-compiler-plugin:3.2:compile (default-compile) @ cloud-plugin-api-solidfire-intg-test ---
[INFO] Changes detected - recompiling the module!
[INFO] Compiling 10 source files to <http://jenkins.buildacloud.org/job/build-master-noredist/ws/plugins/api/solidfire-intg-test/target/classes>
[INFO] -------------------------------------------------------------
[ERROR] COMPILATION ERROR : 
[INFO] -------------------------------------------------------------
[ERROR] error: error reading /jenkins/.m2/repository/org/apache/commons/commons-exec/1.3/commons-exec-1.3.jar; error in opening zip file
[INFO] 1 error
[INFO] -------------------------------------------------------------
Tests run: 3, Failures: 0, Errors: 0, Skipped: 0, Time elapsed: 2.726 sec - in com.cloud.hypervisor.vmware.VmwareDatacenterApiUnitTest
Running org.apache.cloudstack.storage.motion.VmwareStorageMotionStrategyTest
Tests run: 6, Failures: 0, Errors: 0, Skipped: 0, Time elapsed: 0.571 sec - in org.apache.cloudstack.storage.motion.VmwareStorageMotionStrategyTest
[INFO] 
[INFO] --- maven-resources-plugin:2.5:testResources (default-testResources) @ cloud-plugin-api-solidfire-intg-test ---
[debug] execute contextualize
[INFO] Using 'UTF-8' encoding to copy filtered resources.
[INFO] skip non existing resourceDirectory <http://jenkins.buildacloud.org/job/build-master-noredist/ws/plugins/api/solidfire-intg-test/test/resources>
[INFO] Copying 3 resources
[INFO] 
[INFO] --- maven-compiler-plugin:3.2:testCompile (default-testCompile) @ cloud-plugin-api-solidfire-intg-test ---
[INFO] No sources to compile
[INFO] 
[INFO] --- maven-surefire-plugin:2.18.1:test (default-test) @ cloud-plugin-api-solidfire-intg-test ---

Results :

Tests run: 10, Failures: 0, Errors: 0, Skipped: 0

[INFO] 
[INFO] --- maven-jar-plugin:2.5:jar (default-jar) @ cloud-plugin-api-solidfire-intg-test ---
[INFO] 
[INFO] --- maven-jar-plugin:2.5:jar (default-jar) @ cloud-plugin-hypervisor-vmware ---
[INFO] Building jar: <http://jenkins.buildacloud.org/job/build-master-noredist/ws/plugins/api/solidfire-intg-test/target/cloud-plugin-api-solidfire-intg-test-4.6.0-SNAPSHOT.jar>
[INFO] 
[INFO] --- maven-site-plugin:3.3:attach-descriptor (attach-descriptor) @ cloud-plugin-api-solidfire-intg-test ---
[INFO] 
[INFO] --- maven-install-plugin:2.3.1:install (default-install) @ cloud-plugin-api-solidfire-intg-test ---
[INFO] Installing <http://jenkins.buildacloud.org/job/build-master-noredist/ws/plugins/api/solidfire-intg-test/target/cloud-plugin-api-solidfire-intg-test-4.6.0-SNAPSHOT.jar> to /jenkins/.m2/repository/org/apache/cloudstack/cloud-plugin-api-solidfire-intg-test/4.6.0-SNAPSHOT/cloud-plugin-api-solidfire-intg-test-4.6.0-SNAPSHOT.jar
[INFO] Building jar: <http://jenkins.buildacloud.org/job/build-master-noredist/ws/plugins/hypervisors/vmware/target/cloud-plugin-hypervisor-vmware-4.6.0-SNAPSHOT.jar>
[INFO] Installing <http://jenkins.buildacloud.org/job/build-master-noredist/ws/plugins/api/solidfire-intg-test/pom.xml> to /jenkins/.m2/repository/org/apache/cloudstack/cloud-plugin-api-solidfire-intg-test/4.6.0-SNAPSHOT/cloud-plugin-api-solidfire-intg-test-4.6.0-SNAPSHOT.pom
[INFO] 
[INFO] --- maven-site-plugin:3.3:attach-descriptor (attach-descriptor) @ cloud-plugin-hypervisor-vmware ---
[INFO] 
[INFO] --- maven-install-plugin:2.3.1:install (default-install) @ cloud-plugin-hypervisor-vmware ---
[INFO] Installing <http://jenkins.buildacloud.org/job/build-master-noredist/ws/plugins/hypervisors/vmware/target/cloud-plugin-hypervisor-vmware-4.6.0-SNAPSHOT.jar> to /jenkins/.m2/repository/org/apache/cloudstack/cloud-plugin-hypervisor-vmware/4.6.0-SNAPSHOT/cloud-plugin-hypervisor-vmware-4.6.0-SNAPSHOT.jar
[INFO] Installing <http://jenkins.buildacloud.org/job/build-master-noredist/ws/plugins/hypervisors/vmware/pom.xml> to /jenkins/.m2/repository/org/apache/cloudstack/cloud-plugin-hypervisor-vmware/4.6.0-SNAPSHOT/cloud-plugin-hypervisor-vmware-4.6.0-SNAPSHOT.pom
[INFO] ------------------------------------------------------------------------
[INFO] Reactor Summary:
[INFO] 
[INFO] Apache CloudStack Developer Tools - Checkstyle Configuration  SUCCESS [0.792s]
[INFO] Apache CloudStack ................................. SUCCESS [1.282s]
[INFO] Apache CloudStack Maven Conventions Parent ........ SUCCESS [1.251s]
[INFO] Apache CloudStack Framework - Managed Context ..... SUCCESS [4.583s]
[INFO] Apache CloudStack Utils ........................... SUCCESS [12.004s]
[INFO] Apache CloudStack Framework ....................... SUCCESS [0.445s]
[INFO] Apache CloudStack Framework - Event Notification .. SUCCESS [9.353s]
[INFO] Apache CloudStack Framework - Configuration ....... SUCCESS [3.945s]
[INFO] Apache CloudStack API ............................. SUCCESS [11.994s]
[INFO] Apache CloudStack Framework - REST ................ SUCCESS [5.622s]
[INFO] Apache CloudStack Framework - IPC ................. SUCCESS [5.265s]
[INFO] Apache CloudStack Cloud Engine .................... SUCCESS [0.434s]
[INFO] Apache CloudStack Cloud Engine API ................ SUCCESS [4.611s]
[INFO] Apache CloudStack Framework - Security ............ SUCCESS [2.441s]
[INFO] Apache CloudStack Core ............................ SUCCESS [20.331s]
[INFO] Apache CloudStack Agents .......................... SUCCESS [7.570s]
[INFO] Apache CloudStack Framework - Clustering .......... SUCCESS [3.627s]
[INFO] Apache CloudStack Framework - Event Notification .. SUCCESS [2.974s]
[INFO] Apache CloudStack Cloud Engine Schema Component ... SUCCESS [13.646s]
[INFO] Apache CloudStack Framework - Jobs ................ SUCCESS [6.508s]
[INFO] Apache CloudStack Cloud Engine Internal Components API  SUCCESS [2.866s]
[INFO] Apache CloudStack Server .......................... SUCCESS [36.176s]
[INFO] Apache CloudStack Usage Server .................... SUCCESS [9.869s]
[INFO] Apache CloudStack Cloud Engine Orchestration Component  SUCCESS [11.145s]
[INFO] Apache CloudStack Cloud Services .................. SUCCESS [0.435s]
[INFO] Apache CloudStack Secondary Storage ............... SUCCESS [3.477s]
[INFO] Apache CloudStack Secondary Storage Service ....... SUCCESS [12.978s]
[INFO] Apache CloudStack Engine Storage Component ........ SUCCESS [16.506s]
[INFO] Apache CloudStack Engine Storage Volume Component . SUCCESS [13.803s]
[INFO] Apache CloudStack Engine Storage Image Component .. SUCCESS [9.273s]
[INFO] Apache CloudStack Engine Storage Data Motion Component  SUCCESS [8.219s]
[INFO] Apache CloudStack Engine Storage Cache Component .. SUCCESS [7.236s]
[INFO] Apache CloudStack Engine Storage Snapshot Component  SUCCESS [26.973s]
[INFO] Apache CloudStack Cloud Engine API ................ SUCCESS [3.078s]
[INFO] Apache CloudStack Cloud Engine Service ............ SUCCESS [17.078s]
[INFO] Apache CloudStack Plugin POM ...................... SUCCESS [0.411s]
[INFO] Apache CloudStack Plugin - API Rate Limit ......... SUCCESS [18.925s]
[INFO] Apache CloudStack Plugin - Storage Volume default provider  SUCCESS [8.684s]
[INFO] Apache CloudStack Plugin - Storage Volume SolidFire Provider  SUCCESS [15.315s]
[INFO] Apache CloudStack Plugin - API SolidFire .......... SUCCESS [3.305s]
[INFO] Apache CloudStack Plugin - API Discovery .......... SUCCESS [13.908s]
[INFO] Apache CloudStack Plugin - ACL Static Role Based .. SUCCESS [7.646s]
[INFO] Apache CloudStack Plugin - Host Anti-Affinity Processor  SUCCESS [7.131s]
[INFO] Apache CloudStack Plugin - Explicit Dedication Processor  SUCCESS [7.601s]
[INFO] Apache CloudStack Plugin - User Concentrated Pod Deployment Planner  SUCCESS [7.366s]
[INFO] Apache CloudStack Plugin - User Dispersing Deployment Planner  SUCCESS [6.565s]
[INFO] Apache CloudStack Plugin - Implicit Dedication Planner  SUCCESS [20.409s]
[INFO] Apache CloudStack Plugin - Skip Heurestics Planner  SUCCESS [7.343s]
[INFO] Apache CloudStack Plugin - Host Allocator Random .. SUCCESS [6.326s]
[INFO] Apache CloudStack Plugin - Dedicated Resources .... SUCCESS [21.164s]
[INFO] Apache CloudStack Plugin - Hypervisor OracleVM .... SUCCESS [7.196s]
[INFO] Apache CloudStack Plugin - Open vSwitch ........... SUCCESS [10.101s]
[INFO] Apache CloudStack Plugin - Hypervisor XenServer ... SUCCESS [27.491s]
[INFO] Apache CloudStack Plugin - Hypervisor KVM ......... SUCCESS [22.856s]
[INFO] Apache CloudStack Plugin - RabbitMQ Event Bus ..... SUCCESS [7.004s]
[INFO] Apache CloudStack Plugin - In Memory Event Bus .... SUCCESS [13.399s]
[INFO] Apache CloudStack Plugin - Hypervisor Baremetal ... SUCCESS [12.607s]
[INFO] Apache CloudStack Plugin - Hypervisor UCS ......... SUCCESS [7.360s]
[INFO] Apache CloudStack Plugin - Hypervisor Hyper-V ..... SUCCESS [17.167s]
[INFO] Apache CloudStack Plugin - Network Elastic Load Balancer  SUCCESS [19.078s]
[INFO] Apache CloudStack Plugin - Network Internal Load Balancer  SUCCESS [27.854s]
[INFO] Apache CloudStack Framework - Spring Life Cycle ... SUCCESS [2.025s]
[INFO] Apache CloudStack Plugin - Network Juniper Contrail  FAILURE [4.534s]
[INFO] Apache CloudStack Plugin - Palo Alto .............. SUCCESS [22.405s]
[INFO] Apache CloudStack Plugin - Network Netscaler ...... SUCCESS [12.660s]
[INFO] Apache CloudStack Plugin - Network Nicira NVP ..... SUCCESS [35.831s]
[INFO] Apache CloudStack Plugin - BigSwitch Virtual Network Segment  SUCCESS [19.288s]
[INFO] Apache CloudStack Plugin - Network Brocade VCS .... SUCCESS [26.848s]
[INFO] Apache CloudStack Plugin - Midokura Midonet ....... SUCCESS [21.934s]
[INFO] Apache CloudStack Plugin - Stratosphere SSP ....... SUCCESS [19.550s]
[INFO] Apache CloudStack Plugin - Network Opendaylight ... SUCCESS [18.912s]
[INFO] Apache CloudStack Plugin - Storage Allocator Random  SUCCESS [6.685s]
[INFO] Apache CloudStack Plugin - User Authenticator LDAP  SUCCESS [10.316s]
[INFO] Apache CloudStack Plugin - User Authenticator MD5 . SUCCESS [14.548s]
[INFO] Apache CloudStack Plugin - User Authenticator Plain Text  SUCCESS [6.535s]
[INFO] Apache CloudStack Plugin - User Authenticator SAML2  SUCCESS [35.646s]
[INFO] Apache CloudStack Plugin - User Authenticator SHA256 Salted  SUCCESS [14.249s]
[INFO] Apache CloudStack Plugin - Dns Notifier Example ... SUCCESS [6.322s]
[INFO] Apache CloudStack Plugin - Storage Image S3 ....... SUCCESS [6.955s]
[INFO] Apache CloudStack Plugin - Storage Image Swift provider  SUCCESS [6.608s]
[INFO] Apache CloudStack Plugin - Storage Image default provider  SUCCESS [6.163s]
[INFO] Apache CloudStack Plugin - Storage Image sample provider  SUCCESS [5.952s]
[INFO] Apache CloudStack Plugin - Storage Volume Nexenta Provider  SUCCESS [14.447s]
[INFO] Apache CloudStack Plugin - Storage Volume CloudByte Provider  SUCCESS [9.972s]
[INFO] Apache CloudStack Plugin - Storage Volume sample provider  SUCCESS [6.928s]
[INFO] Apache CloudStack Plugin - SNMP Alerts ............ SUCCESS [15.117s]
[INFO] Apache CloudStack Plugin - Syslog Alerts .......... SUCCESS [12.552s]
[INFO] Apache CloudStack Plugin - Network VXLAN .......... SUCCESS [15.152s]
[INFO] Apache CloudStack Plugin - GloboDNS ............... SUCCESS [23.293s]
[INFO] Apache CloudStack Plugin - NetApp File System ..... SUCCESS [8.434s]
[INFO] Apache CloudStack Plugin - F5 ..................... SUCCESS [8.313s]
[INFO] Apache CloudStack Plugin - Juniper SRX ............ SUCCESS [9.863s]
[INFO] Apache CloudStack Plugin - Nuage VSP .............. SUCCESS [17.933s]
[INFO] Apache CloudStack VMware Base ..................... SUCCESS [7.454s]
[INFO] Apache CloudStack Plugin - Hypervisor VMware ...... SUCCESS [33.944s]
[INFO] Apache CloudStack Plugin - Cisco VNMC ............. SKIPPED
[INFO] Apache CloudStack Plugin - MySQL HA Strategy ...... SUCCESS [5.416s]
[INFO] Apache CloudStack Framework - Spring Module ....... SUCCESS [8.859s]
[INFO] Apache CloudStack Secondary Storage Controller .... SUCCESS [6.292s]
[INFO] Apache CloudStack Console Proxy - RDP Client ...... SUCCESS [11.933s]
[INFO] Apache CloudStack Console Proxy ................... SUCCESS [3.293s]
[INFO] Apache CloudStack Console Proxy - Server .......... SUCCESS [7.761s]
[INFO] Apache CloudStack System VM ....................... SKIPPED
[INFO] Apache CloudStack Client UI ....................... SKIPPED
[INFO] Apache CloudStack Framework - QuickCloud .......... SUCCESS [1.599s]
[INFO] Apache CloudStack AWS API Bridge .................. SKIPPED
[INFO] ------------------------------------------------------------------------
[INFO] BUILD FAILURE
[INFO] ------------------------------------------------------------------------
[INFO] Total time: 4:08.392s (Wall Clock)
[INFO] Finished at: Wed Jan 07 10:57:53 CET 2015
[INFO] Final Memory: 105M/485M
[INFO] ------------------------------------------------------------------------
[ERROR] Failed to execute goal org.apache.maven.plugins:maven-compiler-plugin:3.2:compile (default-compile) on project cloud-plugin-network-contrail: Compilation failure
[ERROR] error: error reading /jenkins/.m2/repository/org/apache/commons/commons-exec/1.3/commons-exec-1.3.jar; error in opening zip file
[ERROR] -> [Help 1]
[ERROR] 
[ERROR] To see the full stack trace of the errors, re-run Maven with the -e switch.
[ERROR] Re-run Maven using the -X switch to enable full debug logging.
[ERROR] 
[ERROR] For more information about the errors and possible solutions, please read the following articles:
[ERROR] [Help 1] http://cwiki.apache.org/confluence/display/MAVEN/MojoFailureException
[ERROR] 
[ERROR] After correcting the problems, you can resume the build with the command
[ERROR]   mvn <goals> -rf :cloud-plugin-network-contrail
Destroying 1 processes
Destroying process..
Destroyed 1 processes
Build step 'Invoke top-level Maven targets' marked build as failure
Archiving artifacts

Build failed in Jenkins: build-master-noredist #4016

Posted by je...@cloudstack.org.
See <http://jenkins.buildacloud.org/job/build-master-noredist/4016/changes>

Changes:

[kishan] Close transaction while fetching recent events

[kishan] For Vm snapshot delete event, check for null size and set it as zero

[kishan] Network Id for direct-network should not be included in usage record response. Direct network stats have network_id = 0. Ignore network with id = 0 in usage record

[kishan] Increased SSL handshake timeout to 30 seconds

[kishan] Bug-Id: CLOUDSTACK-7395: reverted 0560254c04425705530a23a93002daede4b6dc3c partially. Allow multiple networks with LB service

------------------------------------------
[...truncated 7620 lines...]
[INFO] --- maven-surefire-plugin:2.18.1:test (default-test) @ cloud-plugin-storage-volume-cloudbyte ---
[INFO] Tests are skipped.
[INFO] 
[INFO] --- maven-jar-plugin:2.5:jar (default-jar) @ cloud-plugin-storage-volume-cloudbyte ---
[INFO] Building jar: <http://jenkins.buildacloud.org/job/build-master-noredist/ws/plugins/storage/volume/cloudbyte/target/cloud-plugin-storage-volume-cloudbyte-4.6.0-SNAPSHOT.jar>
[INFO] 
[INFO] --- maven-site-plugin:3.3:attach-descriptor (attach-descriptor) @ cloud-plugin-storage-volume-cloudbyte ---
[INFO] 
[INFO] --- maven-surefire-plugin:2.18.1:test (default) @ cloud-plugin-storage-volume-cloudbyte ---
[INFO] Tests are skipped.
[INFO] 
[INFO] --- maven-install-plugin:2.3.1:install (default-install) @ cloud-plugin-storage-volume-cloudbyte ---
[INFO] Installing <http://jenkins.buildacloud.org/job/build-master-noredist/ws/plugins/storage/volume/cloudbyte/target/cloud-plugin-storage-volume-cloudbyte-4.6.0-SNAPSHOT.jar> to /jenkins/.m2/repository/org/apache/cloudstack/cloud-plugin-storage-volume-cloudbyte/4.6.0-SNAPSHOT/cloud-plugin-storage-volume-cloudbyte-4.6.0-SNAPSHOT.jar
[INFO] Installing <http://jenkins.buildacloud.org/job/build-master-noredist/ws/plugins/storage/volume/cloudbyte/pom.xml> to /jenkins/.m2/repository/org/apache/cloudstack/cloud-plugin-storage-volume-cloudbyte/4.6.0-SNAPSHOT/cloud-plugin-storage-volume-cloudbyte-4.6.0-SNAPSHOT.pom
log4j:WARN No appenders could be found for logger (org.springframework.test.context.junit4.SpringJUnit4ClassRunner).
log4j:WARN Please initialize the log4j system properly.
log4j:WARN See http://logging.apache.org/log4j/1.2/faq.html#noconfig for more info.
[INFO] 
[INFO] --- maven-resources-plugin:2.5:testResources (default-testResources) @ cloud-plugin-storage-image-s3 ---
[debug] execute contextualize
[INFO] Using 'UTF-8' encoding to copy filtered resources.
[INFO] skip non existing resourceDirectory <http://jenkins.buildacloud.org/job/build-master-noredist/ws/plugins/storage/image/s3/test/resources>
[INFO] Copying 3 resources
[INFO] 
[INFO] --- maven-compiler-plugin:3.2:testCompile (default-testCompile) @ cloud-plugin-storage-image-s3 ---
[INFO] No sources to compile
[INFO] 
[INFO] --- maven-surefire-plugin:2.18.1:test (default-test) @ cloud-plugin-storage-image-s3 ---
[INFO] 
[INFO] --- maven-jar-plugin:2.5:jar (default-jar) @ cloud-plugin-storage-image-s3 ---
[INFO] Building jar: <http://jenkins.buildacloud.org/job/build-master-noredist/ws/plugins/storage/image/s3/target/cloud-plugin-storage-image-s3-4.6.0-SNAPSHOT.jar>
[INFO] 
[INFO] --- maven-site-plugin:3.3:attach-descriptor (attach-descriptor) @ cloud-plugin-storage-image-s3 ---
[INFO] 
[INFO] --- maven-install-plugin:2.3.1:install (default-install) @ cloud-plugin-storage-image-s3 ---
[INFO] Installing <http://jenkins.buildacloud.org/job/build-master-noredist/ws/plugins/storage/image/s3/target/cloud-plugin-storage-image-s3-4.6.0-SNAPSHOT.jar> to /jenkins/.m2/repository/org/apache/cloudstack/cloud-plugin-storage-image-s3/4.6.0-SNAPSHOT/cloud-plugin-storage-image-s3-4.6.0-SNAPSHOT.jar
[INFO] Installing <http://jenkins.buildacloud.org/job/build-master-noredist/ws/plugins/storage/image/s3/pom.xml> to /jenkins/.m2/repository/org/apache/cloudstack/cloud-plugin-storage-image-s3/4.6.0-SNAPSHOT/cloud-plugin-storage-image-s3-4.6.0-SNAPSHOT.pom
[INFO] 
[INFO] --- maven-resources-plugin:2.5:testResources (default-testResources) @ cloud-plugin-storage-image-swift ---
[debug] execute contextualize
[INFO] Using 'UTF-8' encoding to copy filtered resources.
[INFO] skip non existing resourceDirectory <http://jenkins.buildacloud.org/job/build-master-noredist/ws/plugins/storage/image/swift/test/resources>
[INFO] Copying 3 resources
[INFO] 
[INFO] --- maven-compiler-plugin:3.2:testCompile (default-testCompile) @ cloud-plugin-storage-image-swift ---
[INFO] No sources to compile
[INFO] 
[INFO] --- maven-surefire-plugin:2.18.1:test (default-test) @ cloud-plugin-storage-image-swift ---
[INFO] Tests are skipped.
[INFO] 
[INFO] --- maven-jar-plugin:2.5:jar (default-jar) @ cloud-plugin-storage-image-swift ---
[INFO] Building jar: <http://jenkins.buildacloud.org/job/build-master-noredist/ws/plugins/storage/image/swift/target/cloud-plugin-storage-image-swift-4.6.0-SNAPSHOT.jar>
[INFO] 
[INFO] --- maven-site-plugin:3.3:attach-descriptor (attach-descriptor) @ cloud-plugin-storage-image-swift ---
[INFO] 
[INFO] --- maven-surefire-plugin:2.18.1:test (default) @ cloud-plugin-storage-image-swift ---
[INFO] Tests are skipped.
[INFO] 
[INFO] --- maven-install-plugin:2.3.1:install (default-install) @ cloud-plugin-storage-image-swift ---
[INFO] Installing <http://jenkins.buildacloud.org/job/build-master-noredist/ws/plugins/storage/image/swift/target/cloud-plugin-storage-image-swift-4.6.0-SNAPSHOT.jar> to /jenkins/.m2/repository/org/apache/cloudstack/cloud-plugin-storage-image-swift/4.6.0-SNAPSHOT/cloud-plugin-storage-image-swift-4.6.0-SNAPSHOT.jar
[INFO] Installing <http://jenkins.buildacloud.org/job/build-master-noredist/ws/plugins/storage/image/swift/pom.xml> to /jenkins/.m2/repository/org/apache/cloudstack/cloud-plugin-storage-image-swift/4.6.0-SNAPSHOT/cloud-plugin-storage-image-swift-4.6.0-SNAPSHOT.pom
Running com.cloud.hypervisor.vmware.resource.VmwareResourceTest
[INFO] 
[INFO] --- maven-surefire-plugin:2.18.1:test (default-test) @ cloud-plugin-storage-volume-solidfire ---
[INFO] Tests are skipped.
[INFO] 
[INFO] --- maven-jar-plugin:2.5:jar (default-jar) @ cloud-plugin-storage-volume-solidfire ---
[INFO] Building jar: <http://jenkins.buildacloud.org/job/build-master-noredist/ws/plugins/storage/volume/solidfire/target/cloud-plugin-storage-volume-solidfire-4.6.0-SNAPSHOT.jar>
[INFO] 
[INFO] --- maven-site-plugin:3.3:attach-descriptor (attach-descriptor) @ cloud-plugin-storage-volume-solidfire ---
[INFO] 
[INFO] --- maven-surefire-plugin:2.18.1:test (default) @ cloud-plugin-storage-volume-solidfire ---
[INFO] Tests are skipped.
[INFO] 
[INFO] --- maven-install-plugin:2.3.1:install (default-install) @ cloud-plugin-storage-volume-solidfire ---
[INFO] Installing <http://jenkins.buildacloud.org/job/build-master-noredist/ws/plugins/storage/volume/solidfire/target/cloud-plugin-storage-volume-solidfire-4.6.0-SNAPSHOT.jar> to /jenkins/.m2/repository/org/apache/cloudstack/cloud-plugin-storage-volume-solidfire/4.6.0-SNAPSHOT/cloud-plugin-storage-volume-solidfire-4.6.0-SNAPSHOT.jar
[INFO] Installing <http://jenkins.buildacloud.org/job/build-master-noredist/ws/plugins/storage/volume/solidfire/pom.xml> to /jenkins/.m2/repository/org/apache/cloudstack/cloud-plugin-storage-volume-solidfire/4.6.0-SNAPSHOT/cloud-plugin-storage-volume-solidfire-4.6.0-SNAPSHOT.pom
[INFO] 
[INFO] --- maven-resources-plugin:2.5:testResources (default-testResources) @ cloud-plugin-storage-image-default ---
[debug] execute contextualize
[INFO] Using 'UTF-8' encoding to copy filtered resources.
[INFO] skip non existing resourceDirectory <http://jenkins.buildacloud.org/job/build-master-noredist/ws/plugins/storage/image/default/test/resources>
[INFO] Copying 3 resources
[INFO] 
[INFO] --- maven-compiler-plugin:3.2:testCompile (default-testCompile) @ cloud-plugin-storage-image-default ---
[INFO] No sources to compile
[INFO] 
[INFO] --- maven-surefire-plugin:2.18.1:test (default-test) @ cloud-plugin-storage-image-default ---
[INFO] Tests are skipped.
[INFO] 
[INFO] --- maven-jar-plugin:2.5:jar (default-jar) @ cloud-plugin-storage-image-default ---
[INFO] Building jar: <http://jenkins.buildacloud.org/job/build-master-noredist/ws/plugins/storage/image/default/target/cloud-plugin-storage-image-default-4.6.0-SNAPSHOT.jar>
[INFO] 
[INFO] --- maven-site-plugin:3.3:attach-descriptor (attach-descriptor) @ cloud-plugin-storage-image-default ---
[INFO] 
[INFO] --- maven-surefire-plugin:2.18.1:test (default) @ cloud-plugin-storage-image-default ---
[INFO] Tests are skipped.
[INFO] 
[INFO] --- maven-install-plugin:2.3.1:install (default-install) @ cloud-plugin-storage-image-default ---
[INFO] Installing <http://jenkins.buildacloud.org/job/build-master-noredist/ws/plugins/storage/image/default/target/cloud-plugin-storage-image-default-4.6.0-SNAPSHOT.jar> to /jenkins/.m2/repository/org/apache/cloudstack/cloud-plugin-storage-image-default/4.6.0-SNAPSHOT/cloud-plugin-storage-image-default-4.6.0-SNAPSHOT.jar
[INFO] Installing <http://jenkins.buildacloud.org/job/build-master-noredist/ws/plugins/storage/image/default/pom.xml> to /jenkins/.m2/repository/org/apache/cloudstack/cloud-plugin-storage-image-default/4.6.0-SNAPSHOT/cloud-plugin-storage-image-default-4.6.0-SNAPSHOT.pom
Tests run: 1, Failures: 0, Errors: 0, Skipped: 0, Time elapsed: 0.804 sec - in com.cloud.hypervisor.vmware.resource.VmwareResourceTest
Running com.cloud.hypervisor.vmware.VmwareDatacenterApiUnitTest
Tests run: 3, Failures: 0, Errors: 0, Skipped: 0, Time elapsed: 1.885 sec - in com.cloud.hypervisor.vmware.VmwareDatacenterApiUnitTest
Running org.apache.cloudstack.storage.motion.VmwareStorageMotionStrategyTest
Tests run: 6, Failures: 0, Errors: 0, Skipped: 0, Time elapsed: 0.375 sec - in org.apache.cloudstack.storage.motion.VmwareStorageMotionStrategyTest

Results :

Tests run: 10, Failures: 0, Errors: 0, Skipped: 0

[INFO] 
[INFO] --- maven-jar-plugin:2.5:jar (default-jar) @ cloud-plugin-hypervisor-vmware ---
[INFO] Building jar: <http://jenkins.buildacloud.org/job/build-master-noredist/ws/plugins/hypervisors/vmware/target/cloud-plugin-hypervisor-vmware-4.6.0-SNAPSHOT.jar>
[INFO] ------------------------------------------------------------------------
[INFO] Reactor Summary:
[INFO] 
[INFO] Apache CloudStack Developer Tools - Checkstyle Configuration  SUCCESS [0.765s]
[INFO] Apache CloudStack ................................. SUCCESS [1.169s]
[INFO] Apache CloudStack Maven Conventions Parent ........ SUCCESS [1.151s]
[INFO] Apache CloudStack Framework - Managed Context ..... SUCCESS [4.902s]
[INFO] Apache CloudStack Utils ........................... SUCCESS [12.376s]
[INFO] Apache CloudStack Framework ....................... SUCCESS [0.420s]
[INFO] Apache CloudStack Framework - Event Notification .. SUCCESS [9.254s]
[INFO] Apache CloudStack Framework - Configuration ....... SUCCESS [3.711s]
[INFO] Apache CloudStack API ............................. SUCCESS [12.355s]
[INFO] Apache CloudStack Framework - REST ................ SUCCESS [5.748s]
[INFO] Apache CloudStack Framework - IPC ................. SUCCESS [5.259s]
[INFO] Apache CloudStack Cloud Engine .................... SUCCESS [0.420s]
[INFO] Apache CloudStack Cloud Engine API ................ SUCCESS [4.671s]
[INFO] Apache CloudStack Framework - Security ............ SUCCESS [2.504s]
[INFO] Apache CloudStack Core ............................ SUCCESS [21.528s]
[INFO] Apache CloudStack Agents .......................... SUCCESS [7.712s]
[INFO] Apache CloudStack Framework - Clustering .......... SUCCESS [3.502s]
[INFO] Apache CloudStack Framework - Event Notification .. SUCCESS [3.247s]
[INFO] Apache CloudStack Cloud Engine Schema Component ... SUCCESS [14.609s]
[INFO] Apache CloudStack Framework - Jobs ................ SUCCESS [6.689s]
[INFO] Apache CloudStack Cloud Engine Internal Components API  SUCCESS [2.786s]
[INFO] Apache CloudStack Server .......................... SUCCESS [37.694s]
[INFO] Apache CloudStack Usage Server .................... SUCCESS [10.069s]
[INFO] Apache CloudStack Cloud Engine Orchestration Component  SUCCESS [11.833s]
[INFO] Apache CloudStack Cloud Services .................. SUCCESS [0.422s]
[INFO] Apache CloudStack Secondary Storage ............... SUCCESS [3.704s]
[INFO] Apache CloudStack Secondary Storage Service ....... SUCCESS [12.710s]
[INFO] Apache CloudStack Engine Storage Component ........ SUCCESS [15.880s]
[INFO] Apache CloudStack Engine Storage Volume Component . SUCCESS [14.204s]
[INFO] Apache CloudStack Engine Storage Image Component .. SUCCESS [9.008s]
[INFO] Apache CloudStack Engine Storage Data Motion Component  SUCCESS [8.962s]
[INFO] Apache CloudStack Engine Storage Cache Component .. SUCCESS [8.120s]
[INFO] Apache CloudStack Engine Storage Snapshot Component  SUCCESS [29.233s]
[INFO] Apache CloudStack Cloud Engine API ................ SUCCESS [3.261s]
[INFO] Apache CloudStack Cloud Engine Service ............ SUCCESS [18.654s]
[INFO] Apache CloudStack Plugin POM ...................... SUCCESS [0.536s]
[INFO] Apache CloudStack Plugin - API Rate Limit ......... SUCCESS [19.744s]
[INFO] Apache CloudStack Plugin - Storage Volume default provider  SUCCESS [9.611s]
[INFO] Apache CloudStack Plugin - Storage Volume SolidFire Provider  SUCCESS [13.770s]
[INFO] Apache CloudStack Plugin - API SolidFire .......... SKIPPED
[INFO] Apache CloudStack Plugin - API Discovery .......... SUCCESS [15.658s]
[INFO] Apache CloudStack Plugin - ACL Static Role Based .. SUCCESS [5.534s]
[INFO] Apache CloudStack Plugin - Host Anti-Affinity Processor  SUCCESS [7.497s]
[INFO] Apache CloudStack Plugin - Explicit Dedication Processor  SUCCESS [7.922s]
[INFO] Apache CloudStack Plugin - User Concentrated Pod Deployment Planner  SUCCESS [7.641s]
[INFO] Apache CloudStack Plugin - User Dispersing Deployment Planner  SUCCESS [6.551s]
[INFO] Apache CloudStack Plugin - Implicit Dedication Planner  SUCCESS [21.302s]
[INFO] Apache CloudStack Plugin - Skip Heurestics Planner  SUCCESS [5.896s]
[INFO] Apache CloudStack Plugin - Host Allocator Random .. SUCCESS [5.716s]
[INFO] Apache CloudStack Plugin - Dedicated Resources .... SUCCESS [19.729s]
[INFO] Apache CloudStack Plugin - Hypervisor OracleVM .... SUCCESS [9.116s]
[INFO] Apache CloudStack Plugin - Open vSwitch ........... SUCCESS [10.163s]
[INFO] Apache CloudStack Plugin - Hypervisor XenServer ... SUCCESS [26.634s]
[INFO] Apache CloudStack Plugin - Hypervisor KVM ......... SUCCESS [23.461s]
[INFO] Apache CloudStack Plugin - RabbitMQ Event Bus ..... SUCCESS [5.890s]
[INFO] Apache CloudStack Plugin - In Memory Event Bus .... SUCCESS [11.765s]
[INFO] Apache CloudStack Plugin - Hypervisor Baremetal ... SUCCESS [13.526s]
[INFO] Apache CloudStack Plugin - Hypervisor UCS ......... SUCCESS [8.783s]
[INFO] Apache CloudStack Plugin - Hypervisor Hyper-V ..... SUCCESS [16.667s]
[INFO] Apache CloudStack Plugin - Network Elastic Load Balancer  SUCCESS [18.050s]
[INFO] Apache CloudStack Plugin - Network Internal Load Balancer  SUCCESS [28.312s]
[INFO] Apache CloudStack Framework - Spring Life Cycle ... SUCCESS [2.367s]
[INFO] Apache CloudStack Plugin - Network Juniper Contrail  FAILURE [6.516s]
[INFO] Apache CloudStack Plugin - Palo Alto .............. SUCCESS [23.290s]
[INFO] Apache CloudStack Plugin - Network Netscaler ...... SUCCESS [12.304s]
[INFO] Apache CloudStack Plugin - Network Nicira NVP ..... SUCCESS [33.586s]
[INFO] Apache CloudStack Plugin - BigSwitch Virtual Network Segment  SUCCESS [19.529s]
[INFO] Apache CloudStack Plugin - Network Brocade VCS .... SUCCESS [29.703s]
[INFO] Apache CloudStack Plugin - Midokura Midonet ....... SUCCESS [21.368s]
[INFO] Apache CloudStack Plugin - Stratosphere SSP ....... SUCCESS [19.692s]
[INFO] Apache CloudStack Plugin - Network Opendaylight ... SUCCESS [19.127s]
[INFO] Apache CloudStack Plugin - Storage Allocator Random  SUCCESS [6.360s]
[INFO] Apache CloudStack Plugin - User Authenticator LDAP  SUCCESS [10.438s]
[INFO] Apache CloudStack Plugin - User Authenticator MD5 . SUCCESS [13.775s]
[INFO] Apache CloudStack Plugin - User Authenticator Plain Text  SUCCESS [5.164s]
[INFO] Apache CloudStack Plugin - User Authenticator SAML2  SUCCESS [34.459s]
[INFO] Apache CloudStack Plugin - User Authenticator SHA256 Salted  SUCCESS [14.792s]
[INFO] Apache CloudStack Plugin - Dns Notifier Example ... SUCCESS [6.722s]
[INFO] Apache CloudStack Plugin - Storage Image S3 ....... SUCCESS [6.963s]
[INFO] Apache CloudStack Plugin - Storage Image Swift provider  SUCCESS [6.979s]
[INFO] Apache CloudStack Plugin - Storage Image default provider  SUCCESS [5.864s]
[INFO] Apache CloudStack Plugin - Storage Image sample provider  SKIPPED
[INFO] Apache CloudStack Plugin - Storage Volume Nexenta Provider  SUCCESS [13.425s]
[INFO] Apache CloudStack Plugin - Storage Volume CloudByte Provider  SUCCESS [9.366s]
[INFO] Apache CloudStack Plugin - Storage Volume sample provider  SUCCESS [7.124s]
[INFO] Apache CloudStack Plugin - SNMP Alerts ............ SUCCESS [13.948s]
[INFO] Apache CloudStack Plugin - Syslog Alerts .......... SUCCESS [13.198s]
[INFO] Apache CloudStack Plugin - Network VXLAN .......... SUCCESS [15.027s]
[INFO] Apache CloudStack Plugin - GloboDNS ............... SUCCESS [23.386s]
[INFO] Apache CloudStack Plugin - NetApp File System ..... SUCCESS [8.769s]
[INFO] Apache CloudStack Plugin - F5 ..................... SUCCESS [8.972s]
[INFO] Apache CloudStack Plugin - Juniper SRX ............ SUCCESS [9.694s]
[INFO] Apache CloudStack Plugin - Nuage VSP .............. SUCCESS [17.385s]
[INFO] Apache CloudStack VMware Base ..................... SUCCESS [7.139s]
[INFO] Apache CloudStack Plugin - Hypervisor VMware ...... SKIPPED
[INFO] Apache CloudStack Plugin - Cisco VNMC ............. SKIPPED
[INFO] Apache CloudStack Plugin - MySQL HA Strategy ...... SUCCESS [5.553s]
[INFO] Apache CloudStack Framework - Spring Module ....... SUCCESS [8.692s]
[INFO] Apache CloudStack Secondary Storage Controller .... SUCCESS [6.856s]
[INFO] Apache CloudStack Console Proxy - RDP Client ...... SUCCESS [12.232s]
[INFO] Apache CloudStack Console Proxy ................... SUCCESS [3.530s]
[INFO] Apache CloudStack Console Proxy - Server .......... SUCCESS [7.431s]
[INFO] Apache CloudStack System VM ....................... SKIPPED
[INFO] Apache CloudStack Client UI ....................... SKIPPED
[INFO] Apache CloudStack Framework - QuickCloud .......... SUCCESS [1.252s]
[INFO] Apache CloudStack AWS API Bridge .................. SKIPPED
[INFO] ------------------------------------------------------------------------
[INFO] BUILD FAILURE
[INFO] ------------------------------------------------------------------------
[INFO] Total time: 4:07.385s (Wall Clock)
[INFO] Finished at: Wed Jan 07 10:38:00 CET 2015
[INFO] Final Memory: 76M/476M
[INFO] ------------------------------------------------------------------------
[ERROR] Failed to execute goal org.apache.maven.plugins:maven-compiler-plugin:3.2:compile (default-compile) on project cloud-plugin-network-contrail: Compilation failure
[ERROR] error: error reading /jenkins/.m2/repository/org/apache/commons/commons-exec/1.3/commons-exec-1.3.jar; error in opening zip file
[ERROR] -> [Help 1]
[ERROR] 
[ERROR] To see the full stack trace of the errors, re-run Maven with the -e switch.
[ERROR] Re-run Maven using the -X switch to enable full debug logging.
[ERROR] 
[ERROR] For more information about the errors and possible solutions, please read the following articles:
[ERROR] [Help 1] http://cwiki.apache.org/confluence/display/MAVEN/MojoFailureException
[ERROR] 
[ERROR] After correcting the problems, you can resume the build with the command
[ERROR]   mvn <goals> -rf :cloud-plugin-network-contrail
[INFO] 
[INFO] --- maven-site-plugin:3.3:attach-descriptor (attach-descriptor) @ cloud-plugin-hypervisor-vmware ---
Destroying 1 processes
Destroying process..
Destroyed 1 processes
Build step 'Invoke top-level Maven targets' marked build as failure
Archiving artifacts

Build failed in Jenkins: build-master-noredist #4015

Posted by je...@cloudstack.org.
See <http://jenkins.buildacloud.org/job/build-master-noredist/4015/changes>

Changes:

[kishan] Network offering usage event should be logged for UserVms only

[kishan] For volumes created from template, do not log offering ID in VOLUME.CREATE in usage_event. Moved offering type to DiskOffering interface

------------------------------------------
[...truncated 7613 lines...]
log4j:WARN See http://logging.apache.org/log4j/1.2/faq.html#noconfig for more info.
Running com.cloud.hypervisor.vmware.resource.VmwareResourceTest
[INFO] 
[INFO] --- license-maven-plugin:2.7:check (cloudstack-checklicence) @ cloud-plugin-storage-volume-cloudbyte ---
[INFO] Checking licenses...
[INFO] 
[INFO] --- maven-resources-plugin:2.5:testResources (default-testResources) @ cloud-plugin-storage-volume-cloudbyte ---
[debug] execute contextualize
[INFO] Using 'UTF-8' encoding to copy filtered resources.
[INFO] skip non existing resourceDirectory <http://jenkins.buildacloud.org/job/build-master-noredist/ws/plugins/storage/volume/cloudbyte/test/resources>
[INFO] Copying 3 resources
[INFO] 
[INFO] --- maven-compiler-plugin:3.2:testCompile (default-testCompile) @ cloud-plugin-storage-volume-cloudbyte ---
[INFO] No sources to compile
[INFO] 
[INFO] --- maven-surefire-plugin:2.18.1:test (default-test) @ cloud-plugin-storage-volume-cloudbyte ---
[INFO] Tests are skipped.
[INFO] 
[INFO] --- maven-jar-plugin:2.5:jar (default-jar) @ cloud-plugin-storage-volume-cloudbyte ---
[INFO] Building jar: <http://jenkins.buildacloud.org/job/build-master-noredist/ws/plugins/storage/volume/cloudbyte/target/cloud-plugin-storage-volume-cloudbyte-4.6.0-SNAPSHOT.jar>
[INFO] 
[INFO] --- maven-site-plugin:3.3:attach-descriptor (attach-descriptor) @ cloud-plugin-storage-volume-cloudbyte ---
[INFO] 
[INFO] --- maven-surefire-plugin:2.18.1:test (default) @ cloud-plugin-storage-volume-cloudbyte ---
[INFO] Tests are skipped.
[INFO] 
[INFO] --- maven-install-plugin:2.3.1:install (default-install) @ cloud-plugin-storage-volume-cloudbyte ---
[INFO] Installing <http://jenkins.buildacloud.org/job/build-master-noredist/ws/plugins/storage/volume/cloudbyte/target/cloud-plugin-storage-volume-cloudbyte-4.6.0-SNAPSHOT.jar> to /jenkins/.m2/repository/org/apache/cloudstack/cloud-plugin-storage-volume-cloudbyte/4.6.0-SNAPSHOT/cloud-plugin-storage-volume-cloudbyte-4.6.0-SNAPSHOT.jar
[INFO] Installing <http://jenkins.buildacloud.org/job/build-master-noredist/ws/plugins/storage/volume/cloudbyte/pom.xml> to /jenkins/.m2/repository/org/apache/cloudstack/cloud-plugin-storage-volume-cloudbyte/4.6.0-SNAPSHOT/cloud-plugin-storage-volume-cloudbyte-4.6.0-SNAPSHOT.pom
[INFO] 
[INFO] --- maven-resources-plugin:2.5:testResources (default-testResources) @ cloud-plugin-storage-image-s3 ---
[debug] execute contextualize
[INFO] Using 'UTF-8' encoding to copy filtered resources.
[INFO] skip non existing resourceDirectory <http://jenkins.buildacloud.org/job/build-master-noredist/ws/plugins/storage/image/s3/test/resources>
[INFO] Copying 3 resources
[INFO] 
[INFO] --- maven-compiler-plugin:3.2:testCompile (default-testCompile) @ cloud-plugin-storage-image-s3 ---
[INFO] No sources to compile
[INFO] 
[INFO] --- maven-surefire-plugin:2.18.1:test (default-test) @ cloud-plugin-storage-image-s3 ---
[INFO] 
[INFO] --- maven-jar-plugin:2.5:jar (default-jar) @ cloud-plugin-storage-image-s3 ---
[INFO] Building jar: <http://jenkins.buildacloud.org/job/build-master-noredist/ws/plugins/storage/image/s3/target/cloud-plugin-storage-image-s3-4.6.0-SNAPSHOT.jar>
[INFO] 
[INFO] --- maven-site-plugin:3.3:attach-descriptor (attach-descriptor) @ cloud-plugin-storage-image-s3 ---
[INFO] 
[INFO] --- maven-install-plugin:2.3.1:install (default-install) @ cloud-plugin-storage-image-s3 ---
[INFO] Installing <http://jenkins.buildacloud.org/job/build-master-noredist/ws/plugins/storage/image/s3/target/cloud-plugin-storage-image-s3-4.6.0-SNAPSHOT.jar> to /jenkins/.m2/repository/org/apache/cloudstack/cloud-plugin-storage-image-s3/4.6.0-SNAPSHOT/cloud-plugin-storage-image-s3-4.6.0-SNAPSHOT.jar
[INFO] Installing <http://jenkins.buildacloud.org/job/build-master-noredist/ws/plugins/storage/image/s3/pom.xml> to /jenkins/.m2/repository/org/apache/cloudstack/cloud-plugin-storage-image-s3/4.6.0-SNAPSHOT/cloud-plugin-storage-image-s3-4.6.0-SNAPSHOT.pom
Tests run: 1, Failures: 0, Errors: 0, Skipped: 0, Time elapsed: 2.123 sec - in com.cloud.hypervisor.vmware.resource.VmwareResourceTest
Running com.cloud.hypervisor.vmware.VmwareDatacenterApiUnitTest
[INFO] 
[INFO] --- maven-resources-plugin:2.5:testResources (default-testResources) @ cloud-plugin-storage-image-swift ---
[debug] execute contextualize
[INFO] Using 'UTF-8' encoding to copy filtered resources.
[INFO] skip non existing resourceDirectory <http://jenkins.buildacloud.org/job/build-master-noredist/ws/plugins/storage/image/swift/test/resources>
[INFO] Copying 3 resources
[INFO] 
[INFO] --- maven-compiler-plugin:3.2:testCompile (default-testCompile) @ cloud-plugin-storage-image-swift ---
[INFO] No sources to compile
[INFO] 
[INFO] --- maven-surefire-plugin:2.18.1:test (default-test) @ cloud-plugin-storage-image-swift ---
[INFO] Tests are skipped.
[INFO] 
[INFO] --- maven-jar-plugin:2.5:jar (default-jar) @ cloud-plugin-storage-image-swift ---
[INFO] Building jar: <http://jenkins.buildacloud.org/job/build-master-noredist/ws/plugins/storage/image/swift/target/cloud-plugin-storage-image-swift-4.6.0-SNAPSHOT.jar>
[INFO] 
[INFO] --- maven-site-plugin:3.3:attach-descriptor (attach-descriptor) @ cloud-plugin-storage-image-swift ---
[INFO] 
[INFO] --- maven-surefire-plugin:2.18.1:test (default) @ cloud-plugin-storage-image-swift ---
[INFO] Tests are skipped.
[INFO] 
[INFO] --- maven-install-plugin:2.3.1:install (default-install) @ cloud-plugin-storage-image-swift ---
[INFO] Installing <http://jenkins.buildacloud.org/job/build-master-noredist/ws/plugins/storage/image/swift/target/cloud-plugin-storage-image-swift-4.6.0-SNAPSHOT.jar> to /jenkins/.m2/repository/org/apache/cloudstack/cloud-plugin-storage-image-swift/4.6.0-SNAPSHOT/cloud-plugin-storage-image-swift-4.6.0-SNAPSHOT.jar
[INFO] Installing <http://jenkins.buildacloud.org/job/build-master-noredist/ws/plugins/storage/image/swift/pom.xml> to /jenkins/.m2/repository/org/apache/cloudstack/cloud-plugin-storage-image-swift/4.6.0-SNAPSHOT/cloud-plugin-storage-image-swift-4.6.0-SNAPSHOT.pom
[INFO] 
[INFO] --- maven-surefire-plugin:2.18.1:test (default-test) @ cloud-plugin-storage-volume-solidfire ---
[INFO] Tests are skipped.
[INFO] 
[INFO] --- maven-jar-plugin:2.5:jar (default-jar) @ cloud-plugin-storage-volume-solidfire ---
[INFO] Building jar: <http://jenkins.buildacloud.org/job/build-master-noredist/ws/plugins/storage/volume/solidfire/target/cloud-plugin-storage-volume-solidfire-4.6.0-SNAPSHOT.jar>
[INFO] 
[INFO] --- maven-site-plugin:3.3:attach-descriptor (attach-descriptor) @ cloud-plugin-storage-volume-solidfire ---
[INFO] 
[INFO] --- maven-surefire-plugin:2.18.1:test (default) @ cloud-plugin-storage-volume-solidfire ---
[INFO] Tests are skipped.
[INFO] 
[INFO] --- maven-install-plugin:2.3.1:install (default-install) @ cloud-plugin-storage-volume-solidfire ---
[INFO] Installing <http://jenkins.buildacloud.org/job/build-master-noredist/ws/plugins/storage/volume/solidfire/target/cloud-plugin-storage-volume-solidfire-4.6.0-SNAPSHOT.jar> to /jenkins/.m2/repository/org/apache/cloudstack/cloud-plugin-storage-volume-solidfire/4.6.0-SNAPSHOT/cloud-plugin-storage-volume-solidfire-4.6.0-SNAPSHOT.jar
[INFO] Installing <http://jenkins.buildacloud.org/job/build-master-noredist/ws/plugins/storage/volume/solidfire/pom.xml> to /jenkins/.m2/repository/org/apache/cloudstack/cloud-plugin-storage-volume-solidfire/4.6.0-SNAPSHOT/cloud-plugin-storage-volume-solidfire-4.6.0-SNAPSHOT.pom
[INFO] 
[INFO] --- maven-resources-plugin:2.5:testResources (default-testResources) @ cloud-plugin-storage-image-default ---
[debug] execute contextualize
[INFO] Using 'UTF-8' encoding to copy filtered resources.
[INFO] skip non existing resourceDirectory <http://jenkins.buildacloud.org/job/build-master-noredist/ws/plugins/storage/image/default/test/resources>
[INFO] Copying 3 resources
[INFO] 
[INFO] --- maven-compiler-plugin:3.2:testCompile (default-testCompile) @ cloud-plugin-storage-image-default ---
[INFO] No sources to compile
[INFO] 
[INFO] --- maven-surefire-plugin:2.18.1:test (default-test) @ cloud-plugin-storage-image-default ---
[INFO] Tests are skipped.
[INFO] 
[INFO] --- maven-jar-plugin:2.5:jar (default-jar) @ cloud-plugin-storage-image-default ---
[INFO] Building jar: <http://jenkins.buildacloud.org/job/build-master-noredist/ws/plugins/storage/image/default/target/cloud-plugin-storage-image-default-4.6.0-SNAPSHOT.jar>
[INFO] 
[INFO] --- maven-site-plugin:3.3:attach-descriptor (attach-descriptor) @ cloud-plugin-storage-image-default ---
[INFO] 
[INFO] --- maven-surefire-plugin:2.18.1:test (default) @ cloud-plugin-storage-image-default ---
[INFO] Tests are skipped.
[INFO] 
[INFO] --- maven-install-plugin:2.3.1:install (default-install) @ cloud-plugin-storage-image-default ---
[INFO] Installing <http://jenkins.buildacloud.org/job/build-master-noredist/ws/plugins/storage/image/default/target/cloud-plugin-storage-image-default-4.6.0-SNAPSHOT.jar> to /jenkins/.m2/repository/org/apache/cloudstack/cloud-plugin-storage-image-default/4.6.0-SNAPSHOT/cloud-plugin-storage-image-default-4.6.0-SNAPSHOT.jar
[INFO] Installing <http://jenkins.buildacloud.org/job/build-master-noredist/ws/plugins/storage/image/default/pom.xml> to /jenkins/.m2/repository/org/apache/cloudstack/cloud-plugin-storage-image-default/4.6.0-SNAPSHOT/cloud-plugin-storage-image-default-4.6.0-SNAPSHOT.pom
[INFO] ------------------------------------------------------------------------
[INFO] Reactor Summary:
[INFO] 
[INFO] Apache CloudStack Developer Tools - Checkstyle Configuration  SUCCESS [0.804s]
[INFO] Apache CloudStack ................................. SUCCESS [1.235s]
[INFO] Apache CloudStack Maven Conventions Parent ........ SUCCESS [1.186s]
[INFO] Apache CloudStack Framework - Managed Context ..... SUCCESS [4.849s]
[INFO] Apache CloudStack Utils ........................... SUCCESS [11.997s]
[INFO] Apache CloudStack Framework ....................... SUCCESS [0.142s]
[INFO] Apache CloudStack Framework - Event Notification .. SUCCESS [9.565s]
[INFO] Apache CloudStack Framework - Configuration ....... SUCCESS [3.670s]
[INFO] Apache CloudStack API ............................. SUCCESS [12.089s]
[INFO] Apache CloudStack Framework - REST ................ SUCCESS [5.866s]
[INFO] Apache CloudStack Framework - IPC ................. SUCCESS [5.343s]
[INFO] Apache CloudStack Cloud Engine .................... SUCCESS [0.136s]
[INFO] Apache CloudStack Cloud Engine API ................ SUCCESS [4.871s]
[INFO] Apache CloudStack Framework - Security ............ SUCCESS [2.570s]
[INFO] Apache CloudStack Core ............................ SUCCESS [21.514s]
[INFO] Apache CloudStack Agents .......................... SUCCESS [7.638s]
[INFO] Apache CloudStack Framework - Clustering .......... SUCCESS [3.613s]
[INFO] Apache CloudStack Framework - Event Notification .. SUCCESS [3.117s]
[INFO] Apache CloudStack Cloud Engine Schema Component ... SUCCESS [13.951s]
[INFO] Apache CloudStack Framework - Jobs ................ SUCCESS [6.601s]
[INFO] Apache CloudStack Cloud Engine Internal Components API  SUCCESS [2.855s]
[INFO] Apache CloudStack Server .......................... SUCCESS [36.200s]
[INFO] Apache CloudStack Usage Server .................... SUCCESS [10.126s]
[INFO] Apache CloudStack Cloud Engine Orchestration Component  SUCCESS [11.734s]
[INFO] Apache CloudStack Cloud Services .................. SUCCESS [0.372s]
[INFO] Apache CloudStack Secondary Storage ............... SUCCESS [3.487s]
[INFO] Apache CloudStack Secondary Storage Service ....... SUCCESS [13.508s]
[INFO] Apache CloudStack Engine Storage Component ........ SUCCESS [16.265s]
[INFO] Apache CloudStack Engine Storage Volume Component . SUCCESS [14.742s]
[INFO] Apache CloudStack Engine Storage Image Component .. SUCCESS [8.779s]
[INFO] Apache CloudStack Engine Storage Data Motion Component  SUCCESS [9.104s]
[INFO] Apache CloudStack Engine Storage Cache Component .. SUCCESS [5.802s]
[INFO] Apache CloudStack Engine Storage Snapshot Component  SUCCESS [27.787s]
[INFO] Apache CloudStack Cloud Engine API ................ SUCCESS [3.187s]
[INFO] Apache CloudStack Cloud Engine Service ............ SUCCESS [18.640s]
[INFO] Apache CloudStack Plugin POM ...................... SUCCESS [0.469s]
[INFO] Apache CloudStack Plugin - API Rate Limit ......... SUCCESS [20.096s]
[INFO] Apache CloudStack Plugin - Storage Volume default provider  SUCCESS [9.286s]
[INFO] Apache CloudStack Plugin - Storage Volume SolidFire Provider  SUCCESS [14.286s]
[INFO] Apache CloudStack Plugin - API SolidFire .......... SKIPPED
[INFO] Apache CloudStack Plugin - API Discovery .......... SUCCESS [14.278s]
[INFO] Apache CloudStack Plugin - ACL Static Role Based .. SUCCESS [6.615s]
[INFO] Apache CloudStack Plugin - Host Anti-Affinity Processor  SUCCESS [7.590s]
[INFO] Apache CloudStack Plugin - Explicit Dedication Processor  SUCCESS [7.307s]
[INFO] Apache CloudStack Plugin - User Concentrated Pod Deployment Planner  SUCCESS [7.298s]
[INFO] Apache CloudStack Plugin - User Dispersing Deployment Planner  SUCCESS [5.919s]
[INFO] Apache CloudStack Plugin - Implicit Dedication Planner  SUCCESS [22.024s]
[INFO] Apache CloudStack Plugin - Skip Heurestics Planner  SUCCESS [6.098s]
[INFO] Apache CloudStack Plugin - Host Allocator Random .. SUCCESS [6.413s]
[INFO] Apache CloudStack Plugin - Dedicated Resources .... SUCCESS [19.868s]
[INFO] Apache CloudStack Plugin - Hypervisor OracleVM .... SUCCESS [7.273s]
[INFO] Apache CloudStack Plugin - Open vSwitch ........... SUCCESS [9.819s]
[INFO] Apache CloudStack Plugin - Hypervisor XenServer ... SUCCESS [26.954s]
[INFO] Apache CloudStack Plugin - Hypervisor KVM ......... SUCCESS [23.839s]
[INFO] Apache CloudStack Plugin - RabbitMQ Event Bus ..... SUCCESS [6.552s]
[INFO] Apache CloudStack Plugin - In Memory Event Bus .... SUCCESS [12.600s]
[INFO] Apache CloudStack Plugin - Hypervisor Baremetal ... SUCCESS [11.739s]
[INFO] Apache CloudStack Plugin - Hypervisor UCS ......... SUCCESS [8.676s]
[INFO] Apache CloudStack Plugin - Hypervisor Hyper-V ..... SUCCESS [17.330s]
[INFO] Apache CloudStack Plugin - Network Elastic Load Balancer  SUCCESS [18.220s]
[INFO] Apache CloudStack Plugin - Network Internal Load Balancer  SUCCESS [28.138s]
[INFO] Apache CloudStack Framework - Spring Life Cycle ... SUCCESS [2.424s]
[INFO] Apache CloudStack Plugin - Network Juniper Contrail  FAILURE [6.999s]
[INFO] Apache CloudStack Plugin - Palo Alto .............. SUCCESS [23.482s]
[INFO] Apache CloudStack Plugin - Network Netscaler ...... SUCCESS [13.128s]
[INFO] Apache CloudStack Plugin - Network Nicira NVP ..... SUCCESS [31.716s]
[INFO] Apache CloudStack Plugin - BigSwitch Virtual Network Segment  SUCCESS [20.288s]
[INFO] Apache CloudStack Plugin - Network Brocade VCS .... SUCCESS [28.434s]
[INFO] Apache CloudStack Plugin - Midokura Midonet ....... SUCCESS [21.799s]
[INFO] Apache CloudStack Plugin - Stratosphere SSP ....... SUCCESS [20.197s]
[INFO] Apache CloudStack Plugin - Network Opendaylight ... SUCCESS [19.377s]
[INFO] Apache CloudStack Plugin - Storage Allocator Random  SUCCESS [6.855s]
[INFO] Apache CloudStack Plugin - User Authenticator LDAP  SUCCESS [10.185s]
[INFO] Apache CloudStack Plugin - User Authenticator MD5 . SUCCESS [13.874s]
[INFO] Apache CloudStack Plugin - User Authenticator Plain Text  SUCCESS [6.055s]
[INFO] Apache CloudStack Plugin - User Authenticator SAML2  SUCCESS [33.760s]
[INFO] Apache CloudStack Plugin - User Authenticator SHA256 Salted  SUCCESS [14.423s]
[INFO] Apache CloudStack Plugin - Dns Notifier Example ... SUCCESS [6.130s]
[INFO] Apache CloudStack Plugin - Storage Image S3 ....... SUCCESS [6.776s]
[INFO] Apache CloudStack Plugin - Storage Image Swift provider  SUCCESS [7.059s]
[INFO] Apache CloudStack Plugin - Storage Image default provider  SUCCESS [6.564s]
[INFO] Apache CloudStack Plugin - Storage Image sample provider  SKIPPED
[INFO] Apache CloudStack Plugin - Storage Volume Nexenta Provider  SUCCESS [13.385s]
[INFO] Apache CloudStack Plugin - Storage Volume CloudByte Provider  SUCCESS [9.701s]
[INFO] Apache CloudStack Plugin - Storage Volume sample provider  SUCCESS [7.007s]
[INFO] Apache CloudStack Plugin - SNMP Alerts ............ SUCCESS [13.330s]
[INFO] Apache CloudStack Plugin - Syslog Alerts .......... SUCCESS [11.711s]
[INFO] Apache CloudStack Plugin - Network VXLAN .......... SUCCESS [14.902s]
[INFO] Apache CloudStack Plugin - GloboDNS ............... SUCCESS [24.385s]
[INFO] Apache CloudStack Plugin - NetApp File System ..... SUCCESS [7.957s]
[INFO] Apache CloudStack Plugin - F5 ..................... SUCCESS [8.357s]
[INFO] Apache CloudStack Plugin - Juniper SRX ............ SUCCESS [10.434s]
[INFO] Apache CloudStack Plugin - Nuage VSP .............. SUCCESS [17.016s]
[INFO] Apache CloudStack VMware Base ..................... SUCCESS [7.616s]
[INFO] Apache CloudStack Plugin - Hypervisor VMware ...... SKIPPED
[INFO] Apache CloudStack Plugin - Cisco VNMC ............. SKIPPED
[INFO] Apache CloudStack Plugin - MySQL HA Strategy ...... SUCCESS [6.080s]
[INFO] Apache CloudStack Framework - Spring Module ....... SUCCESS [8.860s]
[INFO] Apache CloudStack Secondary Storage Controller .... SUCCESS [6.494s]
[INFO] Apache CloudStack Console Proxy - RDP Client ...... SUCCESS [12.278s]
[INFO] Apache CloudStack Console Proxy ................... SUCCESS [3.494s]
[INFO] Apache CloudStack Console Proxy - Server .......... SUCCESS [7.913s]
[INFO] Apache CloudStack System VM ....................... SKIPPED
[INFO] Apache CloudStack Client UI ....................... SKIPPED
[INFO] Apache CloudStack Framework - QuickCloud .......... SUCCESS [1.525s]
[INFO] Apache CloudStack AWS API Bridge .................. SKIPPED
[INFO] ------------------------------------------------------------------------
[INFO] BUILD FAILURE
[INFO] ------------------------------------------------------------------------
[INFO] Total time: 4:05.534s (Wall Clock)
[INFO] Finished at: Wed Jan 07 08:27:47 CET 2015
[INFO] Final Memory: 105M/437M
[INFO] ------------------------------------------------------------------------
Tests run: 3, Failures: 0, Errors: 0, Skipped: 0, Time elapsed: 2.499 sec - in com.cloud.hypervisor.vmware.VmwareDatacenterApiUnitTest
Running org.apache.cloudstack.storage.motion.VmwareStorageMotionStrategyTest
[ERROR] Failed to execute goal org.apache.maven.plugins:maven-compiler-plugin:3.2:compile (default-compile) on project cloud-plugin-network-contrail: Compilation failure
[ERROR] error: error reading /jenkins/.m2/repository/org/apache/commons/commons-exec/1.3/commons-exec-1.3.jar; error in opening zip file
[ERROR] -> [Help 1]
[ERROR] 
[ERROR] To see the full stack trace of the errors, re-run Maven with the -e switch.
[ERROR] Re-run Maven using the -X switch to enable full debug logging.
[ERROR] 
[ERROR] For more information about the errors and possible solutions, please read the following articles:
[ERROR] [Help 1] http://cwiki.apache.org/confluence/display/MAVEN/MojoFailureException
[ERROR] 
[ERROR] After correcting the problems, you can resume the build with the command
[ERROR]   mvn <goals> -rf :cloud-plugin-network-contrail
Destroying 1 processes
Destroying process..
Destroyed 1 processes
Build step 'Invoke top-level Maven targets' marked build as failure
Archiving artifacts

Build failed in Jenkins: build-master-noredist #4014

Posted by je...@cloudstack.org.
See <http://jenkins.buildacloud.org/job/build-master-noredist/4014/changes>

Changes:

[kishan] Skip older records which generate negative duration usage

------------------------------------------
[...truncated 7710 lines...]
[INFO] Copying 3 resources
[INFO] 
[INFO] --- maven-compiler-plugin:3.2:testCompile (default-testCompile) @ cloud-plugin-storage-image-sample ---
[INFO] No sources to compile
[INFO] 
[INFO] --- maven-surefire-plugin:2.18.1:test (default-test) @ cloud-plugin-storage-image-sample ---
[INFO] Tests are skipped.
[INFO] 
[INFO] --- maven-jar-plugin:2.5:jar (default-jar) @ cloud-plugin-storage-image-sample ---
[INFO] Building jar: <http://jenkins.buildacloud.org/job/build-master-noredist/ws/plugins/storage/image/sample/target/cloud-plugin-storage-image-sample-4.6.0-SNAPSHOT.jar>
[INFO] 
[INFO] --- maven-site-plugin:3.3:attach-descriptor (attach-descriptor) @ cloud-plugin-storage-image-sample ---
[INFO] 
[INFO] --- maven-surefire-plugin:2.18.1:test (default) @ cloud-plugin-storage-image-sample ---
[INFO] Tests are skipped.
[INFO] 
[INFO] --- maven-install-plugin:2.3.1:install (default-install) @ cloud-plugin-storage-image-sample ---
[INFO] Installing <http://jenkins.buildacloud.org/job/build-master-noredist/ws/plugins/storage/image/sample/target/cloud-plugin-storage-image-sample-4.6.0-SNAPSHOT.jar> to /jenkins/.m2/repository/org/apache/cloudstack/cloud-plugin-storage-image-sample/4.6.0-SNAPSHOT/cloud-plugin-storage-image-sample-4.6.0-SNAPSHOT.jar
[INFO] Installing <http://jenkins.buildacloud.org/job/build-master-noredist/ws/plugins/storage/image/sample/pom.xml> to /jenkins/.m2/repository/org/apache/cloudstack/cloud-plugin-storage-image-sample/4.6.0-SNAPSHOT/cloud-plugin-storage-image-sample-4.6.0-SNAPSHOT.pom
[WARNING] Invalid POM for org.apache.commons:commons-exec:jar:1.1, transitive dependencies (if any) will not be available, enable debug logging for more details
[WARNING] Invalid POM for org.apache.commons:commons-exec:jar:1.3, transitive dependencies (if any) will not be available, enable debug logging for more details
[WARNING] Cannot read metadata from '/jenkins/.m2/repository/joda-time/joda-time/maven-metadata-juniper-contrail.xml': end tag name </head> must be the same as start tag <meta> from line 4 (position: TEXT seen ...</style>\n  </head>... @49:10) 
[WARNING] Invalid project model for artifact [commons-exec:org.apache.commons:1.3]. It will be ignored by the remote resources Mojo.
[INFO] 
[INFO] --- maven-surefire-plugin:2.18.1:test (default-test) @ cloud-plugin-storage-volume-solidfire ---
[INFO] Tests are skipped.
[INFO] 
[INFO] --- maven-jar-plugin:2.5:jar (default-jar) @ cloud-plugin-storage-volume-solidfire ---
[INFO] Building jar: <http://jenkins.buildacloud.org/job/build-master-noredist/ws/plugins/storage/volume/solidfire/target/cloud-plugin-storage-volume-solidfire-4.6.0-SNAPSHOT.jar>
[INFO] 
[INFO] --- maven-site-plugin:3.3:attach-descriptor (attach-descriptor) @ cloud-plugin-storage-volume-solidfire ---
[INFO] 
[INFO] --- maven-surefire-plugin:2.18.1:test (default) @ cloud-plugin-storage-volume-solidfire ---
[INFO] Tests are skipped.
[INFO] 
[INFO] --- maven-install-plugin:2.3.1:install (default-install) @ cloud-plugin-storage-volume-solidfire ---
[INFO] Installing <http://jenkins.buildacloud.org/job/build-master-noredist/ws/plugins/storage/volume/solidfire/target/cloud-plugin-storage-volume-solidfire-4.6.0-SNAPSHOT.jar> to /jenkins/.m2/repository/org/apache/cloudstack/cloud-plugin-storage-volume-solidfire/4.6.0-SNAPSHOT/cloud-plugin-storage-volume-solidfire-4.6.0-SNAPSHOT.jar
[INFO] Installing <http://jenkins.buildacloud.org/job/build-master-noredist/ws/plugins/storage/volume/solidfire/pom.xml> to /jenkins/.m2/repository/org/apache/cloudstack/cloud-plugin-storage-volume-solidfire/4.6.0-SNAPSHOT/cloud-plugin-storage-volume-solidfire-4.6.0-SNAPSHOT.pom
[INFO]                                                                         
[INFO] ------------------------------------------------------------------------
[INFO] Building Apache CloudStack Plugin - API SolidFire 4.6.0-SNAPSHOT
[INFO] ------------------------------------------------------------------------
[INFO] 
[INFO] --- maven-clean-plugin:2.5:clean (default-clean) @ cloud-plugin-api-solidfire-intg-test ---
[INFO] Deleting <http://jenkins.buildacloud.org/job/build-master-noredist/ws/plugins/api/solidfire-intg-test/target> (includes = [**/*], excludes = [])
[INFO] Deleting <http://jenkins.buildacloud.org/job/build-master-noredist/ws/plugins/api/solidfire-intg-test> (includes = [target, dist], excludes = [])
[INFO] 
[INFO] --- maven-checkstyle-plugin:2.11:check (cloudstack-checkstyle) @ cloud-plugin-api-solidfire-intg-test ---
[INFO] Starting audit...
Audit done.

[INFO] 
[INFO] --- maven-remote-resources-plugin:1.3:process (default) @ cloud-plugin-api-solidfire-intg-test ---
[INFO] 
[INFO] --- maven-resources-plugin:2.5:resources (default-resources) @ cloud-plugin-network-contrail ---
[debug] execute contextualize
[INFO] Using 'UTF-8' encoding to copy filtered resources.
[INFO] Copying 3 resources
[INFO] Copying 3 resources
[INFO] 
[INFO] --- maven-compiler-plugin:3.2:compile (default-compile) @ cloud-plugin-network-contrail ---
[INFO] Changes detected - recompiling the module!
[INFO] Compiling 30 source files to <http://jenkins.buildacloud.org/job/build-master-noredist/ws/plugins/network-elements/juniper-contrail/target/classes>
[INFO] 
[INFO] --- maven-resources-plugin:2.5:resources (default-resources) @ cloud-plugin-api-solidfire-intg-test ---
[debug] execute contextualize
[INFO] Using 'UTF-8' encoding to copy filtered resources.
[INFO] Copying 2 resources
[INFO] Copying 3 resources
[INFO] 
[INFO] --- maven-compiler-plugin:3.2:compile (default-compile) @ cloud-plugin-api-solidfire-intg-test ---
[INFO] Changes detected - recompiling the module!
[INFO] Compiling 10 source files to <http://jenkins.buildacloud.org/job/build-master-noredist/ws/plugins/api/solidfire-intg-test/target/classes>
[INFO] -------------------------------------------------------------
[ERROR] COMPILATION ERROR : 
[INFO] -------------------------------------------------------------
[ERROR] error: error reading /jenkins/.m2/repository/org/apache/commons/commons-exec/1.3/commons-exec-1.3.jar; error in opening zip file
[INFO] 1 error
[INFO] -------------------------------------------------------------
Tests run: 3, Failures: 0, Errors: 0, Skipped: 0, Time elapsed: 2.438 sec - in com.cloud.hypervisor.vmware.VmwareDatacenterApiUnitTest
Running org.apache.cloudstack.storage.motion.VmwareStorageMotionStrategyTest
Tests run: 6, Failures: 0, Errors: 0, Skipped: 0, Time elapsed: 0.642 sec - in org.apache.cloudstack.storage.motion.VmwareStorageMotionStrategyTest

Results :

Tests run: 10, Failures: 0, Errors: 0, Skipped: 0

[INFO] 
[INFO] --- maven-jar-plugin:2.5:jar (default-jar) @ cloud-plugin-hypervisor-vmware ---
[INFO] Building jar: <http://jenkins.buildacloud.org/job/build-master-noredist/ws/plugins/hypervisors/vmware/target/cloud-plugin-hypervisor-vmware-4.6.0-SNAPSHOT.jar>
[INFO] 
[INFO] --- maven-site-plugin:3.3:attach-descriptor (attach-descriptor) @ cloud-plugin-hypervisor-vmware ---
[INFO] 
[INFO] --- maven-install-plugin:2.3.1:install (default-install) @ cloud-plugin-hypervisor-vmware ---
[INFO] Installing <http://jenkins.buildacloud.org/job/build-master-noredist/ws/plugins/hypervisors/vmware/target/cloud-plugin-hypervisor-vmware-4.6.0-SNAPSHOT.jar> to /jenkins/.m2/repository/org/apache/cloudstack/cloud-plugin-hypervisor-vmware/4.6.0-SNAPSHOT/cloud-plugin-hypervisor-vmware-4.6.0-SNAPSHOT.jar
[INFO] Installing <http://jenkins.buildacloud.org/job/build-master-noredist/ws/plugins/hypervisors/vmware/pom.xml> to /jenkins/.m2/repository/org/apache/cloudstack/cloud-plugin-hypervisor-vmware/4.6.0-SNAPSHOT/cloud-plugin-hypervisor-vmware-4.6.0-SNAPSHOT.pom
[INFO] 
[INFO] --- maven-resources-plugin:2.5:testResources (default-testResources) @ cloud-plugin-api-solidfire-intg-test ---
[debug] execute contextualize
[INFO] Using 'UTF-8' encoding to copy filtered resources.
[INFO] skip non existing resourceDirectory <http://jenkins.buildacloud.org/job/build-master-noredist/ws/plugins/api/solidfire-intg-test/test/resources>
[INFO] Copying 3 resources
[INFO] 
[INFO] --- maven-compiler-plugin:3.2:testCompile (default-testCompile) @ cloud-plugin-api-solidfire-intg-test ---
[INFO] No sources to compile
[INFO] 
[INFO] --- maven-surefire-plugin:2.18.1:test (default-test) @ cloud-plugin-api-solidfire-intg-test ---
[INFO] 
[INFO] --- maven-jar-plugin:2.5:jar (default-jar) @ cloud-plugin-api-solidfire-intg-test ---
[INFO] Building jar: <http://jenkins.buildacloud.org/job/build-master-noredist/ws/plugins/api/solidfire-intg-test/target/cloud-plugin-api-solidfire-intg-test-4.6.0-SNAPSHOT.jar>
[INFO] 
[INFO] --- maven-site-plugin:3.3:attach-descriptor (attach-descriptor) @ cloud-plugin-api-solidfire-intg-test ---
[INFO] 
[INFO] --- maven-install-plugin:2.3.1:install (default-install) @ cloud-plugin-api-solidfire-intg-test ---
[INFO] Installing <http://jenkins.buildacloud.org/job/build-master-noredist/ws/plugins/api/solidfire-intg-test/target/cloud-plugin-api-solidfire-intg-test-4.6.0-SNAPSHOT.jar> to /jenkins/.m2/repository/org/apache/cloudstack/cloud-plugin-api-solidfire-intg-test/4.6.0-SNAPSHOT/cloud-plugin-api-solidfire-intg-test-4.6.0-SNAPSHOT.jar
[INFO] Installing <http://jenkins.buildacloud.org/job/build-master-noredist/ws/plugins/api/solidfire-intg-test/pom.xml> to /jenkins/.m2/repository/org/apache/cloudstack/cloud-plugin-api-solidfire-intg-test/4.6.0-SNAPSHOT/cloud-plugin-api-solidfire-intg-test-4.6.0-SNAPSHOT.pom
[INFO] ------------------------------------------------------------------------
[INFO] Reactor Summary:
[INFO] 
[INFO] Apache CloudStack Developer Tools - Checkstyle Configuration  SUCCESS [0.801s]
[INFO] Apache CloudStack ................................. SUCCESS [1.298s]
[INFO] Apache CloudStack Maven Conventions Parent ........ SUCCESS [1.217s]
[INFO] Apache CloudStack Framework - Managed Context ..... SUCCESS [4.891s]
[INFO] Apache CloudStack Utils ........................... SUCCESS [11.974s]
[INFO] Apache CloudStack Framework ....................... SUCCESS [0.432s]
[INFO] Apache CloudStack Framework - Event Notification .. SUCCESS [9.993s]
[INFO] Apache CloudStack Framework - Configuration ....... SUCCESS [3.758s]
[INFO] Apache CloudStack API ............................. SUCCESS [12.037s]
[INFO] Apache CloudStack Framework - REST ................ SUCCESS [5.433s]
[INFO] Apache CloudStack Framework - IPC ................. SUCCESS [5.278s]
[INFO] Apache CloudStack Cloud Engine .................... SUCCESS [0.429s]
[INFO] Apache CloudStack Cloud Engine API ................ SUCCESS [4.612s]
[INFO] Apache CloudStack Framework - Security ............ SUCCESS [2.357s]
[INFO] Apache CloudStack Core ............................ SUCCESS [20.512s]
[INFO] Apache CloudStack Agents .......................... SUCCESS [7.700s]
[INFO] Apache CloudStack Framework - Clustering .......... SUCCESS [3.205s]
[INFO] Apache CloudStack Framework - Event Notification .. SUCCESS [3.134s]
[INFO] Apache CloudStack Cloud Engine Schema Component ... SUCCESS [13.908s]
[INFO] Apache CloudStack Framework - Jobs ................ SUCCESS [6.408s]
[INFO] Apache CloudStack Cloud Engine Internal Components API  SUCCESS [2.894s]
[INFO] Apache CloudStack Server .......................... SUCCESS [36.454s]
[INFO] Apache CloudStack Usage Server .................... SUCCESS [9.320s]
[INFO] Apache CloudStack Cloud Engine Orchestration Component  SUCCESS [11.278s]
[INFO] Apache CloudStack Cloud Services .................. SUCCESS [0.427s]
[INFO] Apache CloudStack Secondary Storage ............... SUCCESS [3.306s]
[INFO] Apache CloudStack Secondary Storage Service ....... SUCCESS [12.313s]
[INFO] Apache CloudStack Engine Storage Component ........ SUCCESS [14.721s]
[INFO] Apache CloudStack Engine Storage Volume Component . SUCCESS [14.764s]
[INFO] Apache CloudStack Engine Storage Image Component .. SUCCESS [8.683s]
[INFO] Apache CloudStack Engine Storage Data Motion Component  SUCCESS [9.734s]
[INFO] Apache CloudStack Engine Storage Cache Component .. SUCCESS [6.922s]
[INFO] Apache CloudStack Engine Storage Snapshot Component  SUCCESS [28.863s]
[INFO] Apache CloudStack Cloud Engine API ................ SUCCESS [3.074s]
[INFO] Apache CloudStack Cloud Engine Service ............ SUCCESS [17.884s]
[INFO] Apache CloudStack Plugin POM ...................... SUCCESS [0.422s]
[INFO] Apache CloudStack Plugin - API Rate Limit ......... SUCCESS [19.116s]
[INFO] Apache CloudStack Plugin - Storage Volume default provider  SUCCESS [10.289s]
[INFO] Apache CloudStack Plugin - Storage Volume SolidFire Provider  SUCCESS [15.020s]
[INFO] Apache CloudStack Plugin - API SolidFire .......... SUCCESS [3.023s]
[INFO] Apache CloudStack Plugin - API Discovery .......... SUCCESS [14.113s]
[INFO] Apache CloudStack Plugin - ACL Static Role Based .. SUCCESS [7.719s]
[INFO] Apache CloudStack Plugin - Host Anti-Affinity Processor  SUCCESS [7.714s]
[INFO] Apache CloudStack Plugin - Explicit Dedication Processor  SUCCESS [7.855s]
[INFO] Apache CloudStack Plugin - User Concentrated Pod Deployment Planner  SUCCESS [7.537s]
[INFO] Apache CloudStack Plugin - User Dispersing Deployment Planner  SUCCESS [5.594s]
[INFO] Apache CloudStack Plugin - Implicit Dedication Planner  SUCCESS [21.708s]
[INFO] Apache CloudStack Plugin - Skip Heurestics Planner  SUCCESS [6.407s]
[INFO] Apache CloudStack Plugin - Host Allocator Random .. SUCCESS [6.380s]
[INFO] Apache CloudStack Plugin - Dedicated Resources .... SUCCESS [20.146s]
[INFO] Apache CloudStack Plugin - Hypervisor OracleVM .... SUCCESS [7.877s]
[INFO] Apache CloudStack Plugin - Open vSwitch ........... SUCCESS [10.387s]
[INFO] Apache CloudStack Plugin - Hypervisor XenServer ... SUCCESS [27.299s]
[INFO] Apache CloudStack Plugin - Hypervisor KVM ......... SUCCESS [24.011s]
[INFO] Apache CloudStack Plugin - RabbitMQ Event Bus ..... SUCCESS [6.207s]
[INFO] Apache CloudStack Plugin - In Memory Event Bus .... SUCCESS [13.073s]
[INFO] Apache CloudStack Plugin - Hypervisor Baremetal ... SUCCESS [12.546s]
[INFO] Apache CloudStack Plugin - Hypervisor UCS ......... SUCCESS [9.270s]
[INFO] Apache CloudStack Plugin - Hypervisor Hyper-V ..... SUCCESS [16.699s]
[INFO] Apache CloudStack Plugin - Network Elastic Load Balancer  SUCCESS [18.837s]
[INFO] Apache CloudStack Plugin - Network Internal Load Balancer  SUCCESS [27.901s]
[INFO] Apache CloudStack Framework - Spring Life Cycle ... SUCCESS [2.337s]
[INFO] Apache CloudStack Plugin - Network Juniper Contrail  FAILURE [3.983s]
[INFO] Apache CloudStack Plugin - Palo Alto .............. SUCCESS [22.867s]
[INFO] Apache CloudStack Plugin - Network Netscaler ...... SUCCESS [13.145s]
[INFO] Apache CloudStack Plugin - Network Nicira NVP ..... SUCCESS [33.797s]
[INFO] Apache CloudStack Plugin - BigSwitch Virtual Network Segment  SUCCESS [20.595s]
[INFO] Apache CloudStack Plugin - Network Brocade VCS .... SUCCESS [27.584s]
[INFO] Apache CloudStack Plugin - Midokura Midonet ....... SUCCESS [23.257s]
[INFO] Apache CloudStack Plugin - Stratosphere SSP ....... SUCCESS [18.821s]
[INFO] Apache CloudStack Plugin - Network Opendaylight ... SUCCESS [17.693s]
[INFO] Apache CloudStack Plugin - Storage Allocator Random  SUCCESS [6.723s]
[INFO] Apache CloudStack Plugin - User Authenticator LDAP  SUCCESS [9.007s]
[INFO] Apache CloudStack Plugin - User Authenticator MD5 . SUCCESS [13.751s]
[INFO] Apache CloudStack Plugin - User Authenticator Plain Text  SUCCESS [5.108s]
[INFO] Apache CloudStack Plugin - User Authenticator SAML2  SUCCESS [31.284s]
[INFO] Apache CloudStack Plugin - User Authenticator SHA256 Salted  SUCCESS [13.821s]
[INFO] Apache CloudStack Plugin - Dns Notifier Example ... SUCCESS [6.287s]
[INFO] Apache CloudStack Plugin - Storage Image S3 ....... SUCCESS [6.777s]
[INFO] Apache CloudStack Plugin - Storage Image Swift provider  SUCCESS [6.386s]
[INFO] Apache CloudStack Plugin - Storage Image default provider  SUCCESS [6.587s]
[INFO] Apache CloudStack Plugin - Storage Image sample provider  SUCCESS [6.199s]
[INFO] Apache CloudStack Plugin - Storage Volume Nexenta Provider  SUCCESS [15.110s]
[INFO] Apache CloudStack Plugin - Storage Volume CloudByte Provider  SUCCESS [9.914s]
[INFO] Apache CloudStack Plugin - Storage Volume sample provider  SUCCESS [7.045s]
[INFO] Apache CloudStack Plugin - SNMP Alerts ............ SUCCESS [14.651s]
[INFO] Apache CloudStack Plugin - Syslog Alerts .......... SUCCESS [13.208s]
[INFO] Apache CloudStack Plugin - Network VXLAN .......... SUCCESS [16.005s]
[INFO] Apache CloudStack Plugin - GloboDNS ............... SUCCESS [22.866s]
[INFO] Apache CloudStack Plugin - NetApp File System ..... SUCCESS [7.793s]
[INFO] Apache CloudStack Plugin - F5 ..................... SUCCESS [8.286s]
[INFO] Apache CloudStack Plugin - Juniper SRX ............ SUCCESS [8.818s]
[INFO] Apache CloudStack Plugin - Nuage VSP .............. SUCCESS [18.462s]
[INFO] Apache CloudStack VMware Base ..................... SUCCESS [6.979s]
[INFO] Apache CloudStack Plugin - Hypervisor VMware ...... SUCCESS [34.166s]
[INFO] Apache CloudStack Plugin - Cisco VNMC ............. SKIPPED
[INFO] Apache CloudStack Plugin - MySQL HA Strategy ...... SUCCESS [5.783s]
[INFO] Apache CloudStack Framework - Spring Module ....... SUCCESS [9.191s]
[INFO] Apache CloudStack Secondary Storage Controller .... SUCCESS [6.935s]
[INFO] Apache CloudStack Console Proxy - RDP Client ...... SUCCESS [12.100s]
[INFO] Apache CloudStack Console Proxy ................... SUCCESS [3.262s]
[INFO] Apache CloudStack Console Proxy - Server .......... SUCCESS [7.986s]
[INFO] Apache CloudStack System VM ....................... SKIPPED
[INFO] Apache CloudStack Client UI ....................... SKIPPED
[INFO] Apache CloudStack Framework - QuickCloud .......... SUCCESS [1.312s]
[INFO] Apache CloudStack AWS API Bridge .................. SKIPPED
[INFO] ------------------------------------------------------------------------
[INFO] BUILD FAILURE
[INFO] ------------------------------------------------------------------------
[INFO] Total time: 4:09.624s (Wall Clock)
[INFO] Finished at: Wed Jan 07 08:07:47 CET 2015
[INFO] Final Memory: 107M/469M
[INFO] ------------------------------------------------------------------------
[ERROR] Failed to execute goal org.apache.maven.plugins:maven-compiler-plugin:3.2:compile (default-compile) on project cloud-plugin-network-contrail: Compilation failure
[ERROR] error: error reading /jenkins/.m2/repository/org/apache/commons/commons-exec/1.3/commons-exec-1.3.jar; error in opening zip file
[ERROR] -> [Help 1]
[ERROR] 
[ERROR] To see the full stack trace of the errors, re-run Maven with the -e switch.
[ERROR] Re-run Maven using the -X switch to enable full debug logging.
[ERROR] 
[ERROR] For more information about the errors and possible solutions, please read the following articles:
[ERROR] [Help 1] http://cwiki.apache.org/confluence/display/MAVEN/MojoFailureException
[ERROR] 
[ERROR] After correcting the problems, you can resume the build with the command
[ERROR]   mvn <goals> -rf :cloud-plugin-network-contrail
Destroying 1 processes
Destroying process..
Destroyed 1 processes
Build step 'Invoke top-level Maven targets' marked build as failure
Archiving artifacts