You are viewing a plain text version of this content. The canonical link for it is here.
Posted to yarn-dev@hadoop.apache.org by Apache Jenkins Server <je...@builds.apache.org> on 2015/05/09 05:15:23 UTC

Failed: YARN-3587 PreCommit Build #7829

Jira: https://issues.apache.org/jira/browse/YARN-3587
Build: https://builds.apache.org/job/PreCommit-YARN-Build/7829/

###################################################################################
########################## LAST 60 LINES OF THE CONSOLE ###########################
[...truncated 270 lines...]
Elapsed time:  22m 19s

  Running tests in hadoop-mapreduce-client-core
/home/jenkins/tools/maven/latest/bin/mvn clean install -fae -Pnative -Drequire.test.libhadoop -DhadoopPatchProcess > /home/jenkins/jenkins-slave/workspace/PreCommit-YARN-Build/patchprocess/testrun_hadoop-mapreduce-client-core.txt 2>&1

Elapsed time:   1m 36s

  Running tests in hadoop-mapreduce-client-hs
/home/jenkins/tools/maven/latest/bin/mvn clean install -fae -Pnative -Drequire.test.libhadoop -DhadoopPatchProcess > /home/jenkins/jenkins-slave/workspace/PreCommit-YARN-Build/patchprocess/testrun_hadoop-mapreduce-client-hs.txt 2>&1

Elapsed time:   5m 42s

  Running tests in hadoop-yarn-server-applicationhistoryservice
/home/jenkins/tools/maven/latest/bin/mvn clean install -fae -Pnative -Drequire.test.libhadoop -DhadoopPatchProcess > /home/jenkins/jenkins-slave/workspace/PreCommit-YARN-Build/patchprocess/testrun_hadoop-yarn-server-applicationhistoryservice.txt 2>&1

Elapsed time:   3m  6s

  Running tests in hadoop-yarn-server-resourcemanager
/home/jenkins/tools/maven/latest/bin/mvn clean install -fae -Pnative -Drequire.test.libhadoop -DhadoopPatchProcess > /home/jenkins/jenkins-slave/workspace/PreCommit-YARN-Build/patchprocess/testrun_hadoop-yarn-server-resourcemanager.txt 2>&1

Elapsed time:  52m  8s

  Running tests in hadoop-hdfs
/home/jenkins/tools/maven/latest/bin/mvn clean install -fae -Pnative -Drequire.test.libhadoop -DhadoopPatchProcess > /home/jenkins/jenkins-slave/workspace/PreCommit-YARN-Build/patchprocess/testrun_hadoop-hdfs.txt 2>&1
FATAL: hudson.remoting.RequestAbortedException: java.io.IOException: Unexpected termination of the channel
hudson.remoting.RequestAbortedException: hudson.remoting.RequestAbortedException: java.io.IOException: Unexpected termination of the channel
	at hudson.remoting.RequestAbortedException.wrapForRethrow(RequestAbortedException.java:41)
	at hudson.remoting.RequestAbortedException.wrapForRethrow(RequestAbortedException.java:34)
	at hudson.remoting.Request.call(Request.java:174)
	at hudson.remoting.Channel.call(Channel.java:742)
	at hudson.remoting.RemoteInvocationHandler.invoke(RemoteInvocationHandler.java:168)
	at com.sun.proxy.$Proxy120.join(Unknown Source)
	at hudson.Launcher$RemoteLauncher$ProcImpl.join(Launcher.java:956)
	at hudson.tasks.CommandInterpreter.join(CommandInterpreter.java:137)
	at hudson.tasks.CommandInterpreter.perform(CommandInterpreter.java:97)
	at hudson.tasks.CommandInterpreter.perform(CommandInterpreter.java:66)
	at hudson.tasks.BuildStepMonitor$1.perform(BuildStepMonitor.java:20)
	at hudson.model.AbstractBuild$AbstractBuildExecution.perform(AbstractBuild.java:756)
	at hudson.model.Build$BuildExecution.build(Build.java:198)
	at hudson.model.Build$BuildExecution.doRun(Build.java:159)
	at hudson.model.AbstractBuild$AbstractBuildExecution.run(AbstractBuild.java:529)
	at hudson.model.Run.execute(Run.java:1706)
	at hudson.model.FreeStyleBuild.run(FreeStyleBuild.java:43)
	at hudson.model.ResourceController.execute(ResourceController.java:88)
	at hudson.model.Executor.run(Executor.java:232)
Caused by: hudson.remoting.RequestAbortedException: java.io.IOException: Unexpected termination of the channel
	at hudson.remoting.Request.abort(Request.java:299)
	at hudson.remoting.Channel.terminate(Channel.java:805)
	at hudson.remoting.SynchronousCommandTransport$ReaderThread.run(SynchronousCommandTransport.java:69)
Caused by: java.io.IOException: Unexpected termination of the channel
	at hudson.remoting.SynchronousCommandTransport$ReaderThread.run(SynchronousCommandTransport.java:50)
Caused by: java.io.EOFException
	at java.io.ObjectInputStream$PeekInputStream.readFully(ObjectInputStream.java:2325)
	at java.io.ObjectInputStream$BlockDataInputStream.readShort(ObjectInputStream.java:2794)
	at java.io.ObjectInputStream.readStreamHeader(ObjectInputStream.java:801)
	at java.io.ObjectInputStream.<init>(ObjectInputStream.java:299)
	at hudson.remoting.ObjectInputStreamEx.<init>(ObjectInputStreamEx.java:40)
	at hudson.remoting.AbstractSynchronousByteArrayCommandTransport.read(AbstractSynchronousByteArrayCommandTransport.java:34)
	at hudson.remoting.SynchronousCommandTransport$ReaderThread.run(SynchronousCommandTransport.java:48)



###################################################################################
############################## FAILED TESTS (if any) ##############################
No tests ran.