You are viewing a plain text version of this content. The canonical link for it is here.
Posted to builds@beam.apache.org by Apache Jenkins Server <je...@builds.apache.org> on 2023/09/05 21:42:15 UTC

Build failed in Jenkins: beam_PostCommit_XVR_Spark3 #3547

See <https://ci-beam.apache.org/job/beam_PostCommit_XVR_Spark3/3547/display/redirect>

Changes:


------------------------------------------
[...truncated 1.23 MB...]
      elif '.dev' in version:
        # TODO: Attempt to use nightly snapshots?
>       raise RuntimeError(
            (
                '%s not found. '
                'Please build the server with \n  cd %s; ./gradlew %s') %
            (local_path, os.path.abspath(project_root), gradle_target))
E       RuntimeError: <https://ci-beam.apache.org/job/beam_PostCommit_XVR_Spark3/ws/src/sdks/java/extensions/sql/expansion-service/build/libs/beam-sdks-java-extensions-sql-expansion-service-2.51.0-SNAPSHOT.jar> not found. Please build the server with 
E         cd <https://ci-beam.apache.org/job/beam_PostCommit_XVR_Spark3/ws/src;> ./gradlew :sdks:java:extensions:sql:expansion-service:shadowJar

apache_beam/utils/subprocess_server.py:243: RuntimeError
__________________ SqlTransformTest.test_windowing_before_sql __________________

self = <apache_beam.transforms.sql_test.SqlTransformTest testMethod=test_windowing_before_sql>

    def test_windowing_before_sql(self):
      with TestPipeline() as p:
        out = (
            p | beam.Create([
                SimpleRow(5, "foo", 1.),
                SimpleRow(15, "bar", 2.),
                SimpleRow(25, "baz", 3.)
            ])
            | beam.Map(lambda v: beam.window.TimestampedValue(v, v.id)).
            with_output_types(SimpleRow)
            | beam.WindowInto(
                beam.window.FixedWindows(10)).with_output_types(SimpleRow)
>           | SqlTransform("SELECT COUNT(*) as `count` FROM PCOLLECTION"))

apache_beam/transforms/sql_test.py:174: 
_ _ _ _ _ _ _ _ _ _ _ _ _ _ _ _ _ _ _ _ _ _ _ _ _ _ _ _ _ _ _ _ _ _ _ _ _ _ _ _ 
apache_beam/transforms/sql.py:86: in __init__
    expansion_service = expansion_service or BeamJarExpansionService(
apache_beam/transforms/external.py:983: in __init__
    path_to_jar = subprocess_server.JavaJarServer.path_to_beam_jar(
_ _ _ _ _ _ _ _ _ _ _ _ _ _ _ _ _ _ _ _ _ _ _ _ _ _ _ _ _ _ _ _ _ _ _ _ _ _ _ _ 

cls = <class 'apache_beam.utils.subprocess_server.JavaJarServer'>
gradle_target = ':sdks:java:extensions:sql:expansion-service:shadowJar'
appendix = None, version = '2.51.0.dev'
artifact_id = 'beam-sdks-java-extensions-sql-expansion-service'

    @classmethod
    def path_to_beam_jar(
        cls,
        gradle_target,
        appendix=None,
        version=beam_version,
        artifact_id=None):
      if gradle_target in cls._BEAM_SERVICES.replacements:
        return cls._BEAM_SERVICES.replacements[gradle_target]
    
      gradle_package = gradle_target.strip(':').rsplit(':', 1)[0]
      if not artifact_id:
        artifact_id = 'beam-' + gradle_package.replace(':', '-')
      project_root = os.path.sep.join(
          os.path.abspath(__file__).split(os.path.sep)[:-5])
      local_path = os.path.join(
          project_root,
          gradle_package.replace(':', os.path.sep),
          'build',
          'libs',
          cls.jar_name(
              artifact_id,
              version.replace('.dev', ''),
              classifier='SNAPSHOT',
              appendix=appendix))
      if os.path.exists(local_path):
        _LOGGER.info('Using pre-built snapshot at %s', local_path)
        return local_path
      elif '.dev' in version:
        # TODO: Attempt to use nightly snapshots?
>       raise RuntimeError(
            (
                '%s not found. '
                'Please build the server with \n  cd %s; ./gradlew %s') %
            (local_path, os.path.abspath(project_root), gradle_target))
E       RuntimeError: <https://ci-beam.apache.org/job/beam_PostCommit_XVR_Spark3/ws/src/sdks/java/extensions/sql/expansion-service/build/libs/beam-sdks-java-extensions-sql-expansion-service-2.51.0-SNAPSHOT.jar> not found. Please build the server with 
E         cd <https://ci-beam.apache.org/job/beam_PostCommit_XVR_Spark3/ws/src;> ./gradlew :sdks:java:extensions:sql:expansion-service:shadowJar

apache_beam/utils/subprocess_server.py:243: RuntimeError
_________________ SqlTransformTest.test_zetasql_generate_data __________________

self = <apache_beam.transforms.sql_test.SqlTransformTest testMethod=test_zetasql_generate_data>

    def test_zetasql_generate_data(self):
      with TestPipeline() as p:
>       out = p | SqlTransform(
            """SELECT
              CAST(1 AS INT64) AS `int`,
              CAST('foo' AS STRING) AS `str`,
              CAST(3.14  AS FLOAT64) AS `flt`""",
            dialect="zetasql")

apache_beam/transforms/sql_test.py:154: 
_ _ _ _ _ _ _ _ _ _ _ _ _ _ _ _ _ _ _ _ _ _ _ _ _ _ _ _ _ _ _ _ _ _ _ _ _ _ _ _ 
apache_beam/transforms/sql.py:86: in __init__
    expansion_service = expansion_service or BeamJarExpansionService(
apache_beam/transforms/external.py:983: in __init__
    path_to_jar = subprocess_server.JavaJarServer.path_to_beam_jar(
_ _ _ _ _ _ _ _ _ _ _ _ _ _ _ _ _ _ _ _ _ _ _ _ _ _ _ _ _ _ _ _ _ _ _ _ _ _ _ _ 

cls = <class 'apache_beam.utils.subprocess_server.JavaJarServer'>
gradle_target = ':sdks:java:extensions:sql:expansion-service:shadowJar'
appendix = None, version = '2.51.0.dev'
artifact_id = 'beam-sdks-java-extensions-sql-expansion-service'

    @classmethod
    def path_to_beam_jar(
        cls,
        gradle_target,
        appendix=None,
        version=beam_version,
        artifact_id=None):
      if gradle_target in cls._BEAM_SERVICES.replacements:
        return cls._BEAM_SERVICES.replacements[gradle_target]
    
      gradle_package = gradle_target.strip(':').rsplit(':', 1)[0]
      if not artifact_id:
        artifact_id = 'beam-' + gradle_package.replace(':', '-')
      project_root = os.path.sep.join(
          os.path.abspath(__file__).split(os.path.sep)[:-5])
      local_path = os.path.join(
          project_root,
          gradle_package.replace(':', os.path.sep),
          'build',
          'libs',
          cls.jar_name(
              artifact_id,
              version.replace('.dev', ''),
              classifier='SNAPSHOT',
              appendix=appendix))
      if os.path.exists(local_path):
        _LOGGER.info('Using pre-built snapshot at %s', local_path)
        return local_path
      elif '.dev' in version:
        # TODO: Attempt to use nightly snapshots?
>       raise RuntimeError(
            (
                '%s not found. '
                'Please build the server with \n  cd %s; ./gradlew %s') %
            (local_path, os.path.abspath(project_root), gradle_target))
E       RuntimeError: <https://ci-beam.apache.org/job/beam_PostCommit_XVR_Spark3/ws/src/sdks/java/extensions/sql/expansion-service/build/libs/beam-sdks-java-extensions-sql-expansion-service-2.51.0-SNAPSHOT.jar> not found. Please build the server with 
E         cd <https://ci-beam.apache.org/job/beam_PostCommit_XVR_Spark3/ws/src;> ./gradlew :sdks:java:extensions:sql:expansion-service:shadowJar

apache_beam/utils/subprocess_server.py:243: RuntimeError
=============================== warnings summary ===============================
../../build/gradleenv/1922375555/lib/python3.8/site-packages/hdfs/config.py:28
  <https://ci-beam.apache.org/job/beam_PostCommit_XVR_Spark3/ws/src/build/gradleenv/1922375555/lib/python3.8/site-packages/hdfs/config.py>:28: DeprecationWarning: the imp module is deprecated in favour of importlib; see the module's documentation for alternative uses
    from imp import load_source

../../build/gradleenv/1922375555/lib/python3.8/site-packages/google/rpc/__init__.py:18
  <https://ci-beam.apache.org/job/beam_PostCommit_XVR_Spark3/ws/src/build/gradleenv/1922375555/lib/python3.8/site-packages/google/rpc/__init__.py>:18: DeprecationWarning: pkg_resources is deprecated as an API. See https://setuptools.pypa.io/en/latest/pkg_resources.html
    import pkg_resources

../../build/gradleenv/1922375555/lib/python3.8/site-packages/pkg_resources/__init__.py:2871: 20 warnings
  <https://ci-beam.apache.org/job/beam_PostCommit_XVR_Spark3/ws/src/build/gradleenv/1922375555/lib/python3.8/site-packages/pkg_resources/__init__.py>:2871: DeprecationWarning: Deprecated call to `pkg_resources.declare_namespace('google')`.
  Implementing implicit namespace packages (as specified in PEP 420) is preferred to `pkg_resources.declare_namespace`. See https://setuptools.pypa.io/en/latest/references/keywords.html#keyword-namespace-packages
    declare_namespace(pkg)

../../build/gradleenv/1922375555/lib/python3.8/site-packages/pkg_resources/__init__.py:2871: 16 warnings
  <https://ci-beam.apache.org/job/beam_PostCommit_XVR_Spark3/ws/src/build/gradleenv/1922375555/lib/python3.8/site-packages/pkg_resources/__init__.py>:2871: DeprecationWarning: Deprecated call to `pkg_resources.declare_namespace('google.cloud')`.
  Implementing implicit namespace packages (as specified in PEP 420) is preferred to `pkg_resources.declare_namespace`. See https://setuptools.pypa.io/en/latest/references/keywords.html#keyword-namespace-packages
    declare_namespace(pkg)

../../build/gradleenv/1922375555/lib/python3.8/site-packages/pkg_resources/__init__.py:2350
../../build/gradleenv/1922375555/lib/python3.8/site-packages/pkg_resources/__init__.py:2350
../../build/gradleenv/1922375555/lib/python3.8/site-packages/pkg_resources/__init__.py:2350
../../build/gradleenv/1922375555/lib/python3.8/site-packages/pkg_resources/__init__.py:2350
  <https://ci-beam.apache.org/job/beam_PostCommit_XVR_Spark3/ws/src/build/gradleenv/1922375555/lib/python3.8/site-packages/pkg_resources/__init__.py>:2350: DeprecationWarning: Deprecated call to `pkg_resources.declare_namespace('google')`.
  Implementing implicit namespace packages (as specified in PEP 420) is preferred to `pkg_resources.declare_namespace`. See https://setuptools.pypa.io/en/latest/references/keywords.html#keyword-namespace-packages
    declare_namespace(parent)

../../build/gradleenv/1922375555/lib/python3.8/site-packages/pkg_resources/__init__.py:2871
  <https://ci-beam.apache.org/job/beam_PostCommit_XVR_Spark3/ws/src/build/gradleenv/1922375555/lib/python3.8/site-packages/pkg_resources/__init__.py>:2871: DeprecationWarning: Deprecated call to `pkg_resources.declare_namespace('google.logging')`.
  Implementing implicit namespace packages (as specified in PEP 420) is preferred to `pkg_resources.declare_namespace`. See https://setuptools.pypa.io/en/latest/references/keywords.html#keyword-namespace-packages
    declare_namespace(pkg)

../../build/gradleenv/1922375555/lib/python3.8/site-packages/pkg_resources/__init__.py:2871
  <https://ci-beam.apache.org/job/beam_PostCommit_XVR_Spark3/ws/src/build/gradleenv/1922375555/lib/python3.8/site-packages/pkg_resources/__init__.py>:2871: DeprecationWarning: Deprecated call to `pkg_resources.declare_namespace('google.iam')`.
  Implementing implicit namespace packages (as specified in PEP 420) is preferred to `pkg_resources.declare_namespace`. See https://setuptools.pypa.io/en/latest/references/keywords.html#keyword-namespace-packages
    declare_namespace(pkg)

../../build/gradleenv/1922375555/lib/python3.8/site-packages/google/rpc/__init__.py:20
  <https://ci-beam.apache.org/job/beam_PostCommit_XVR_Spark3/ws/src/build/gradleenv/1922375555/lib/python3.8/site-packages/google/rpc/__init__.py>:20: DeprecationWarning: Deprecated call to `pkg_resources.declare_namespace('google.rpc')`.
  Implementing implicit namespace packages (as specified in PEP 420) is preferred to `pkg_resources.declare_namespace`. See https://setuptools.pypa.io/en/latest/references/keywords.html#keyword-namespace-packages
    pkg_resources.declare_namespace(__name__)

-- Docs: https://docs.pytest.org/en/stable/how-to/capture-warnings.html
- generated xml file: <https://ci-beam.apache.org/job/beam_PostCommit_XVR_Spark3/ws/src/sdks/python/pytest_xlangSqlValidateRunner.xml> -
=========================== short test summary info ============================
FAILED apache_beam/transforms/sql_test.py::SqlTransformTest::test_agg - RuntimeError: <https://ci-beam.apache.org/job/beam_PostCommit_XVR_Spark3/ws/src/sdks/java/extensions/sql/expansion-service/build/libs/beam-sdks-java-extensions-sql-expansion-service-2.51.0-SNAPSHOT.jar> not found. Please build the server with 
  cd <https://ci-beam.apache.org/job/beam_PostCommit_XVR_Spark3/ws/src;> ./gradlew :sdks:java:extensions:sql:expansion-service:shadowJar
FAILED apache_beam/transforms/sql_test.py::SqlTransformTest::test_filter - RuntimeError: <https://ci-beam.apache.org/job/beam_PostCommit_XVR_Spark3/ws/src/sdks/java/extensions/sql/expansion-service/build/libs/beam-sdks-java-extensions-sql-expansion-service-2.51.0-SNAPSHOT.jar> not found. Please build the server with 
  cd <https://ci-beam.apache.org/job/beam_PostCommit_XVR_Spark3/ws/src;> ./gradlew :sdks:java:extensions:sql:expansion-service:shadowJar
FAILED apache_beam/transforms/sql_test.py::SqlTransformTest::test_generate_data - RuntimeError: <https://ci-beam.apache.org/job/beam_PostCommit_XVR_Spark3/ws/src/sdks/java/extensions/sql/expansion-service/build/libs/beam-sdks-java-extensions-sql-expansion-service-2.51.0-SNAPSHOT.jar> not found. Please build the server with 
  cd <https://ci-beam.apache.org/job/beam_PostCommit_XVR_Spark3/ws/src;> ./gradlew :sdks:java:extensions:sql:expansion-service:shadowJar
FAILED apache_beam/transforms/sql_test.py::SqlTransformTest::test_map - RuntimeError: <https://ci-beam.apache.org/job/beam_PostCommit_XVR_Spark3/ws/src/sdks/java/extensions/sql/expansion-service/build/libs/beam-sdks-java-extensions-sql-expansion-service-2.51.0-SNAPSHOT.jar> not found. Please build the server with 
  cd <https://ci-beam.apache.org/job/beam_PostCommit_XVR_Spark3/ws/src;> ./gradlew :sdks:java:extensions:sql:expansion-service:shadowJar
FAILED apache_beam/transforms/sql_test.py::SqlTransformTest::test_project - RuntimeError: <https://ci-beam.apache.org/job/beam_PostCommit_XVR_Spark3/ws/src/sdks/java/extensions/sql/expansion-service/build/libs/beam-sdks-java-extensions-sql-expansion-service-2.51.0-SNAPSHOT.jar> not found. Please build the server with 
  cd <https://ci-beam.apache.org/job/beam_PostCommit_XVR_Spark3/ws/src;> ./gradlew :sdks:java:extensions:sql:expansion-service:shadowJar
FAILED apache_beam/transforms/sql_test.py::SqlTransformTest::test_row - RuntimeError: <https://ci-beam.apache.org/job/beam_PostCommit_XVR_Spark3/ws/src/sdks/java/extensions/sql/expansion-service/build/libs/beam-sdks-java-extensions-sql-expansion-service-2.51.0-SNAPSHOT.jar> not found. Please build the server with 
  cd <https://ci-beam.apache.org/job/beam_PostCommit_XVR_Spark3/ws/src;> ./gradlew :sdks:java:extensions:sql:expansion-service:shadowJar
FAILED apache_beam/transforms/sql_test.py::SqlTransformTest::test_tagged_join - RuntimeError: <https://ci-beam.apache.org/job/beam_PostCommit_XVR_Spark3/ws/src/sdks/java/extensions/sql/expansion-service/build/libs/beam-sdks-java-extensions-sql-expansion-service-2.51.0-SNAPSHOT.jar> not found. Please build the server with 
  cd <https://ci-beam.apache.org/job/beam_PostCommit_XVR_Spark3/ws/src;> ./gradlew :sdks:java:extensions:sql:expansion-service:shadowJar
FAILED apache_beam/transforms/sql_test.py::SqlTransformTest::test_windowing_before_sql - RuntimeError: <https://ci-beam.apache.org/job/beam_PostCommit_XVR_Spark3/ws/src/sdks/java/extensions/sql/expansion-service/build/libs/beam-sdks-java-extensions-sql-expansion-service-2.51.0-SNAPSHOT.jar> not found. Please build the server with 
  cd <https://ci-beam.apache.org/job/beam_PostCommit_XVR_Spark3/ws/src;> ./gradlew :sdks:java:extensions:sql:expansion-service:shadowJar
FAILED apache_beam/transforms/sql_test.py::SqlTransformTest::test_zetasql_generate_data - RuntimeError: <https://ci-beam.apache.org/job/beam_PostCommit_XVR_Spark3/ws/src/sdks/java/extensions/sql/expansion-service/build/libs/beam-sdks-java-extensions-sql-expansion-service-2.51.0-SNAPSHOT.jar> not found. Please build the server with 
  cd <https://ci-beam.apache.org/job/beam_PostCommit_XVR_Spark3/ws/src;> ./gradlew :sdks:java:extensions:sql:expansion-service:shadowJar
========= 9 failed, 17 skipped, 7152 deselected, 45 warnings in 8.23s ==========

> Task :runners:spark:3:job-server:validatesCrossLanguageRunnerPythonUsingSql FAILED

> Task :runners:spark:3:job-server:sparkJobServerCleanup
Stopping job server pid: 3493803.

> Task :runners:spark:3:job-server:validatesCrossLanguageRunnerCleanup
Stopping expansion service pid: 3497878.
Stopping expansion service pid: 3497879.

FAILURE: Build failed with an exception.

* What went wrong:
Execution failed for task ':runners:spark:3:job-server:validatesCrossLanguageRunnerPythonUsingSql'.
> Process 'command 'sh'' finished with non-zero exit value 1

* Try:
> Run with --stacktrace option to get the stack trace.
> Run with --info or --debug option to get more log output.

* Get more help at https://help.gradle.org

Deprecated Gradle features were used in this build, making it incompatible with Gradle 8.0.

You can use '--warning-mode all' to show the individual deprecation warnings and determine if they come from your own scripts or plugins.

See https://docs.gradle.org/7.6.2/userguide/command_line_interface.html#sec:command_line_warnings

Execution optimizations have been disabled for 1 invalid unit(s) of work during this build to ensure correctness.
Please consult deprecation warnings for more details.

BUILD FAILED in 45m 1s
274 actionable tasks: 183 executed, 79 from cache, 12 up-to-date

Publishing build scan...
https://ge.apache.org/s/lfxtx6ad63cdm

Build step 'Invoke Gradle script' changed build result to FAILURE
Build step 'Invoke Gradle script' marked build as failure

---------------------------------------------------------------------
To unsubscribe, e-mail: builds-unsubscribe@beam.apache.org
For additional commands, e-mail: builds-help@beam.apache.org


Jenkins build is back to normal : beam_PostCommit_XVR_Spark3 #3555

Posted by Apache Jenkins Server <je...@builds.apache.org>.
See <https://ci-beam.apache.org/job/beam_PostCommit_XVR_Spark3/3555/display/redirect>


---------------------------------------------------------------------
To unsubscribe, e-mail: builds-unsubscribe@beam.apache.org
For additional commands, e-mail: builds-help@beam.apache.org


Build failed in Jenkins: beam_PostCommit_XVR_Spark3 #3554

Posted by Apache Jenkins Server <je...@builds.apache.org>.
See <https://ci-beam.apache.org/job/beam_PostCommit_XVR_Spark3/3554/display/redirect?page=changes>

Changes:

[noreply] Add buffered logger to the Python bootloader (#28317)


------------------------------------------
[...truncated 1.21 MB...]
      elif '.dev' in version:
        # TODO: Attempt to use nightly snapshots?
>       raise RuntimeError(
            (
                '%s not found. '
                'Please build the server with \n  cd %s; ./gradlew %s') %
            (local_path, os.path.abspath(project_root), gradle_target))
E       RuntimeError: <https://ci-beam.apache.org/job/beam_PostCommit_XVR_Spark3/ws/src/sdks/java/extensions/sql/expansion-service/build/libs/beam-sdks-java-extensions-sql-expansion-service-2.51.0-SNAPSHOT.jar> not found. Please build the server with 
E         cd <https://ci-beam.apache.org/job/beam_PostCommit_XVR_Spark3/ws/src;> ./gradlew :sdks:java:extensions:sql:expansion-service:shadowJar

apache_beam/utils/subprocess_server.py:243: RuntimeError
__________________ SqlTransformTest.test_windowing_before_sql __________________

self = <apache_beam.transforms.sql_test.SqlTransformTest testMethod=test_windowing_before_sql>

    def test_windowing_before_sql(self):
      with TestPipeline() as p:
        out = (
            p | beam.Create([
                SimpleRow(5, "foo", 1.),
                SimpleRow(15, "bar", 2.),
                SimpleRow(25, "baz", 3.)
            ])
            | beam.Map(lambda v: beam.window.TimestampedValue(v, v.id)).
            with_output_types(SimpleRow)
            | beam.WindowInto(
                beam.window.FixedWindows(10)).with_output_types(SimpleRow)
>           | SqlTransform("SELECT COUNT(*) as `count` FROM PCOLLECTION"))

apache_beam/transforms/sql_test.py:174: 
_ _ _ _ _ _ _ _ _ _ _ _ _ _ _ _ _ _ _ _ _ _ _ _ _ _ _ _ _ _ _ _ _ _ _ _ _ _ _ _ 
apache_beam/transforms/sql.py:86: in __init__
    expansion_service = expansion_service or BeamJarExpansionService(
apache_beam/transforms/external.py:983: in __init__
    path_to_jar = subprocess_server.JavaJarServer.path_to_beam_jar(
_ _ _ _ _ _ _ _ _ _ _ _ _ _ _ _ _ _ _ _ _ _ _ _ _ _ _ _ _ _ _ _ _ _ _ _ _ _ _ _ 

cls = <class 'apache_beam.utils.subprocess_server.JavaJarServer'>
gradle_target = ':sdks:java:extensions:sql:expansion-service:shadowJar'
appendix = None, version = '2.51.0.dev'
artifact_id = 'beam-sdks-java-extensions-sql-expansion-service'

    @classmethod
    def path_to_beam_jar(
        cls,
        gradle_target,
        appendix=None,
        version=beam_version,
        artifact_id=None):
      if gradle_target in cls._BEAM_SERVICES.replacements:
        return cls._BEAM_SERVICES.replacements[gradle_target]
    
      gradle_package = gradle_target.strip(':').rsplit(':', 1)[0]
      if not artifact_id:
        artifact_id = 'beam-' + gradle_package.replace(':', '-')
      project_root = os.path.sep.join(
          os.path.abspath(__file__).split(os.path.sep)[:-5])
      local_path = os.path.join(
          project_root,
          gradle_package.replace(':', os.path.sep),
          'build',
          'libs',
          cls.jar_name(
              artifact_id,
              version.replace('.dev', ''),
              classifier='SNAPSHOT',
              appendix=appendix))
      if os.path.exists(local_path):
        _LOGGER.info('Using pre-built snapshot at %s', local_path)
        return local_path
      elif '.dev' in version:
        # TODO: Attempt to use nightly snapshots?
>       raise RuntimeError(
            (
                '%s not found. '
                'Please build the server with \n  cd %s; ./gradlew %s') %
            (local_path, os.path.abspath(project_root), gradle_target))
E       RuntimeError: <https://ci-beam.apache.org/job/beam_PostCommit_XVR_Spark3/ws/src/sdks/java/extensions/sql/expansion-service/build/libs/beam-sdks-java-extensions-sql-expansion-service-2.51.0-SNAPSHOT.jar> not found. Please build the server with 
E         cd <https://ci-beam.apache.org/job/beam_PostCommit_XVR_Spark3/ws/src;> ./gradlew :sdks:java:extensions:sql:expansion-service:shadowJar

apache_beam/utils/subprocess_server.py:243: RuntimeError
_________________ SqlTransformTest.test_zetasql_generate_data __________________

self = <apache_beam.transforms.sql_test.SqlTransformTest testMethod=test_zetasql_generate_data>

    def test_zetasql_generate_data(self):
      with TestPipeline() as p:
>       out = p | SqlTransform(
            """SELECT
              CAST(1 AS INT64) AS `int`,
              CAST('foo' AS STRING) AS `str`,
              CAST(3.14  AS FLOAT64) AS `flt`""",
            dialect="zetasql")

apache_beam/transforms/sql_test.py:154: 
_ _ _ _ _ _ _ _ _ _ _ _ _ _ _ _ _ _ _ _ _ _ _ _ _ _ _ _ _ _ _ _ _ _ _ _ _ _ _ _ 
apache_beam/transforms/sql.py:86: in __init__
    expansion_service = expansion_service or BeamJarExpansionService(
apache_beam/transforms/external.py:983: in __init__
    path_to_jar = subprocess_server.JavaJarServer.path_to_beam_jar(
_ _ _ _ _ _ _ _ _ _ _ _ _ _ _ _ _ _ _ _ _ _ _ _ _ _ _ _ _ _ _ _ _ _ _ _ _ _ _ _ 

cls = <class 'apache_beam.utils.subprocess_server.JavaJarServer'>
gradle_target = ':sdks:java:extensions:sql:expansion-service:shadowJar'
appendix = None, version = '2.51.0.dev'
artifact_id = 'beam-sdks-java-extensions-sql-expansion-service'

    @classmethod
    def path_to_beam_jar(
        cls,
        gradle_target,
        appendix=None,
        version=beam_version,
        artifact_id=None):
      if gradle_target in cls._BEAM_SERVICES.replacements:
        return cls._BEAM_SERVICES.replacements[gradle_target]
    
      gradle_package = gradle_target.strip(':').rsplit(':', 1)[0]
      if not artifact_id:
        artifact_id = 'beam-' + gradle_package.replace(':', '-')
      project_root = os.path.sep.join(
          os.path.abspath(__file__).split(os.path.sep)[:-5])
      local_path = os.path.join(
          project_root,
          gradle_package.replace(':', os.path.sep),
          'build',
          'libs',
          cls.jar_name(
              artifact_id,
              version.replace('.dev', ''),
              classifier='SNAPSHOT',
              appendix=appendix))
      if os.path.exists(local_path):
        _LOGGER.info('Using pre-built snapshot at %s', local_path)
        return local_path
      elif '.dev' in version:
        # TODO: Attempt to use nightly snapshots?
>       raise RuntimeError(
            (
                '%s not found. '
                'Please build the server with \n  cd %s; ./gradlew %s') %
            (local_path, os.path.abspath(project_root), gradle_target))
E       RuntimeError: <https://ci-beam.apache.org/job/beam_PostCommit_XVR_Spark3/ws/src/sdks/java/extensions/sql/expansion-service/build/libs/beam-sdks-java-extensions-sql-expansion-service-2.51.0-SNAPSHOT.jar> not found. Please build the server with 
E         cd <https://ci-beam.apache.org/job/beam_PostCommit_XVR_Spark3/ws/src;> ./gradlew :sdks:java:extensions:sql:expansion-service:shadowJar

apache_beam/utils/subprocess_server.py:243: RuntimeError
=============================== warnings summary ===============================
../../build/gradleenv/1922375555/lib/python3.8/site-packages/hdfs/config.py:28
  <https://ci-beam.apache.org/job/beam_PostCommit_XVR_Spark3/ws/src/build/gradleenv/1922375555/lib/python3.8/site-packages/hdfs/config.py>:28: DeprecationWarning: the imp module is deprecated in favour of importlib; see the module's documentation for alternative uses
    from imp import load_source

../../build/gradleenv/1922375555/lib/python3.8/site-packages/google/rpc/__init__.py:18
  <https://ci-beam.apache.org/job/beam_PostCommit_XVR_Spark3/ws/src/build/gradleenv/1922375555/lib/python3.8/site-packages/google/rpc/__init__.py>:18: DeprecationWarning: pkg_resources is deprecated as an API. See https://setuptools.pypa.io/en/latest/pkg_resources.html
    import pkg_resources

../../build/gradleenv/1922375555/lib/python3.8/site-packages/pkg_resources/__init__.py:2871: 19 warnings
  <https://ci-beam.apache.org/job/beam_PostCommit_XVR_Spark3/ws/src/build/gradleenv/1922375555/lib/python3.8/site-packages/pkg_resources/__init__.py>:2871: DeprecationWarning: Deprecated call to `pkg_resources.declare_namespace('google')`.
  Implementing implicit namespace packages (as specified in PEP 420) is preferred to `pkg_resources.declare_namespace`. See https://setuptools.pypa.io/en/latest/references/keywords.html#keyword-namespace-packages
    declare_namespace(pkg)

../../build/gradleenv/1922375555/lib/python3.8/site-packages/pkg_resources/__init__.py:2871: 16 warnings
  <https://ci-beam.apache.org/job/beam_PostCommit_XVR_Spark3/ws/src/build/gradleenv/1922375555/lib/python3.8/site-packages/pkg_resources/__init__.py>:2871: DeprecationWarning: Deprecated call to `pkg_resources.declare_namespace('google.cloud')`.
  Implementing implicit namespace packages (as specified in PEP 420) is preferred to `pkg_resources.declare_namespace`. See https://setuptools.pypa.io/en/latest/references/keywords.html#keyword-namespace-packages
    declare_namespace(pkg)

../../build/gradleenv/1922375555/lib/python3.8/site-packages/pkg_resources/__init__.py:2350
../../build/gradleenv/1922375555/lib/python3.8/site-packages/pkg_resources/__init__.py:2350
../../build/gradleenv/1922375555/lib/python3.8/site-packages/pkg_resources/__init__.py:2350
../../build/gradleenv/1922375555/lib/python3.8/site-packages/pkg_resources/__init__.py:2350
  <https://ci-beam.apache.org/job/beam_PostCommit_XVR_Spark3/ws/src/build/gradleenv/1922375555/lib/python3.8/site-packages/pkg_resources/__init__.py>:2350: DeprecationWarning: Deprecated call to `pkg_resources.declare_namespace('google')`.
  Implementing implicit namespace packages (as specified in PEP 420) is preferred to `pkg_resources.declare_namespace`. See https://setuptools.pypa.io/en/latest/references/keywords.html#keyword-namespace-packages
    declare_namespace(parent)

../../build/gradleenv/1922375555/lib/python3.8/site-packages/pkg_resources/__init__.py:2871
  <https://ci-beam.apache.org/job/beam_PostCommit_XVR_Spark3/ws/src/build/gradleenv/1922375555/lib/python3.8/site-packages/pkg_resources/__init__.py>:2871: DeprecationWarning: Deprecated call to `pkg_resources.declare_namespace('google.logging')`.
  Implementing implicit namespace packages (as specified in PEP 420) is preferred to `pkg_resources.declare_namespace`. See https://setuptools.pypa.io/en/latest/references/keywords.html#keyword-namespace-packages
    declare_namespace(pkg)

../../build/gradleenv/1922375555/lib/python3.8/site-packages/pkg_resources/__init__.py:2871
  <https://ci-beam.apache.org/job/beam_PostCommit_XVR_Spark3/ws/src/build/gradleenv/1922375555/lib/python3.8/site-packages/pkg_resources/__init__.py>:2871: DeprecationWarning: Deprecated call to `pkg_resources.declare_namespace('google.iam')`.
  Implementing implicit namespace packages (as specified in PEP 420) is preferred to `pkg_resources.declare_namespace`. See https://setuptools.pypa.io/en/latest/references/keywords.html#keyword-namespace-packages
    declare_namespace(pkg)

../../build/gradleenv/1922375555/lib/python3.8/site-packages/google/rpc/__init__.py:20
  <https://ci-beam.apache.org/job/beam_PostCommit_XVR_Spark3/ws/src/build/gradleenv/1922375555/lib/python3.8/site-packages/google/rpc/__init__.py>:20: DeprecationWarning: Deprecated call to `pkg_resources.declare_namespace('google.rpc')`.
  Implementing implicit namespace packages (as specified in PEP 420) is preferred to `pkg_resources.declare_namespace`. See https://setuptools.pypa.io/en/latest/references/keywords.html#keyword-namespace-packages
    pkg_resources.declare_namespace(__name__)

-- Docs: https://docs.pytest.org/en/stable/how-to/capture-warnings.html
- generated xml file: <https://ci-beam.apache.org/job/beam_PostCommit_XVR_Spark3/ws/src/sdks/python/pytest_xlangSqlValidateRunner.xml> -
=========================== short test summary info ============================
FAILED apache_beam/transforms/sql_test.py::SqlTransformTest::test_agg - RuntimeError: <https://ci-beam.apache.org/job/beam_PostCommit_XVR_Spark3/ws/src/sdks/java/extensions/sql/expansion-service/build/libs/beam-sdks-java-extensions-sql-expansion-service-2.51.0-SNAPSHOT.jar> not found. Please build the server with 
  cd <https://ci-beam.apache.org/job/beam_PostCommit_XVR_Spark3/ws/src;> ./gradlew :sdks:java:extensions:sql:expansion-service:shadowJar
FAILED apache_beam/transforms/sql_test.py::SqlTransformTest::test_filter - RuntimeError: <https://ci-beam.apache.org/job/beam_PostCommit_XVR_Spark3/ws/src/sdks/java/extensions/sql/expansion-service/build/libs/beam-sdks-java-extensions-sql-expansion-service-2.51.0-SNAPSHOT.jar> not found. Please build the server with 
  cd <https://ci-beam.apache.org/job/beam_PostCommit_XVR_Spark3/ws/src;> ./gradlew :sdks:java:extensions:sql:expansion-service:shadowJar
FAILED apache_beam/transforms/sql_test.py::SqlTransformTest::test_generate_data - RuntimeError: <https://ci-beam.apache.org/job/beam_PostCommit_XVR_Spark3/ws/src/sdks/java/extensions/sql/expansion-service/build/libs/beam-sdks-java-extensions-sql-expansion-service-2.51.0-SNAPSHOT.jar> not found. Please build the server with 
  cd <https://ci-beam.apache.org/job/beam_PostCommit_XVR_Spark3/ws/src;> ./gradlew :sdks:java:extensions:sql:expansion-service:shadowJar
FAILED apache_beam/transforms/sql_test.py::SqlTransformTest::test_map - RuntimeError: <https://ci-beam.apache.org/job/beam_PostCommit_XVR_Spark3/ws/src/sdks/java/extensions/sql/expansion-service/build/libs/beam-sdks-java-extensions-sql-expansion-service-2.51.0-SNAPSHOT.jar> not found. Please build the server with 
  cd <https://ci-beam.apache.org/job/beam_PostCommit_XVR_Spark3/ws/src;> ./gradlew :sdks:java:extensions:sql:expansion-service:shadowJar
FAILED apache_beam/transforms/sql_test.py::SqlTransformTest::test_project - RuntimeError: <https://ci-beam.apache.org/job/beam_PostCommit_XVR_Spark3/ws/src/sdks/java/extensions/sql/expansion-service/build/libs/beam-sdks-java-extensions-sql-expansion-service-2.51.0-SNAPSHOT.jar> not found. Please build the server with 
  cd <https://ci-beam.apache.org/job/beam_PostCommit_XVR_Spark3/ws/src;> ./gradlew :sdks:java:extensions:sql:expansion-service:shadowJar
FAILED apache_beam/transforms/sql_test.py::SqlTransformTest::test_row - RuntimeError: <https://ci-beam.apache.org/job/beam_PostCommit_XVR_Spark3/ws/src/sdks/java/extensions/sql/expansion-service/build/libs/beam-sdks-java-extensions-sql-expansion-service-2.51.0-SNAPSHOT.jar> not found. Please build the server with 
  cd <https://ci-beam.apache.org/job/beam_PostCommit_XVR_Spark3/ws/src;> ./gradlew :sdks:java:extensions:sql:expansion-service:shadowJar
FAILED apache_beam/transforms/sql_test.py::SqlTransformTest::test_tagged_join - RuntimeError: <https://ci-beam.apache.org/job/beam_PostCommit_XVR_Spark3/ws/src/sdks/java/extensions/sql/expansion-service/build/libs/beam-sdks-java-extensions-sql-expansion-service-2.51.0-SNAPSHOT.jar> not found. Please build the server with 
  cd <https://ci-beam.apache.org/job/beam_PostCommit_XVR_Spark3/ws/src;> ./gradlew :sdks:java:extensions:sql:expansion-service:shadowJar
FAILED apache_beam/transforms/sql_test.py::SqlTransformTest::test_windowing_before_sql - RuntimeError: <https://ci-beam.apache.org/job/beam_PostCommit_XVR_Spark3/ws/src/sdks/java/extensions/sql/expansion-service/build/libs/beam-sdks-java-extensions-sql-expansion-service-2.51.0-SNAPSHOT.jar> not found. Please build the server with 
  cd <https://ci-beam.apache.org/job/beam_PostCommit_XVR_Spark3/ws/src;> ./gradlew :sdks:java:extensions:sql:expansion-service:shadowJar
FAILED apache_beam/transforms/sql_test.py::SqlTransformTest::test_zetasql_generate_data - RuntimeError: <https://ci-beam.apache.org/job/beam_PostCommit_XVR_Spark3/ws/src/sdks/java/extensions/sql/expansion-service/build/libs/beam-sdks-java-extensions-sql-expansion-service-2.51.0-SNAPSHOT.jar> not found. Please build the server with 
  cd <https://ci-beam.apache.org/job/beam_PostCommit_XVR_Spark3/ws/src;> ./gradlew :sdks:java:extensions:sql:expansion-service:shadowJar
========= 9 failed, 17 skipped, 7154 deselected, 44 warnings in 8.04s ==========

> Task :runners:spark:3:job-server:validatesCrossLanguageRunnerPythonUsingSql FAILED

> Task :runners:spark:3:job-server:sparkJobServerCleanup
Stopping job server pid: 1779126.

> Task :runners:spark:3:job-server:validatesCrossLanguageRunnerCleanup
Stopping expansion service pid: 1788845.
Stopping expansion service pid: 1788846.

FAILURE: Build failed with an exception.

* What went wrong:
Execution failed for task ':runners:spark:3:job-server:validatesCrossLanguageRunnerPythonUsingSql'.
> Process 'command 'sh'' finished with non-zero exit value 1

* Try:
> Run with --stacktrace option to get the stack trace.
> Run with --info or --debug option to get more log output.

* Get more help at https://help.gradle.org

Deprecated Gradle features were used in this build, making it incompatible with Gradle 8.0.

You can use '--warning-mode all' to show the individual deprecation warnings and determine if they come from your own scripts or plugins.

See https://docs.gradle.org/7.6.2/userguide/command_line_interface.html#sec:command_line_warnings

Execution optimizations have been disabled for 1 invalid unit(s) of work during this build to ensure correctness.
Please consult deprecation warnings for more details.

BUILD FAILED in 34m
274 actionable tasks: 182 executed, 80 from cache, 12 up-to-date

Publishing build scan...
https://ge.apache.org/s/ifbsf3ttixcji

Build step 'Invoke Gradle script' changed build result to FAILURE
Build step 'Invoke Gradle script' marked build as failure

---------------------------------------------------------------------
To unsubscribe, e-mail: builds-unsubscribe@beam.apache.org
For additional commands, e-mail: builds-help@beam.apache.org


Build failed in Jenkins: beam_PostCommit_XVR_Spark3 #3553

Posted by Apache Jenkins Server <je...@builds.apache.org>.
See <https://ci-beam.apache.org/job/beam_PostCommit_XVR_Spark3/3553/display/redirect>

Changes:


------------------------------------------
[...truncated 1.19 MB...]
      elif '.dev' in version:
        # TODO: Attempt to use nightly snapshots?
>       raise RuntimeError(
            (
                '%s not found. '
                'Please build the server with \n  cd %s; ./gradlew %s') %
            (local_path, os.path.abspath(project_root), gradle_target))
E       RuntimeError: <https://ci-beam.apache.org/job/beam_PostCommit_XVR_Spark3/ws/src/sdks/java/extensions/sql/expansion-service/build/libs/beam-sdks-java-extensions-sql-expansion-service-2.51.0-SNAPSHOT.jar> not found. Please build the server with 
E         cd <https://ci-beam.apache.org/job/beam_PostCommit_XVR_Spark3/ws/src;> ./gradlew :sdks:java:extensions:sql:expansion-service:shadowJar

apache_beam/utils/subprocess_server.py:243: RuntimeError
__________________ SqlTransformTest.test_windowing_before_sql __________________

self = <apache_beam.transforms.sql_test.SqlTransformTest testMethod=test_windowing_before_sql>

    def test_windowing_before_sql(self):
      with TestPipeline() as p:
        out = (
            p | beam.Create([
                SimpleRow(5, "foo", 1.),
                SimpleRow(15, "bar", 2.),
                SimpleRow(25, "baz", 3.)
            ])
            | beam.Map(lambda v: beam.window.TimestampedValue(v, v.id)).
            with_output_types(SimpleRow)
            | beam.WindowInto(
                beam.window.FixedWindows(10)).with_output_types(SimpleRow)
>           | SqlTransform("SELECT COUNT(*) as `count` FROM PCOLLECTION"))

apache_beam/transforms/sql_test.py:174: 
_ _ _ _ _ _ _ _ _ _ _ _ _ _ _ _ _ _ _ _ _ _ _ _ _ _ _ _ _ _ _ _ _ _ _ _ _ _ _ _ 
apache_beam/transforms/sql.py:86: in __init__
    expansion_service = expansion_service or BeamJarExpansionService(
apache_beam/transforms/external.py:983: in __init__
    path_to_jar = subprocess_server.JavaJarServer.path_to_beam_jar(
_ _ _ _ _ _ _ _ _ _ _ _ _ _ _ _ _ _ _ _ _ _ _ _ _ _ _ _ _ _ _ _ _ _ _ _ _ _ _ _ 

cls = <class 'apache_beam.utils.subprocess_server.JavaJarServer'>
gradle_target = ':sdks:java:extensions:sql:expansion-service:shadowJar'
appendix = None, version = '2.51.0.dev'
artifact_id = 'beam-sdks-java-extensions-sql-expansion-service'

    @classmethod
    def path_to_beam_jar(
        cls,
        gradle_target,
        appendix=None,
        version=beam_version,
        artifact_id=None):
      if gradle_target in cls._BEAM_SERVICES.replacements:
        return cls._BEAM_SERVICES.replacements[gradle_target]
    
      gradle_package = gradle_target.strip(':').rsplit(':', 1)[0]
      if not artifact_id:
        artifact_id = 'beam-' + gradle_package.replace(':', '-')
      project_root = os.path.sep.join(
          os.path.abspath(__file__).split(os.path.sep)[:-5])
      local_path = os.path.join(
          project_root,
          gradle_package.replace(':', os.path.sep),
          'build',
          'libs',
          cls.jar_name(
              artifact_id,
              version.replace('.dev', ''),
              classifier='SNAPSHOT',
              appendix=appendix))
      if os.path.exists(local_path):
        _LOGGER.info('Using pre-built snapshot at %s', local_path)
        return local_path
      elif '.dev' in version:
        # TODO: Attempt to use nightly snapshots?
>       raise RuntimeError(
            (
                '%s not found. '
                'Please build the server with \n  cd %s; ./gradlew %s') %
            (local_path, os.path.abspath(project_root), gradle_target))
E       RuntimeError: <https://ci-beam.apache.org/job/beam_PostCommit_XVR_Spark3/ws/src/sdks/java/extensions/sql/expansion-service/build/libs/beam-sdks-java-extensions-sql-expansion-service-2.51.0-SNAPSHOT.jar> not found. Please build the server with 
E         cd <https://ci-beam.apache.org/job/beam_PostCommit_XVR_Spark3/ws/src;> ./gradlew :sdks:java:extensions:sql:expansion-service:shadowJar

apache_beam/utils/subprocess_server.py:243: RuntimeError
_________________ SqlTransformTest.test_zetasql_generate_data __________________

self = <apache_beam.transforms.sql_test.SqlTransformTest testMethod=test_zetasql_generate_data>

    def test_zetasql_generate_data(self):
      with TestPipeline() as p:
>       out = p | SqlTransform(
            """SELECT
              CAST(1 AS INT64) AS `int`,
              CAST('foo' AS STRING) AS `str`,
              CAST(3.14  AS FLOAT64) AS `flt`""",
            dialect="zetasql")

apache_beam/transforms/sql_test.py:154: 
_ _ _ _ _ _ _ _ _ _ _ _ _ _ _ _ _ _ _ _ _ _ _ _ _ _ _ _ _ _ _ _ _ _ _ _ _ _ _ _ 
apache_beam/transforms/sql.py:86: in __init__
    expansion_service = expansion_service or BeamJarExpansionService(
apache_beam/transforms/external.py:983: in __init__
    path_to_jar = subprocess_server.JavaJarServer.path_to_beam_jar(
_ _ _ _ _ _ _ _ _ _ _ _ _ _ _ _ _ _ _ _ _ _ _ _ _ _ _ _ _ _ _ _ _ _ _ _ _ _ _ _ 

cls = <class 'apache_beam.utils.subprocess_server.JavaJarServer'>
gradle_target = ':sdks:java:extensions:sql:expansion-service:shadowJar'
appendix = None, version = '2.51.0.dev'
artifact_id = 'beam-sdks-java-extensions-sql-expansion-service'

    @classmethod
    def path_to_beam_jar(
        cls,
        gradle_target,
        appendix=None,
        version=beam_version,
        artifact_id=None):
      if gradle_target in cls._BEAM_SERVICES.replacements:
        return cls._BEAM_SERVICES.replacements[gradle_target]
    
      gradle_package = gradle_target.strip(':').rsplit(':', 1)[0]
      if not artifact_id:
        artifact_id = 'beam-' + gradle_package.replace(':', '-')
      project_root = os.path.sep.join(
          os.path.abspath(__file__).split(os.path.sep)[:-5])
      local_path = os.path.join(
          project_root,
          gradle_package.replace(':', os.path.sep),
          'build',
          'libs',
          cls.jar_name(
              artifact_id,
              version.replace('.dev', ''),
              classifier='SNAPSHOT',
              appendix=appendix))
      if os.path.exists(local_path):
        _LOGGER.info('Using pre-built snapshot at %s', local_path)
        return local_path
      elif '.dev' in version:
        # TODO: Attempt to use nightly snapshots?
>       raise RuntimeError(
            (
                '%s not found. '
                'Please build the server with \n  cd %s; ./gradlew %s') %
            (local_path, os.path.abspath(project_root), gradle_target))
E       RuntimeError: <https://ci-beam.apache.org/job/beam_PostCommit_XVR_Spark3/ws/src/sdks/java/extensions/sql/expansion-service/build/libs/beam-sdks-java-extensions-sql-expansion-service-2.51.0-SNAPSHOT.jar> not found. Please build the server with 
E         cd <https://ci-beam.apache.org/job/beam_PostCommit_XVR_Spark3/ws/src;> ./gradlew :sdks:java:extensions:sql:expansion-service:shadowJar

apache_beam/utils/subprocess_server.py:243: RuntimeError
=============================== warnings summary ===============================
../../build/gradleenv/1922375555/lib/python3.8/site-packages/hdfs/config.py:28
  <https://ci-beam.apache.org/job/beam_PostCommit_XVR_Spark3/ws/src/build/gradleenv/1922375555/lib/python3.8/site-packages/hdfs/config.py>:28: DeprecationWarning: the imp module is deprecated in favour of importlib; see the module's documentation for alternative uses
    from imp import load_source

../../build/gradleenv/1922375555/lib/python3.8/site-packages/google/rpc/__init__.py:18
  <https://ci-beam.apache.org/job/beam_PostCommit_XVR_Spark3/ws/src/build/gradleenv/1922375555/lib/python3.8/site-packages/google/rpc/__init__.py>:18: DeprecationWarning: pkg_resources is deprecated as an API. See https://setuptools.pypa.io/en/latest/pkg_resources.html
    import pkg_resources

../../build/gradleenv/1922375555/lib/python3.8/site-packages/pkg_resources/__init__.py:2871: 19 warnings
  <https://ci-beam.apache.org/job/beam_PostCommit_XVR_Spark3/ws/src/build/gradleenv/1922375555/lib/python3.8/site-packages/pkg_resources/__init__.py>:2871: DeprecationWarning: Deprecated call to `pkg_resources.declare_namespace('google')`.
  Implementing implicit namespace packages (as specified in PEP 420) is preferred to `pkg_resources.declare_namespace`. See https://setuptools.pypa.io/en/latest/references/keywords.html#keyword-namespace-packages
    declare_namespace(pkg)

../../build/gradleenv/1922375555/lib/python3.8/site-packages/pkg_resources/__init__.py:2871: 16 warnings
  <https://ci-beam.apache.org/job/beam_PostCommit_XVR_Spark3/ws/src/build/gradleenv/1922375555/lib/python3.8/site-packages/pkg_resources/__init__.py>:2871: DeprecationWarning: Deprecated call to `pkg_resources.declare_namespace('google.cloud')`.
  Implementing implicit namespace packages (as specified in PEP 420) is preferred to `pkg_resources.declare_namespace`. See https://setuptools.pypa.io/en/latest/references/keywords.html#keyword-namespace-packages
    declare_namespace(pkg)

../../build/gradleenv/1922375555/lib/python3.8/site-packages/pkg_resources/__init__.py:2350
../../build/gradleenv/1922375555/lib/python3.8/site-packages/pkg_resources/__init__.py:2350
../../build/gradleenv/1922375555/lib/python3.8/site-packages/pkg_resources/__init__.py:2350
../../build/gradleenv/1922375555/lib/python3.8/site-packages/pkg_resources/__init__.py:2350
  <https://ci-beam.apache.org/job/beam_PostCommit_XVR_Spark3/ws/src/build/gradleenv/1922375555/lib/python3.8/site-packages/pkg_resources/__init__.py>:2350: DeprecationWarning: Deprecated call to `pkg_resources.declare_namespace('google')`.
  Implementing implicit namespace packages (as specified in PEP 420) is preferred to `pkg_resources.declare_namespace`. See https://setuptools.pypa.io/en/latest/references/keywords.html#keyword-namespace-packages
    declare_namespace(parent)

../../build/gradleenv/1922375555/lib/python3.8/site-packages/pkg_resources/__init__.py:2871
  <https://ci-beam.apache.org/job/beam_PostCommit_XVR_Spark3/ws/src/build/gradleenv/1922375555/lib/python3.8/site-packages/pkg_resources/__init__.py>:2871: DeprecationWarning: Deprecated call to `pkg_resources.declare_namespace('google.logging')`.
  Implementing implicit namespace packages (as specified in PEP 420) is preferred to `pkg_resources.declare_namespace`. See https://setuptools.pypa.io/en/latest/references/keywords.html#keyword-namespace-packages
    declare_namespace(pkg)

../../build/gradleenv/1922375555/lib/python3.8/site-packages/pkg_resources/__init__.py:2871
  <https://ci-beam.apache.org/job/beam_PostCommit_XVR_Spark3/ws/src/build/gradleenv/1922375555/lib/python3.8/site-packages/pkg_resources/__init__.py>:2871: DeprecationWarning: Deprecated call to `pkg_resources.declare_namespace('google.iam')`.
  Implementing implicit namespace packages (as specified in PEP 420) is preferred to `pkg_resources.declare_namespace`. See https://setuptools.pypa.io/en/latest/references/keywords.html#keyword-namespace-packages
    declare_namespace(pkg)

../../build/gradleenv/1922375555/lib/python3.8/site-packages/google/rpc/__init__.py:20
  <https://ci-beam.apache.org/job/beam_PostCommit_XVR_Spark3/ws/src/build/gradleenv/1922375555/lib/python3.8/site-packages/google/rpc/__init__.py>:20: DeprecationWarning: Deprecated call to `pkg_resources.declare_namespace('google.rpc')`.
  Implementing implicit namespace packages (as specified in PEP 420) is preferred to `pkg_resources.declare_namespace`. See https://setuptools.pypa.io/en/latest/references/keywords.html#keyword-namespace-packages
    pkg_resources.declare_namespace(__name__)

-- Docs: https://docs.pytest.org/en/stable/how-to/capture-warnings.html
- generated xml file: <https://ci-beam.apache.org/job/beam_PostCommit_XVR_Spark3/ws/src/sdks/python/pytest_xlangSqlValidateRunner.xml> -
=========================== short test summary info ============================
FAILED apache_beam/transforms/sql_test.py::SqlTransformTest::test_agg - RuntimeError: <https://ci-beam.apache.org/job/beam_PostCommit_XVR_Spark3/ws/src/sdks/java/extensions/sql/expansion-service/build/libs/beam-sdks-java-extensions-sql-expansion-service-2.51.0-SNAPSHOT.jar> not found. Please build the server with 
  cd <https://ci-beam.apache.org/job/beam_PostCommit_XVR_Spark3/ws/src;> ./gradlew :sdks:java:extensions:sql:expansion-service:shadowJar
FAILED apache_beam/transforms/sql_test.py::SqlTransformTest::test_filter - RuntimeError: <https://ci-beam.apache.org/job/beam_PostCommit_XVR_Spark3/ws/src/sdks/java/extensions/sql/expansion-service/build/libs/beam-sdks-java-extensions-sql-expansion-service-2.51.0-SNAPSHOT.jar> not found. Please build the server with 
  cd <https://ci-beam.apache.org/job/beam_PostCommit_XVR_Spark3/ws/src;> ./gradlew :sdks:java:extensions:sql:expansion-service:shadowJar
FAILED apache_beam/transforms/sql_test.py::SqlTransformTest::test_generate_data - RuntimeError: <https://ci-beam.apache.org/job/beam_PostCommit_XVR_Spark3/ws/src/sdks/java/extensions/sql/expansion-service/build/libs/beam-sdks-java-extensions-sql-expansion-service-2.51.0-SNAPSHOT.jar> not found. Please build the server with 
  cd <https://ci-beam.apache.org/job/beam_PostCommit_XVR_Spark3/ws/src;> ./gradlew :sdks:java:extensions:sql:expansion-service:shadowJar
FAILED apache_beam/transforms/sql_test.py::SqlTransformTest::test_map - RuntimeError: <https://ci-beam.apache.org/job/beam_PostCommit_XVR_Spark3/ws/src/sdks/java/extensions/sql/expansion-service/build/libs/beam-sdks-java-extensions-sql-expansion-service-2.51.0-SNAPSHOT.jar> not found. Please build the server with 
  cd <https://ci-beam.apache.org/job/beam_PostCommit_XVR_Spark3/ws/src;> ./gradlew :sdks:java:extensions:sql:expansion-service:shadowJar
FAILED apache_beam/transforms/sql_test.py::SqlTransformTest::test_project - RuntimeError: <https://ci-beam.apache.org/job/beam_PostCommit_XVR_Spark3/ws/src/sdks/java/extensions/sql/expansion-service/build/libs/beam-sdks-java-extensions-sql-expansion-service-2.51.0-SNAPSHOT.jar> not found. Please build the server with 
  cd <https://ci-beam.apache.org/job/beam_PostCommit_XVR_Spark3/ws/src;> ./gradlew :sdks:java:extensions:sql:expansion-service:shadowJar
FAILED apache_beam/transforms/sql_test.py::SqlTransformTest::test_row - RuntimeError: <https://ci-beam.apache.org/job/beam_PostCommit_XVR_Spark3/ws/src/sdks/java/extensions/sql/expansion-service/build/libs/beam-sdks-java-extensions-sql-expansion-service-2.51.0-SNAPSHOT.jar> not found. Please build the server with 
  cd <https://ci-beam.apache.org/job/beam_PostCommit_XVR_Spark3/ws/src;> ./gradlew :sdks:java:extensions:sql:expansion-service:shadowJar
FAILED apache_beam/transforms/sql_test.py::SqlTransformTest::test_tagged_join - RuntimeError: <https://ci-beam.apache.org/job/beam_PostCommit_XVR_Spark3/ws/src/sdks/java/extensions/sql/expansion-service/build/libs/beam-sdks-java-extensions-sql-expansion-service-2.51.0-SNAPSHOT.jar> not found. Please build the server with 
  cd <https://ci-beam.apache.org/job/beam_PostCommit_XVR_Spark3/ws/src;> ./gradlew :sdks:java:extensions:sql:expansion-service:shadowJar
FAILED apache_beam/transforms/sql_test.py::SqlTransformTest::test_windowing_before_sql - RuntimeError: <https://ci-beam.apache.org/job/beam_PostCommit_XVR_Spark3/ws/src/sdks/java/extensions/sql/expansion-service/build/libs/beam-sdks-java-extensions-sql-expansion-service-2.51.0-SNAPSHOT.jar> not found. Please build the server with 
  cd <https://ci-beam.apache.org/job/beam_PostCommit_XVR_Spark3/ws/src;> ./gradlew :sdks:java:extensions:sql:expansion-service:shadowJar
FAILED apache_beam/transforms/sql_test.py::SqlTransformTest::test_zetasql_generate_data - RuntimeError: <https://ci-beam.apache.org/job/beam_PostCommit_XVR_Spark3/ws/src/sdks/java/extensions/sql/expansion-service/build/libs/beam-sdks-java-extensions-sql-expansion-service-2.51.0-SNAPSHOT.jar> not found. Please build the server with 
  cd <https://ci-beam.apache.org/job/beam_PostCommit_XVR_Spark3/ws/src;> ./gradlew :sdks:java:extensions:sql:expansion-service:shadowJar
========= 9 failed, 17 skipped, 7154 deselected, 44 warnings in 7.69s ==========

> Task :runners:spark:3:job-server:validatesCrossLanguageRunnerPythonUsingSql FAILED

> Task :runners:spark:3:job-server:sparkJobServerCleanup
Stopping job server pid: 1326160.

> Task :runners:spark:3:job-server:validatesCrossLanguageRunnerCleanup
Stopping expansion service pid: 1332158.
Stopping expansion service pid: 1332159.

FAILURE: Build failed with an exception.

* What went wrong:
Execution failed for task ':runners:spark:3:job-server:validatesCrossLanguageRunnerPythonUsingSql'.
> Process 'command 'sh'' finished with non-zero exit value 1

* Try:
> Run with --stacktrace option to get the stack trace.
> Run with --info or --debug option to get more log output.

* Get more help at https://help.gradle.org

Deprecated Gradle features were used in this build, making it incompatible with Gradle 8.0.

You can use '--warning-mode all' to show the individual deprecation warnings and determine if they come from your own scripts or plugins.

See https://docs.gradle.org/7.6.2/userguide/command_line_interface.html#sec:command_line_warnings

Execution optimizations have been disabled for 1 invalid unit(s) of work during this build to ensure correctness.
Please consult deprecation warnings for more details.

BUILD FAILED in 29m 4s
274 actionable tasks: 178 executed, 84 from cache, 12 up-to-date

Publishing build scan...
https://ge.apache.org/s/j5d2di3vvrwde

Build step 'Invoke Gradle script' changed build result to FAILURE
Build step 'Invoke Gradle script' marked build as failure

---------------------------------------------------------------------
To unsubscribe, e-mail: builds-unsubscribe@beam.apache.org
For additional commands, e-mail: builds-help@beam.apache.org


Build failed in Jenkins: beam_PostCommit_XVR_Spark3 #3552

Posted by Apache Jenkins Server <je...@builds.apache.org>.
See <https://ci-beam.apache.org/job/beam_PostCommit_XVR_Spark3/3552/display/redirect>

Changes:


------------------------------------------
[...truncated 1.19 MB...]
      elif '.dev' in version:
        # TODO: Attempt to use nightly snapshots?
>       raise RuntimeError(
            (
                '%s not found. '
                'Please build the server with \n  cd %s; ./gradlew %s') %
            (local_path, os.path.abspath(project_root), gradle_target))
E       RuntimeError: <https://ci-beam.apache.org/job/beam_PostCommit_XVR_Spark3/ws/src/sdks/java/extensions/sql/expansion-service/build/libs/beam-sdks-java-extensions-sql-expansion-service-2.51.0-SNAPSHOT.jar> not found. Please build the server with 
E         cd <https://ci-beam.apache.org/job/beam_PostCommit_XVR_Spark3/ws/src;> ./gradlew :sdks:java:extensions:sql:expansion-service:shadowJar

apache_beam/utils/subprocess_server.py:243: RuntimeError
__________________ SqlTransformTest.test_windowing_before_sql __________________

self = <apache_beam.transforms.sql_test.SqlTransformTest testMethod=test_windowing_before_sql>

    def test_windowing_before_sql(self):
      with TestPipeline() as p:
        out = (
            p | beam.Create([
                SimpleRow(5, "foo", 1.),
                SimpleRow(15, "bar", 2.),
                SimpleRow(25, "baz", 3.)
            ])
            | beam.Map(lambda v: beam.window.TimestampedValue(v, v.id)).
            with_output_types(SimpleRow)
            | beam.WindowInto(
                beam.window.FixedWindows(10)).with_output_types(SimpleRow)
>           | SqlTransform("SELECT COUNT(*) as `count` FROM PCOLLECTION"))

apache_beam/transforms/sql_test.py:174: 
_ _ _ _ _ _ _ _ _ _ _ _ _ _ _ _ _ _ _ _ _ _ _ _ _ _ _ _ _ _ _ _ _ _ _ _ _ _ _ _ 
apache_beam/transforms/sql.py:86: in __init__
    expansion_service = expansion_service or BeamJarExpansionService(
apache_beam/transforms/external.py:983: in __init__
    path_to_jar = subprocess_server.JavaJarServer.path_to_beam_jar(
_ _ _ _ _ _ _ _ _ _ _ _ _ _ _ _ _ _ _ _ _ _ _ _ _ _ _ _ _ _ _ _ _ _ _ _ _ _ _ _ 

cls = <class 'apache_beam.utils.subprocess_server.JavaJarServer'>
gradle_target = ':sdks:java:extensions:sql:expansion-service:shadowJar'
appendix = None, version = '2.51.0.dev'
artifact_id = 'beam-sdks-java-extensions-sql-expansion-service'

    @classmethod
    def path_to_beam_jar(
        cls,
        gradle_target,
        appendix=None,
        version=beam_version,
        artifact_id=None):
      if gradle_target in cls._BEAM_SERVICES.replacements:
        return cls._BEAM_SERVICES.replacements[gradle_target]
    
      gradle_package = gradle_target.strip(':').rsplit(':', 1)[0]
      if not artifact_id:
        artifact_id = 'beam-' + gradle_package.replace(':', '-')
      project_root = os.path.sep.join(
          os.path.abspath(__file__).split(os.path.sep)[:-5])
      local_path = os.path.join(
          project_root,
          gradle_package.replace(':', os.path.sep),
          'build',
          'libs',
          cls.jar_name(
              artifact_id,
              version.replace('.dev', ''),
              classifier='SNAPSHOT',
              appendix=appendix))
      if os.path.exists(local_path):
        _LOGGER.info('Using pre-built snapshot at %s', local_path)
        return local_path
      elif '.dev' in version:
        # TODO: Attempt to use nightly snapshots?
>       raise RuntimeError(
            (
                '%s not found. '
                'Please build the server with \n  cd %s; ./gradlew %s') %
            (local_path, os.path.abspath(project_root), gradle_target))
E       RuntimeError: <https://ci-beam.apache.org/job/beam_PostCommit_XVR_Spark3/ws/src/sdks/java/extensions/sql/expansion-service/build/libs/beam-sdks-java-extensions-sql-expansion-service-2.51.0-SNAPSHOT.jar> not found. Please build the server with 
E         cd <https://ci-beam.apache.org/job/beam_PostCommit_XVR_Spark3/ws/src;> ./gradlew :sdks:java:extensions:sql:expansion-service:shadowJar

apache_beam/utils/subprocess_server.py:243: RuntimeError
_________________ SqlTransformTest.test_zetasql_generate_data __________________

self = <apache_beam.transforms.sql_test.SqlTransformTest testMethod=test_zetasql_generate_data>

    def test_zetasql_generate_data(self):
      with TestPipeline() as p:
>       out = p | SqlTransform(
            """SELECT
              CAST(1 AS INT64) AS `int`,
              CAST('foo' AS STRING) AS `str`,
              CAST(3.14  AS FLOAT64) AS `flt`""",
            dialect="zetasql")

apache_beam/transforms/sql_test.py:154: 
_ _ _ _ _ _ _ _ _ _ _ _ _ _ _ _ _ _ _ _ _ _ _ _ _ _ _ _ _ _ _ _ _ _ _ _ _ _ _ _ 
apache_beam/transforms/sql.py:86: in __init__
    expansion_service = expansion_service or BeamJarExpansionService(
apache_beam/transforms/external.py:983: in __init__
    path_to_jar = subprocess_server.JavaJarServer.path_to_beam_jar(
_ _ _ _ _ _ _ _ _ _ _ _ _ _ _ _ _ _ _ _ _ _ _ _ _ _ _ _ _ _ _ _ _ _ _ _ _ _ _ _ 

cls = <class 'apache_beam.utils.subprocess_server.JavaJarServer'>
gradle_target = ':sdks:java:extensions:sql:expansion-service:shadowJar'
appendix = None, version = '2.51.0.dev'
artifact_id = 'beam-sdks-java-extensions-sql-expansion-service'

    @classmethod
    def path_to_beam_jar(
        cls,
        gradle_target,
        appendix=None,
        version=beam_version,
        artifact_id=None):
      if gradle_target in cls._BEAM_SERVICES.replacements:
        return cls._BEAM_SERVICES.replacements[gradle_target]
    
      gradle_package = gradle_target.strip(':').rsplit(':', 1)[0]
      if not artifact_id:
        artifact_id = 'beam-' + gradle_package.replace(':', '-')
      project_root = os.path.sep.join(
          os.path.abspath(__file__).split(os.path.sep)[:-5])
      local_path = os.path.join(
          project_root,
          gradle_package.replace(':', os.path.sep),
          'build',
          'libs',
          cls.jar_name(
              artifact_id,
              version.replace('.dev', ''),
              classifier='SNAPSHOT',
              appendix=appendix))
      if os.path.exists(local_path):
        _LOGGER.info('Using pre-built snapshot at %s', local_path)
        return local_path
      elif '.dev' in version:
        # TODO: Attempt to use nightly snapshots?
>       raise RuntimeError(
            (
                '%s not found. '
                'Please build the server with \n  cd %s; ./gradlew %s') %
            (local_path, os.path.abspath(project_root), gradle_target))
E       RuntimeError: <https://ci-beam.apache.org/job/beam_PostCommit_XVR_Spark3/ws/src/sdks/java/extensions/sql/expansion-service/build/libs/beam-sdks-java-extensions-sql-expansion-service-2.51.0-SNAPSHOT.jar> not found. Please build the server with 
E         cd <https://ci-beam.apache.org/job/beam_PostCommit_XVR_Spark3/ws/src;> ./gradlew :sdks:java:extensions:sql:expansion-service:shadowJar

apache_beam/utils/subprocess_server.py:243: RuntimeError
=============================== warnings summary ===============================
../../build/gradleenv/1922375555/lib/python3.8/site-packages/hdfs/config.py:28
  <https://ci-beam.apache.org/job/beam_PostCommit_XVR_Spark3/ws/src/build/gradleenv/1922375555/lib/python3.8/site-packages/hdfs/config.py>:28: DeprecationWarning: the imp module is deprecated in favour of importlib; see the module's documentation for alternative uses
    from imp import load_source

../../build/gradleenv/1922375555/lib/python3.8/site-packages/google/rpc/__init__.py:18
  <https://ci-beam.apache.org/job/beam_PostCommit_XVR_Spark3/ws/src/build/gradleenv/1922375555/lib/python3.8/site-packages/google/rpc/__init__.py>:18: DeprecationWarning: pkg_resources is deprecated as an API. See https://setuptools.pypa.io/en/latest/pkg_resources.html
    import pkg_resources

../../build/gradleenv/1922375555/lib/python3.8/site-packages/pkg_resources/__init__.py:2871: 19 warnings
  <https://ci-beam.apache.org/job/beam_PostCommit_XVR_Spark3/ws/src/build/gradleenv/1922375555/lib/python3.8/site-packages/pkg_resources/__init__.py>:2871: DeprecationWarning: Deprecated call to `pkg_resources.declare_namespace('google')`.
  Implementing implicit namespace packages (as specified in PEP 420) is preferred to `pkg_resources.declare_namespace`. See https://setuptools.pypa.io/en/latest/references/keywords.html#keyword-namespace-packages
    declare_namespace(pkg)

../../build/gradleenv/1922375555/lib/python3.8/site-packages/pkg_resources/__init__.py:2871: 16 warnings
  <https://ci-beam.apache.org/job/beam_PostCommit_XVR_Spark3/ws/src/build/gradleenv/1922375555/lib/python3.8/site-packages/pkg_resources/__init__.py>:2871: DeprecationWarning: Deprecated call to `pkg_resources.declare_namespace('google.cloud')`.
  Implementing implicit namespace packages (as specified in PEP 420) is preferred to `pkg_resources.declare_namespace`. See https://setuptools.pypa.io/en/latest/references/keywords.html#keyword-namespace-packages
    declare_namespace(pkg)

../../build/gradleenv/1922375555/lib/python3.8/site-packages/pkg_resources/__init__.py:2350
../../build/gradleenv/1922375555/lib/python3.8/site-packages/pkg_resources/__init__.py:2350
../../build/gradleenv/1922375555/lib/python3.8/site-packages/pkg_resources/__init__.py:2350
../../build/gradleenv/1922375555/lib/python3.8/site-packages/pkg_resources/__init__.py:2350
  <https://ci-beam.apache.org/job/beam_PostCommit_XVR_Spark3/ws/src/build/gradleenv/1922375555/lib/python3.8/site-packages/pkg_resources/__init__.py>:2350: DeprecationWarning: Deprecated call to `pkg_resources.declare_namespace('google')`.
  Implementing implicit namespace packages (as specified in PEP 420) is preferred to `pkg_resources.declare_namespace`. See https://setuptools.pypa.io/en/latest/references/keywords.html#keyword-namespace-packages
    declare_namespace(parent)

../../build/gradleenv/1922375555/lib/python3.8/site-packages/pkg_resources/__init__.py:2871
  <https://ci-beam.apache.org/job/beam_PostCommit_XVR_Spark3/ws/src/build/gradleenv/1922375555/lib/python3.8/site-packages/pkg_resources/__init__.py>:2871: DeprecationWarning: Deprecated call to `pkg_resources.declare_namespace('google.logging')`.
  Implementing implicit namespace packages (as specified in PEP 420) is preferred to `pkg_resources.declare_namespace`. See https://setuptools.pypa.io/en/latest/references/keywords.html#keyword-namespace-packages
    declare_namespace(pkg)

../../build/gradleenv/1922375555/lib/python3.8/site-packages/pkg_resources/__init__.py:2871
  <https://ci-beam.apache.org/job/beam_PostCommit_XVR_Spark3/ws/src/build/gradleenv/1922375555/lib/python3.8/site-packages/pkg_resources/__init__.py>:2871: DeprecationWarning: Deprecated call to `pkg_resources.declare_namespace('google.iam')`.
  Implementing implicit namespace packages (as specified in PEP 420) is preferred to `pkg_resources.declare_namespace`. See https://setuptools.pypa.io/en/latest/references/keywords.html#keyword-namespace-packages
    declare_namespace(pkg)

../../build/gradleenv/1922375555/lib/python3.8/site-packages/google/rpc/__init__.py:20
  <https://ci-beam.apache.org/job/beam_PostCommit_XVR_Spark3/ws/src/build/gradleenv/1922375555/lib/python3.8/site-packages/google/rpc/__init__.py>:20: DeprecationWarning: Deprecated call to `pkg_resources.declare_namespace('google.rpc')`.
  Implementing implicit namespace packages (as specified in PEP 420) is preferred to `pkg_resources.declare_namespace`. See https://setuptools.pypa.io/en/latest/references/keywords.html#keyword-namespace-packages
    pkg_resources.declare_namespace(__name__)

-- Docs: https://docs.pytest.org/en/stable/how-to/capture-warnings.html
- generated xml file: <https://ci-beam.apache.org/job/beam_PostCommit_XVR_Spark3/ws/src/sdks/python/pytest_xlangSqlValidateRunner.xml> -
=========================== short test summary info ============================
FAILED apache_beam/transforms/sql_test.py::SqlTransformTest::test_agg - RuntimeError: <https://ci-beam.apache.org/job/beam_PostCommit_XVR_Spark3/ws/src/sdks/java/extensions/sql/expansion-service/build/libs/beam-sdks-java-extensions-sql-expansion-service-2.51.0-SNAPSHOT.jar> not found. Please build the server with 
  cd <https://ci-beam.apache.org/job/beam_PostCommit_XVR_Spark3/ws/src;> ./gradlew :sdks:java:extensions:sql:expansion-service:shadowJar
FAILED apache_beam/transforms/sql_test.py::SqlTransformTest::test_filter - RuntimeError: <https://ci-beam.apache.org/job/beam_PostCommit_XVR_Spark3/ws/src/sdks/java/extensions/sql/expansion-service/build/libs/beam-sdks-java-extensions-sql-expansion-service-2.51.0-SNAPSHOT.jar> not found. Please build the server with 
  cd <https://ci-beam.apache.org/job/beam_PostCommit_XVR_Spark3/ws/src;> ./gradlew :sdks:java:extensions:sql:expansion-service:shadowJar
FAILED apache_beam/transforms/sql_test.py::SqlTransformTest::test_generate_data - RuntimeError: <https://ci-beam.apache.org/job/beam_PostCommit_XVR_Spark3/ws/src/sdks/java/extensions/sql/expansion-service/build/libs/beam-sdks-java-extensions-sql-expansion-service-2.51.0-SNAPSHOT.jar> not found. Please build the server with 
  cd <https://ci-beam.apache.org/job/beam_PostCommit_XVR_Spark3/ws/src;> ./gradlew :sdks:java:extensions:sql:expansion-service:shadowJar
FAILED apache_beam/transforms/sql_test.py::SqlTransformTest::test_map - RuntimeError: <https://ci-beam.apache.org/job/beam_PostCommit_XVR_Spark3/ws/src/sdks/java/extensions/sql/expansion-service/build/libs/beam-sdks-java-extensions-sql-expansion-service-2.51.0-SNAPSHOT.jar> not found. Please build the server with 
  cd <https://ci-beam.apache.org/job/beam_PostCommit_XVR_Spark3/ws/src;> ./gradlew :sdks:java:extensions:sql:expansion-service:shadowJar
FAILED apache_beam/transforms/sql_test.py::SqlTransformTest::test_project - RuntimeError: <https://ci-beam.apache.org/job/beam_PostCommit_XVR_Spark3/ws/src/sdks/java/extensions/sql/expansion-service/build/libs/beam-sdks-java-extensions-sql-expansion-service-2.51.0-SNAPSHOT.jar> not found. Please build the server with 
  cd <https://ci-beam.apache.org/job/beam_PostCommit_XVR_Spark3/ws/src;> ./gradlew :sdks:java:extensions:sql:expansion-service:shadowJar
FAILED apache_beam/transforms/sql_test.py::SqlTransformTest::test_row - RuntimeError: <https://ci-beam.apache.org/job/beam_PostCommit_XVR_Spark3/ws/src/sdks/java/extensions/sql/expansion-service/build/libs/beam-sdks-java-extensions-sql-expansion-service-2.51.0-SNAPSHOT.jar> not found. Please build the server with 
  cd <https://ci-beam.apache.org/job/beam_PostCommit_XVR_Spark3/ws/src;> ./gradlew :sdks:java:extensions:sql:expansion-service:shadowJar
FAILED apache_beam/transforms/sql_test.py::SqlTransformTest::test_tagged_join - RuntimeError: <https://ci-beam.apache.org/job/beam_PostCommit_XVR_Spark3/ws/src/sdks/java/extensions/sql/expansion-service/build/libs/beam-sdks-java-extensions-sql-expansion-service-2.51.0-SNAPSHOT.jar> not found. Please build the server with 
  cd <https://ci-beam.apache.org/job/beam_PostCommit_XVR_Spark3/ws/src;> ./gradlew :sdks:java:extensions:sql:expansion-service:shadowJar
FAILED apache_beam/transforms/sql_test.py::SqlTransformTest::test_windowing_before_sql - RuntimeError: <https://ci-beam.apache.org/job/beam_PostCommit_XVR_Spark3/ws/src/sdks/java/extensions/sql/expansion-service/build/libs/beam-sdks-java-extensions-sql-expansion-service-2.51.0-SNAPSHOT.jar> not found. Please build the server with 
  cd <https://ci-beam.apache.org/job/beam_PostCommit_XVR_Spark3/ws/src;> ./gradlew :sdks:java:extensions:sql:expansion-service:shadowJar
FAILED apache_beam/transforms/sql_test.py::SqlTransformTest::test_zetasql_generate_data - RuntimeError: <https://ci-beam.apache.org/job/beam_PostCommit_XVR_Spark3/ws/src/sdks/java/extensions/sql/expansion-service/build/libs/beam-sdks-java-extensions-sql-expansion-service-2.51.0-SNAPSHOT.jar> not found. Please build the server with 
  cd <https://ci-beam.apache.org/job/beam_PostCommit_XVR_Spark3/ws/src;> ./gradlew :sdks:java:extensions:sql:expansion-service:shadowJar
========= 9 failed, 17 skipped, 7154 deselected, 44 warnings in 8.99s ==========

> Task :runners:spark:3:job-server:validatesCrossLanguageRunnerPythonUsingSql FAILED

> Task :runners:spark:3:job-server:sparkJobServerCleanup
Stopping job server pid: 1101956.

> Task :runners:spark:3:job-server:validatesCrossLanguageRunnerCleanup
Stopping expansion service pid: 1108153.
Stopping expansion service pid: 1108154.

FAILURE: Build failed with an exception.

* What went wrong:
Execution failed for task ':runners:spark:3:job-server:validatesCrossLanguageRunnerPythonUsingSql'.
> Process 'command 'sh'' finished with non-zero exit value 1

* Try:
> Run with --stacktrace option to get the stack trace.
> Run with --info or --debug option to get more log output.

* Get more help at https://help.gradle.org

Deprecated Gradle features were used in this build, making it incompatible with Gradle 8.0.

You can use '--warning-mode all' to show the individual deprecation warnings and determine if they come from your own scripts or plugins.

See https://docs.gradle.org/7.6.2/userguide/command_line_interface.html#sec:command_line_warnings

Execution optimizations have been disabled for 1 invalid unit(s) of work during this build to ensure correctness.
Please consult deprecation warnings for more details.

BUILD FAILED in 30m 18s
274 actionable tasks: 178 executed, 84 from cache, 12 up-to-date

Publishing build scan...
https://ge.apache.org/s/b23chncfdxaps

Build step 'Invoke Gradle script' changed build result to FAILURE
Build step 'Invoke Gradle script' marked build as failure

---------------------------------------------------------------------
To unsubscribe, e-mail: builds-unsubscribe@beam.apache.org
For additional commands, e-mail: builds-help@beam.apache.org


Build failed in Jenkins: beam_PostCommit_XVR_Spark3 #3551

Posted by Apache Jenkins Server <je...@builds.apache.org>.
See <https://ci-beam.apache.org/job/beam_PostCommit_XVR_Spark3/3551/display/redirect>

Changes:


------------------------------------------
[...truncated 1.24 MB...]
      elif '.dev' in version:
        # TODO: Attempt to use nightly snapshots?
>       raise RuntimeError(
            (
                '%s not found. '
                'Please build the server with \n  cd %s; ./gradlew %s') %
            (local_path, os.path.abspath(project_root), gradle_target))
E       RuntimeError: <https://ci-beam.apache.org/job/beam_PostCommit_XVR_Spark3/ws/src/sdks/java/extensions/sql/expansion-service/build/libs/beam-sdks-java-extensions-sql-expansion-service-2.51.0-SNAPSHOT.jar> not found. Please build the server with 
E         cd <https://ci-beam.apache.org/job/beam_PostCommit_XVR_Spark3/ws/src;> ./gradlew :sdks:java:extensions:sql:expansion-service:shadowJar

apache_beam/utils/subprocess_server.py:243: RuntimeError
__________________ SqlTransformTest.test_windowing_before_sql __________________

self = <apache_beam.transforms.sql_test.SqlTransformTest testMethod=test_windowing_before_sql>

    def test_windowing_before_sql(self):
      with TestPipeline() as p:
        out = (
            p | beam.Create([
                SimpleRow(5, "foo", 1.),
                SimpleRow(15, "bar", 2.),
                SimpleRow(25, "baz", 3.)
            ])
            | beam.Map(lambda v: beam.window.TimestampedValue(v, v.id)).
            with_output_types(SimpleRow)
            | beam.WindowInto(
                beam.window.FixedWindows(10)).with_output_types(SimpleRow)
>           | SqlTransform("SELECT COUNT(*) as `count` FROM PCOLLECTION"))

apache_beam/transforms/sql_test.py:174: 
_ _ _ _ _ _ _ _ _ _ _ _ _ _ _ _ _ _ _ _ _ _ _ _ _ _ _ _ _ _ _ _ _ _ _ _ _ _ _ _ 
apache_beam/transforms/sql.py:86: in __init__
    expansion_service = expansion_service or BeamJarExpansionService(
apache_beam/transforms/external.py:983: in __init__
    path_to_jar = subprocess_server.JavaJarServer.path_to_beam_jar(
_ _ _ _ _ _ _ _ _ _ _ _ _ _ _ _ _ _ _ _ _ _ _ _ _ _ _ _ _ _ _ _ _ _ _ _ _ _ _ _ 

cls = <class 'apache_beam.utils.subprocess_server.JavaJarServer'>
gradle_target = ':sdks:java:extensions:sql:expansion-service:shadowJar'
appendix = None, version = '2.51.0.dev'
artifact_id = 'beam-sdks-java-extensions-sql-expansion-service'

    @classmethod
    def path_to_beam_jar(
        cls,
        gradle_target,
        appendix=None,
        version=beam_version,
        artifact_id=None):
      if gradle_target in cls._BEAM_SERVICES.replacements:
        return cls._BEAM_SERVICES.replacements[gradle_target]
    
      gradle_package = gradle_target.strip(':').rsplit(':', 1)[0]
      if not artifact_id:
        artifact_id = 'beam-' + gradle_package.replace(':', '-')
      project_root = os.path.sep.join(
          os.path.abspath(__file__).split(os.path.sep)[:-5])
      local_path = os.path.join(
          project_root,
          gradle_package.replace(':', os.path.sep),
          'build',
          'libs',
          cls.jar_name(
              artifact_id,
              version.replace('.dev', ''),
              classifier='SNAPSHOT',
              appendix=appendix))
      if os.path.exists(local_path):
        _LOGGER.info('Using pre-built snapshot at %s', local_path)
        return local_path
      elif '.dev' in version:
        # TODO: Attempt to use nightly snapshots?
>       raise RuntimeError(
            (
                '%s not found. '
                'Please build the server with \n  cd %s; ./gradlew %s') %
            (local_path, os.path.abspath(project_root), gradle_target))
E       RuntimeError: <https://ci-beam.apache.org/job/beam_PostCommit_XVR_Spark3/ws/src/sdks/java/extensions/sql/expansion-service/build/libs/beam-sdks-java-extensions-sql-expansion-service-2.51.0-SNAPSHOT.jar> not found. Please build the server with 
E         cd <https://ci-beam.apache.org/job/beam_PostCommit_XVR_Spark3/ws/src;> ./gradlew :sdks:java:extensions:sql:expansion-service:shadowJar

apache_beam/utils/subprocess_server.py:243: RuntimeError
_________________ SqlTransformTest.test_zetasql_generate_data __________________

self = <apache_beam.transforms.sql_test.SqlTransformTest testMethod=test_zetasql_generate_data>

    def test_zetasql_generate_data(self):
      with TestPipeline() as p:
>       out = p | SqlTransform(
            """SELECT
              CAST(1 AS INT64) AS `int`,
              CAST('foo' AS STRING) AS `str`,
              CAST(3.14  AS FLOAT64) AS `flt`""",
            dialect="zetasql")

apache_beam/transforms/sql_test.py:154: 
_ _ _ _ _ _ _ _ _ _ _ _ _ _ _ _ _ _ _ _ _ _ _ _ _ _ _ _ _ _ _ _ _ _ _ _ _ _ _ _ 
apache_beam/transforms/sql.py:86: in __init__
    expansion_service = expansion_service or BeamJarExpansionService(
apache_beam/transforms/external.py:983: in __init__
    path_to_jar = subprocess_server.JavaJarServer.path_to_beam_jar(
_ _ _ _ _ _ _ _ _ _ _ _ _ _ _ _ _ _ _ _ _ _ _ _ _ _ _ _ _ _ _ _ _ _ _ _ _ _ _ _ 

cls = <class 'apache_beam.utils.subprocess_server.JavaJarServer'>
gradle_target = ':sdks:java:extensions:sql:expansion-service:shadowJar'
appendix = None, version = '2.51.0.dev'
artifact_id = 'beam-sdks-java-extensions-sql-expansion-service'

    @classmethod
    def path_to_beam_jar(
        cls,
        gradle_target,
        appendix=None,
        version=beam_version,
        artifact_id=None):
      if gradle_target in cls._BEAM_SERVICES.replacements:
        return cls._BEAM_SERVICES.replacements[gradle_target]
    
      gradle_package = gradle_target.strip(':').rsplit(':', 1)[0]
      if not artifact_id:
        artifact_id = 'beam-' + gradle_package.replace(':', '-')
      project_root = os.path.sep.join(
          os.path.abspath(__file__).split(os.path.sep)[:-5])
      local_path = os.path.join(
          project_root,
          gradle_package.replace(':', os.path.sep),
          'build',
          'libs',
          cls.jar_name(
              artifact_id,
              version.replace('.dev', ''),
              classifier='SNAPSHOT',
              appendix=appendix))
      if os.path.exists(local_path):
        _LOGGER.info('Using pre-built snapshot at %s', local_path)
        return local_path
      elif '.dev' in version:
        # TODO: Attempt to use nightly snapshots?
>       raise RuntimeError(
            (
                '%s not found. '
                'Please build the server with \n  cd %s; ./gradlew %s') %
            (local_path, os.path.abspath(project_root), gradle_target))
E       RuntimeError: <https://ci-beam.apache.org/job/beam_PostCommit_XVR_Spark3/ws/src/sdks/java/extensions/sql/expansion-service/build/libs/beam-sdks-java-extensions-sql-expansion-service-2.51.0-SNAPSHOT.jar> not found. Please build the server with 
E         cd <https://ci-beam.apache.org/job/beam_PostCommit_XVR_Spark3/ws/src;> ./gradlew :sdks:java:extensions:sql:expansion-service:shadowJar

apache_beam/utils/subprocess_server.py:243: RuntimeError
=============================== warnings summary ===============================
../../build/gradleenv/1922375555/lib/python3.8/site-packages/hdfs/config.py:28
  <https://ci-beam.apache.org/job/beam_PostCommit_XVR_Spark3/ws/src/build/gradleenv/1922375555/lib/python3.8/site-packages/hdfs/config.py>:28: DeprecationWarning: the imp module is deprecated in favour of importlib; see the module's documentation for alternative uses
    from imp import load_source

../../build/gradleenv/1922375555/lib/python3.8/site-packages/google/rpc/__init__.py:18
  <https://ci-beam.apache.org/job/beam_PostCommit_XVR_Spark3/ws/src/build/gradleenv/1922375555/lib/python3.8/site-packages/google/rpc/__init__.py>:18: DeprecationWarning: pkg_resources is deprecated as an API. See https://setuptools.pypa.io/en/latest/pkg_resources.html
    import pkg_resources

../../build/gradleenv/1922375555/lib/python3.8/site-packages/pkg_resources/__init__.py:2871: 19 warnings
  <https://ci-beam.apache.org/job/beam_PostCommit_XVR_Spark3/ws/src/build/gradleenv/1922375555/lib/python3.8/site-packages/pkg_resources/__init__.py>:2871: DeprecationWarning: Deprecated call to `pkg_resources.declare_namespace('google')`.
  Implementing implicit namespace packages (as specified in PEP 420) is preferred to `pkg_resources.declare_namespace`. See https://setuptools.pypa.io/en/latest/references/keywords.html#keyword-namespace-packages
    declare_namespace(pkg)

../../build/gradleenv/1922375555/lib/python3.8/site-packages/pkg_resources/__init__.py:2871: 16 warnings
  <https://ci-beam.apache.org/job/beam_PostCommit_XVR_Spark3/ws/src/build/gradleenv/1922375555/lib/python3.8/site-packages/pkg_resources/__init__.py>:2871: DeprecationWarning: Deprecated call to `pkg_resources.declare_namespace('google.cloud')`.
  Implementing implicit namespace packages (as specified in PEP 420) is preferred to `pkg_resources.declare_namespace`. See https://setuptools.pypa.io/en/latest/references/keywords.html#keyword-namespace-packages
    declare_namespace(pkg)

../../build/gradleenv/1922375555/lib/python3.8/site-packages/pkg_resources/__init__.py:2350
../../build/gradleenv/1922375555/lib/python3.8/site-packages/pkg_resources/__init__.py:2350
../../build/gradleenv/1922375555/lib/python3.8/site-packages/pkg_resources/__init__.py:2350
../../build/gradleenv/1922375555/lib/python3.8/site-packages/pkg_resources/__init__.py:2350
  <https://ci-beam.apache.org/job/beam_PostCommit_XVR_Spark3/ws/src/build/gradleenv/1922375555/lib/python3.8/site-packages/pkg_resources/__init__.py>:2350: DeprecationWarning: Deprecated call to `pkg_resources.declare_namespace('google')`.
  Implementing implicit namespace packages (as specified in PEP 420) is preferred to `pkg_resources.declare_namespace`. See https://setuptools.pypa.io/en/latest/references/keywords.html#keyword-namespace-packages
    declare_namespace(parent)

../../build/gradleenv/1922375555/lib/python3.8/site-packages/pkg_resources/__init__.py:2871
  <https://ci-beam.apache.org/job/beam_PostCommit_XVR_Spark3/ws/src/build/gradleenv/1922375555/lib/python3.8/site-packages/pkg_resources/__init__.py>:2871: DeprecationWarning: Deprecated call to `pkg_resources.declare_namespace('google.logging')`.
  Implementing implicit namespace packages (as specified in PEP 420) is preferred to `pkg_resources.declare_namespace`. See https://setuptools.pypa.io/en/latest/references/keywords.html#keyword-namespace-packages
    declare_namespace(pkg)

../../build/gradleenv/1922375555/lib/python3.8/site-packages/pkg_resources/__init__.py:2871
  <https://ci-beam.apache.org/job/beam_PostCommit_XVR_Spark3/ws/src/build/gradleenv/1922375555/lib/python3.8/site-packages/pkg_resources/__init__.py>:2871: DeprecationWarning: Deprecated call to `pkg_resources.declare_namespace('google.iam')`.
  Implementing implicit namespace packages (as specified in PEP 420) is preferred to `pkg_resources.declare_namespace`. See https://setuptools.pypa.io/en/latest/references/keywords.html#keyword-namespace-packages
    declare_namespace(pkg)

../../build/gradleenv/1922375555/lib/python3.8/site-packages/google/rpc/__init__.py:20
  <https://ci-beam.apache.org/job/beam_PostCommit_XVR_Spark3/ws/src/build/gradleenv/1922375555/lib/python3.8/site-packages/google/rpc/__init__.py>:20: DeprecationWarning: Deprecated call to `pkg_resources.declare_namespace('google.rpc')`.
  Implementing implicit namespace packages (as specified in PEP 420) is preferred to `pkg_resources.declare_namespace`. See https://setuptools.pypa.io/en/latest/references/keywords.html#keyword-namespace-packages
    pkg_resources.declare_namespace(__name__)

-- Docs: https://docs.pytest.org/en/stable/how-to/capture-warnings.html
- generated xml file: <https://ci-beam.apache.org/job/beam_PostCommit_XVR_Spark3/ws/src/sdks/python/pytest_xlangSqlValidateRunner.xml> -
=========================== short test summary info ============================
FAILED apache_beam/transforms/sql_test.py::SqlTransformTest::test_agg - RuntimeError: <https://ci-beam.apache.org/job/beam_PostCommit_XVR_Spark3/ws/src/sdks/java/extensions/sql/expansion-service/build/libs/beam-sdks-java-extensions-sql-expansion-service-2.51.0-SNAPSHOT.jar> not found. Please build the server with 
  cd <https://ci-beam.apache.org/job/beam_PostCommit_XVR_Spark3/ws/src;> ./gradlew :sdks:java:extensions:sql:expansion-service:shadowJar
FAILED apache_beam/transforms/sql_test.py::SqlTransformTest::test_filter - RuntimeError: <https://ci-beam.apache.org/job/beam_PostCommit_XVR_Spark3/ws/src/sdks/java/extensions/sql/expansion-service/build/libs/beam-sdks-java-extensions-sql-expansion-service-2.51.0-SNAPSHOT.jar> not found. Please build the server with 
  cd <https://ci-beam.apache.org/job/beam_PostCommit_XVR_Spark3/ws/src;> ./gradlew :sdks:java:extensions:sql:expansion-service:shadowJar
FAILED apache_beam/transforms/sql_test.py::SqlTransformTest::test_generate_data - RuntimeError: <https://ci-beam.apache.org/job/beam_PostCommit_XVR_Spark3/ws/src/sdks/java/extensions/sql/expansion-service/build/libs/beam-sdks-java-extensions-sql-expansion-service-2.51.0-SNAPSHOT.jar> not found. Please build the server with 
  cd <https://ci-beam.apache.org/job/beam_PostCommit_XVR_Spark3/ws/src;> ./gradlew :sdks:java:extensions:sql:expansion-service:shadowJar
FAILED apache_beam/transforms/sql_test.py::SqlTransformTest::test_map - RuntimeError: <https://ci-beam.apache.org/job/beam_PostCommit_XVR_Spark3/ws/src/sdks/java/extensions/sql/expansion-service/build/libs/beam-sdks-java-extensions-sql-expansion-service-2.51.0-SNAPSHOT.jar> not found. Please build the server with 
  cd <https://ci-beam.apache.org/job/beam_PostCommit_XVR_Spark3/ws/src;> ./gradlew :sdks:java:extensions:sql:expansion-service:shadowJar
FAILED apache_beam/transforms/sql_test.py::SqlTransformTest::test_project - RuntimeError: <https://ci-beam.apache.org/job/beam_PostCommit_XVR_Spark3/ws/src/sdks/java/extensions/sql/expansion-service/build/libs/beam-sdks-java-extensions-sql-expansion-service-2.51.0-SNAPSHOT.jar> not found. Please build the server with 
  cd <https://ci-beam.apache.org/job/beam_PostCommit_XVR_Spark3/ws/src;> ./gradlew :sdks:java:extensions:sql:expansion-service:shadowJar
FAILED apache_beam/transforms/sql_test.py::SqlTransformTest::test_row - RuntimeError: <https://ci-beam.apache.org/job/beam_PostCommit_XVR_Spark3/ws/src/sdks/java/extensions/sql/expansion-service/build/libs/beam-sdks-java-extensions-sql-expansion-service-2.51.0-SNAPSHOT.jar> not found. Please build the server with 
  cd <https://ci-beam.apache.org/job/beam_PostCommit_XVR_Spark3/ws/src;> ./gradlew :sdks:java:extensions:sql:expansion-service:shadowJar
FAILED apache_beam/transforms/sql_test.py::SqlTransformTest::test_tagged_join - RuntimeError: <https://ci-beam.apache.org/job/beam_PostCommit_XVR_Spark3/ws/src/sdks/java/extensions/sql/expansion-service/build/libs/beam-sdks-java-extensions-sql-expansion-service-2.51.0-SNAPSHOT.jar> not found. Please build the server with 
  cd <https://ci-beam.apache.org/job/beam_PostCommit_XVR_Spark3/ws/src;> ./gradlew :sdks:java:extensions:sql:expansion-service:shadowJar
FAILED apache_beam/transforms/sql_test.py::SqlTransformTest::test_windowing_before_sql - RuntimeError: <https://ci-beam.apache.org/job/beam_PostCommit_XVR_Spark3/ws/src/sdks/java/extensions/sql/expansion-service/build/libs/beam-sdks-java-extensions-sql-expansion-service-2.51.0-SNAPSHOT.jar> not found. Please build the server with 
  cd <https://ci-beam.apache.org/job/beam_PostCommit_XVR_Spark3/ws/src;> ./gradlew :sdks:java:extensions:sql:expansion-service:shadowJar
FAILED apache_beam/transforms/sql_test.py::SqlTransformTest::test_zetasql_generate_data - RuntimeError: <https://ci-beam.apache.org/job/beam_PostCommit_XVR_Spark3/ws/src/sdks/java/extensions/sql/expansion-service/build/libs/beam-sdks-java-extensions-sql-expansion-service-2.51.0-SNAPSHOT.jar> not found. Please build the server with 
  cd <https://ci-beam.apache.org/job/beam_PostCommit_XVR_Spark3/ws/src;> ./gradlew :sdks:java:extensions:sql:expansion-service:shadowJar
========= 9 failed, 17 skipped, 7154 deselected, 44 warnings in 7.84s ==========

> Task :runners:spark:3:job-server:validatesCrossLanguageRunnerPythonUsingSql FAILED

> Task :runners:spark:3:job-server:sparkJobServerCleanup
Stopping job server pid: 1005486.

> Task :runners:spark:3:job-server:validatesCrossLanguageRunnerCleanup
Stopping expansion service pid: 1024450.
Stopping expansion service pid: 1024451.

FAILURE: Build failed with an exception.

* What went wrong:
Execution failed for task ':runners:spark:3:job-server:validatesCrossLanguageRunnerPythonUsingSql'.
> Process 'command 'sh'' finished with non-zero exit value 1

* Try:
> Run with --stacktrace option to get the stack trace.
> Run with --info or --debug option to get more log output.

* Get more help at https://help.gradle.org

Deprecated Gradle features were used in this build, making it incompatible with Gradle 8.0.

You can use '--warning-mode all' to show the individual deprecation warnings and determine if they come from your own scripts or plugins.

See https://docs.gradle.org/7.6.2/userguide/command_line_interface.html#sec:command_line_warnings

Execution optimizations have been disabled for 1 invalid unit(s) of work during this build to ensure correctness.
Please consult deprecation warnings for more details.

BUILD FAILED in 31m 11s
274 actionable tasks: 183 executed, 79 from cache, 12 up-to-date

Publishing build scan...
https://ge.apache.org/s/o2cas6pqgifdq

Build step 'Invoke Gradle script' changed build result to FAILURE
Build step 'Invoke Gradle script' marked build as failure

---------------------------------------------------------------------
To unsubscribe, e-mail: builds-unsubscribe@beam.apache.org
For additional commands, e-mail: builds-help@beam.apache.org


Build failed in Jenkins: beam_PostCommit_XVR_Spark3 #3550

Posted by Apache Jenkins Server <je...@builds.apache.org>.
See <https://ci-beam.apache.org/job/beam_PostCommit_XVR_Spark3/3550/display/redirect?page=changes>

Changes:

[noreply] Bump golang.org/x/sys from 0.11.0 to 0.12.0 in /sdks (#28296)


------------------------------------------
[...truncated 1.14 MB...]
    >
  >
  coders: <
    key: "mvPRqecHrhKvCoder1"
    value: <
      spec: <
        urn: "beam:coder:kv:v1"
      >
      component_coder_ids: "mvPRqecHrhVarIntCoder"
      component_coder_ids: "mvPRqecHrhSerializableCoder"
    >
  >
  coders: <
    key: "mvPRqecHrhKvCoder2"
    value: <
      spec: <
        urn: "beam:coder:kv:v1"
      >
      component_coder_ids: "mvPRqecHrhVarIntCoder"
      component_coder_ids: "mvPRqecHrhTimestampedValueCoder"
    >
  >
  coders: <
    key: "mvPRqecHrhKvCoder3"
    value: <
      spec: <
        urn: "beam:coder:kv:v1"
      >
      component_coder_ids: "mvPRqecHrhVarIntCoder"
      component_coder_ids: "mvPRqecHrhIterableCoder"
    >
  >
  coders: <
    key: "mvPRqecHrhNullableCoder"
    value: <
      spec: <
        urn: "beam:coder:nullable:v1"
      >
      component_coder_ids: "mvPRqecHrhByteArrayCoder"
    >
  >
  coders: <
    key: "mvPRqecHrhSerializableCoder"
    value: <
      spec: <
        urn: "beam:coders:javasdk:0.1"
        payload: "\202SNAPPY\000\000\000\000\001\000\000\000\001\000\000\000\312\214\002\360^\254\355\000\005sr\000,org.apache.beam.sdk.coders.SerializableCoder\010\364 \216\305ynl\002\000\001L\000\004typet\000\021Ljava/lang/Class;xr\000&ofV\000\024Custom\005P8j\260\010\235\013;\035\013\002\000\000xr\000 j\213\000\005/\034C\335\325\211\256\274~\370\001/\020pvr\000;N1\000Pio.BoundedReadFromUnb\t\021`Source$Shardd\236\240U\205\000j\363\002\000\000xp"
      >
    >
  >
  coders: <
    key: "mvPRqecHrhTimestampedValueCoder"
    value: <
      spec: <
        urn: "beam:coders:javasdk:0.1"
        payload: "\202SNAPPY\000\000\000\000\001\000\000\000\001\000\000\001?\315\003\270\254\355\000\005sr\000Aorg.apache.beam.sdk.values.TimestampedV\001\022\000$>\021\000LCoder\364\376\202p\274iX-\002\000\001L\000\nv\001)\005\030\034t\000\"Lorg/\t]\000/\001],/sdk/coders/\005$\020;xr\000*N\202\000\t%(.Structured\005/8s\277\022\016\325\3246\021\002\000\000xr\000 j9\000\005/\034C\335\325\211\256\274~\370\001/\020psr\000,j1\000(Serializabl\t\277\034\010\364 \216\305ynl\005\327\\\004typet\000\021Ljava/lang/Class\001\300\000&jV\000\024Custom\005\215Pj\260\010\235\013;\035\013\002\000\000xq\000~\000\003vr\000;N;\000Pio.BoundedReadFromUnb\t\021`Source$Shardd\236\240U\205\000j\363\002\000\000xp"
      >
    >
  >
  coders: <
    key: "mvPRqecHrhValueWithRecordIdCoder"
    value: <
      spec: <
        urn: "beam:coders:javasdk:0.1"
        payload: "\202SNAPPY\000\000\000\000\001\000\000\000\001\000\000\001\213\311\005\320\254\355\000\005sr\000Corg.apache.beam.sdk.values.ValueWithRecordId$B\022\000LCoder{\343\376bQ\014\204>\002\000\002L\000\007i\t\025\034t\000+Lorg/\t\\\000/\001\\\024/sdk/c\0012(s/ByteArray\005B\014;L\000\n\005u\005\016\010t\000\"n;\000\005$\020;xr\000*N\274\000\t`(.Structured\005/8s\277\022\016\325\3246\021\002\000\000xr\000 j9\000\005/\034C\335\325\211\256\274~\370\001/\020psr\000)j1\0006\312\000\034\351\277\005|\263\3746\333\001:\010r\000&j8\000\024Atomic\005o\034\307\354\265\314\205tPF\0015 q\000~\000\003sr\000-N;\000$io.kafka.K\001\006\000R%\227\005B<I\320\251Y\032\341{#\002\000\001L\000\007kv\005\025\010t\000$nH\001\000K\t&\000;\025s\000\"Ns\000-P\r- j\000\275\271\035\243\3126\002!\353\010\010ke)\277\001\264\000\0022\303\001\005\022\025Y\000(jY\000\030Nullabl)\372\034E\333\0336>\220\247\007\005\307]\022.O\000\001\014,\006sq\000~\000\016q\000~\000\020"
      >
    >
  >
  coders: <
    key: "mvPRqecHrhVarIntCoder"
    value: <
      spec: <
        urn: "beam:coders:javasdk:0.1"
        payload: "\202SNAPPY\000\000\000\000\001\000\000\000\001\000\000\000\210\330\001\350\254\355\000\005sr\000&org.apache.beam.sdk.coders.VarIntCoder\300K2\332\251KVh\002\000\000xrr5\000\024Atomic\0055 \307\354\265\314\205tPF\002\0055\000*jj\000$Structured\0059\034s\277\022\016\325\3246\021\t9\000 j9\000\005/0C\335\325\211\256\274~\370\002\000\000xp"
      >
    >
  >
  environments: <
    key: "go"
    value: <
      urn: "beam:env:docker:v1"
      payload: "\n\026apache/beam_go_sdk:dev"
      capabilities: "beam:protocol:progress_reporting:v1"
      capabilities: "beam:protocol:multi_core_bundle_processing:v1"
      capabilities: "beam:transform:sdf_truncate_sized_restrictions:v1"
      capabilities: "beam:protocol:worker_status:v1"
      capabilities: "beam:protocol:monitoring_info_short_ids:v1"
      capabilities: "beam:version:sdk_base:go:apache/beam_go_sdk:2.51.0.dev"
      capabilities: "beam:coder:bytes:v1"
      capabilities: "beam:coder:bool:v1"
      capabilities: "beam:coder:varint:v1"
      capabilities: "beam:coder:double:v1"
      capabilities: "beam:coder:string_utf8:v1"
      capabilities: "beam:coder:length_prefix:v1"
      capabilities: "beam:coder:kv:v1"
      capabilities: "beam:coder:iterable:v1"
      capabilities: "beam:coder:state_backed_iterable:v1"
      capabilities: "beam:coder:windowed_value:v1"
      capabilities: "beam:coder:global_window:v1"
      capabilities: "beam:coder:interval_window:v1"
      capabilities: "beam:coder:row:v1"
      capabilities: "beam:coder:nullable:v1"
      capabilities: "beam:coder:timer:v1"
      dependencies: <
        type_urn: "beam:artifact:type:file:v1"
        role_urn: "beam:artifact:role:go_worker_binary:v1"
      >
    >
  >
  environments: <
    key: "mvPRqecHrhbeam:env:docker:v1"
    value: <
      urn: "beam:env:docker:v1"
      payload: "\n apache/beam_java8_sdk:2.51.0.dev"
      capabilities: "beam:coder:bytes:v1"
      capabilities: "beam:coder:bool:v1"
      capabilities: "beam:coder:varint:v1"
      capabilities: "beam:coder:string_utf8:v1"
      capabilities: "beam:coder:iterable:v1"
      capabilities: "beam:coder:timer:v1"
      capabilities: "beam:coder:kv:v1"
      capabilities: "beam:coder:length_prefix:v1"
      capabilities: "beam:coder:global_window:v1"
      capabilities: "beam:coder:interval_window:v1"
      capabilities: "beam:coder:custom_window:v1"
      capabilities: "beam:coder:windowed_value:v1"
      capabilities: "beam:coder:double:v1"
      capabilities: "beam:coder:row:v1"
      capabilities: "beam:coder:param_windowed_value:v1"
      capabilities: "beam:coder:state_backed_iterable:v1"
      capabilities: "beam:coder:sharded_key:v1"
      capabilities: "beam:coder:nullable:v1"
      capabilities: "beam:protocol:multi_core_bundle_processing:v1"
      capabilities: "beam:protocol:progress_reporting:v1"
      capabilities: "beam:protocol:harness_monitoring_infos:v1"
      capabilities: "beam:protocol:control_request_elements_embedding:v1"
      capabilities: "beam:protocol:state_caching:v1"
      capabilities: "beam:version:sdk_base:apache/beam_java8_sdk:2.51.0.dev"
      capabilities: "beam:transform:sdf_truncate_sized_restrictions:v1"
      capabilities: "beam:transform:to_string:v1"
      capabilities: "beam:protocol:data_sampling:v1"
      dependencies: <
        type_urn: "beam:artifact:type:file:v1"
        type_payload: "\nL/tmp/artifacts/icedtea-sound-uoIQCGhMffp0D_gc1dkBtXBGXr18Bkb5Qx-e-CvP00s.jar\022@ba821008684c7dfa740ff81cd5d901b570465ebd7c0646f9431f9ef82bcfd34b"
        role_urn: "beam:artifact:role:staging_to:v1"
        role_payload: "\n=icedtea-sound-uoIQCGhMffp0D_gc1dkBtXBGXr18Bkb5Qx-e-CvP00s.jar"
      >
      dependencies: <
        type_urn: "beam:artifact:type:file:v1"
        type_payload: "\nF/tmp/artifacts/jaccess-T1qVdaqZDj2uNq1tdHEk1lwFMYQiwMhYa0jqGU9fUMg.jar\022@4f5a9575aa990e3dae36ad6d747124d65c05318422c0c8586b48ea194f5f50c8"
        role_urn: "beam:artifact:role:staging_to:v1"
        role_payload: "\n7jaccess-T1qVdaqZDj2uNq1tdHEk1lwFMYQiwMhYa0jqGU9fUMg.jar"
      >
      dependencies: <
        type_urn: "beam:artifact:type:file:v1"
        type_payload: "\nI/tmp/artifacts/localedata-dQT9YOGvbd1zEqcZsyJ1W4l8jNhxoX3b1nmMhdIbCb8.jar\022@7504fd60e1af6ddd7312a719b322755b897c8cd871a17ddbd6798c85d21b09bf"
        role_urn: "beam:artifact:role:staging_to:v1"
        role_payload: "\n:localedata-dQT9YOGvbd1zEqcZsyJ1W4l8jNhxoX3b1nmMhdIbCb8.jar"
      >
      dependencies: <
        type_urn: "beam:artifact:type:file:v1"
        type_payload: "\nF/tmp/artifacts/nashorn-gZxbPAWCb1KP7OCbxUu1prmT4YMEDX-mGdJFjkB3pfs.jar\022@819c5b3c05826f528fece09bc54bb5a6b993e183040d7fa619d2458e4077a5fb"
        role_urn: "beam:artifact:role:staging_to:v1"
        role_payload: "\n7nashorn-gZxbPAWCb1KP7OCbxUu1prmT4YMEDX-mGdJFjkB3pfs.jar"
      >
      dependencies: <
        type_urn: "beam:artifact:type:file:v1"
        type_payload: "\nG/tmp/artifacts/cldrdata-_GVjPlS0invvNh7wlTfv_CNVOxTj3Y-xvSW1Xw2r_-4.jar\022@fc65633e54b48a7bef361ef09537effc23553b14e3dd8fb1bd25b55f0dabffee"
        role_urn: "beam:artifact:role:staging_to:v1"
        role_payload: "\n8cldrdata-_GVjPlS0invvNh7wlTfv_CNVOxTj3Y-xvSW1Xw2r_-4.jar"
      >
      dependencies: <
        type_urn: "beam:artifact:type:file:v1"
        type_payload: "\nD/tmp/artifacts/dnsns-lI-xDSEZtu3C8A4-qt_7RcyP_ql7OU0LNZreNR5piTU.jar\022@948fb10d2119b6edc2f00e3eaadffb45cc8ffea97b394d0b359ade351e698935"
        role_urn: "beam:artifact:role:staging_to:v1"
        role_payload: "\n5dnsns-lI-xDSEZtu3C8A4-qt_7RcyP_ql7OU0LNZreNR5piTU.jar"
      >
      dependencies: <
        type_urn: "beam:artifact:type:file:v1"
        type_payload: "\n{/tmp/artifacts/beam-sdks-java-io-expansion-service-2.51.0-SNAPSHOT-SNAPSHOT-sdh9-LGyXe7Y5ESN6d3v1sPzLCQDF20pqUAepDIiTig.jar\022@b1d87df8b1b25deed8e4448de9ddefd6c3f32c2403176d29a9401ea432224e28"
        role_urn: "beam:artifact:role:staging_to:v1"
        role_payload: "\nlbeam-sdks-java-io-expansion-service-2.51.0-SNAPSHOT-SNAPSHOT-sdh9-LGyXe7Y5ESN6d3v1sPzLCQDF20pqUAepDIiTig.jar"
      >
    >
  >
>
root_transform_ids: "e4"
root_transform_ids: "e5"
root_transform_ids: "s1"
root_transform_ids: "s3"
2023/09/06 14:39:42 Cross-compiling <https://ci-beam.apache.org/job/beam_PostCommit_XVR_Spark3/ws/src/sdks/go/test/integration/io/xlang/kafka/kafka_test.go> with GOOS=linux GOARCH=amd64 CGO_ENABLED=0 as /tmp/worker-2-1694011182516878759
2023/09/06 14:39:44 Prepared job with id: go-testkafkaio_basicreadwrite-960_c98d218e-68e9-44ad-98a9-37ce5cfe4999 and staging token: go-testkafkaio_basicreadwrite-960_c98d218e-68e9-44ad-98a9-37ce5cfe4999
2023/09/06 14:39:45 Staged binary artifact with token: 
2023/09/06 14:39:45 Submitted job: go0testkafkaio0basicreadwrite0960-jenkins-0906143945-471833a1_4e129935-0b36-45f0-99c3-6ffe912a6359
2023/09/06 14:39:45 Job[go0testkafkaio0basicreadwrite0960-jenkins-0906143945-471833a1_4e129935-0b36-45f0-99c3-6ffe912a6359] state: STOPPED
2023/09/06 14:39:45 Job[go0testkafkaio0basicreadwrite0960-jenkins-0906143945-471833a1_4e129935-0b36-45f0-99c3-6ffe912a6359] state: STARTING
2023/09/06 14:39:45 Job[go0testkafkaio0basicreadwrite0960-jenkins-0906143945-471833a1_4e129935-0b36-45f0-99c3-6ffe912a6359] state: RUNNING
2023/09/06 14:40:06 Job[go0testkafkaio0basicreadwrite0960-jenkins-0906143945-471833a1_4e129935-0b36-45f0-99c3-6ffe912a6359] state: DONE
--- PASS: TestKafkaIO_BasicReadWrite (39.19s)
PASS
ok  	github.com/apache/beam/sdks/v2/go/test/integration/io/xlang/kafka	45.215s

> Task :runners:spark:3:job-server:validatesCrossLanguageRunnerJavaUsingPython
INFO:root:No image given, using default Python SDK image
INFO:root:Python SDK container image set to "apache/beam_python3.8_sdk:2.50.0" for Docker environment
INFO:__main__:Listening for expansion requests at 39169
INFO:root:Missing pipeline option (runner). Executing pipeline using the default runner: DirectRunner.
INFO:__main__:Shutting down expansion service.
INFO:apache_beam.runners.portability.stager:Executing command: ['/home/jenkins/.apache_beam/cache/venvs/py-3.8-beam-2.50.0-743bdccef67087512a7a190820e727aab7bdcb14/bin/python', '-m', 'pip', 'download', '--dest', '/tmp/dataflow-requirements-cache', '-r', '/tmp/tmp2ab0vfi7/tmp_requirements.txt', '--exists-action', 'i', '--no-deps', '--implementation', 'cp', '--abi', 'cp38', '--platform', 'manylinux2014_x86_64']
INFO:root:No image given, using default Python SDK image
INFO:root:Python SDK container image set to "apache/beam_python3.8_sdk:2.50.0" for Docker environment
INFO:__main__:Listening for expansion requests at 38073
INFO:root:Missing pipeline option (runner). Executing pipeline using the default runner: DirectRunner.
INFO:__main__:Shutting down expansion service.

> Task :runners:spark:3:job-server:validatesCrossLanguageRunnerPythonUsingJava
> Task :runners:spark:3:job-server:validatesCrossLanguageRunnerPythonUsingSql FAILED
> Task :runners:spark:3:job-server:sparkJobServerCleanup
> Task :runners:spark:3:job-server:validatesCrossLanguageRunnerCleanup

FAILURE: Build failed with an exception.

* What went wrong:
Execution failed for task ':runners:spark:3:job-server:validatesCrossLanguageRunnerPythonUsingSql'.
> Process 'command 'sh'' finished with non-zero exit value 1

* Try:
> Run with --stacktrace option to get the stack trace.
> Run with --info or --debug option to get more log output.

* Get more help at https://help.gradle.org

Deprecated Gradle features were used in this build, making it incompatible with Gradle 8.0.

You can use '--warning-mode all' to show the individual deprecation warnings and determine if they come from your own scripts or plugins.

See https://docs.gradle.org/7.6.2/userguide/command_line_interface.html#sec:command_line_warnings

Execution optimizations have been disabled for 1 invalid unit(s) of work during this build to ensure correctness.
Please consult deprecation warnings for more details.

BUILD FAILED in 30m 41s
274 actionable tasks: 178 executed, 84 from cache, 12 up-to-date

Publishing build scan...
https://ge.apache.org/s/phyqc43mkccto

Build step 'Invoke Gradle script' changed build result to FAILURE
Build step 'Invoke Gradle script' marked build as failure

---------------------------------------------------------------------
To unsubscribe, e-mail: builds-unsubscribe@beam.apache.org
For additional commands, e-mail: builds-help@beam.apache.org


Build failed in Jenkins: beam_PostCommit_XVR_Spark3 #3549

Posted by Apache Jenkins Server <je...@builds.apache.org>.
See <https://ci-beam.apache.org/job/beam_PostCommit_XVR_Spark3/3549/display/redirect>

Changes:


------------------------------------------
[...truncated 1.16 MB...]
      spec: <
        urn: "beam:coders:javasdk:0.1"
        payload: "\202SNAPPY\000\000\000\000\001\000\000\000\001\000\000\001?\315\003\270\254\355\000\005sr\000Aorg.apache.beam.sdk.values.TimestampedV\001\022\000$>\021\000LCoder\364\376\202p\274iX-\002\000\001L\000\nv\001)\005\030\034t\000\"Lorg/\t]\000/\001],/sdk/coders/\005$\020;xr\000*N\202\000\t%(.Structured\005/8s\277\022\016\325\3246\021\002\000\000xr\000 j9\000\005/\034C\335\325\211\256\274~\370\001/\020psr\000,j1\000(Serializabl\t\277\034\010\364 \216\305ynl\005\327\\\004typet\000\021Ljava/lang/Class\001\300\000&jV\000\024Custom\005\215Pj\260\010\235\013;\035\013\002\000\000xq\000~\000\003vr\000;N;\000Pio.BoundedReadFromUnb\t\021`Source$Shardd\236\240U\205\000j\363\002\000\000xp"
      >
    >
  >
  coders: <
    key: "mkJKBNKVCdValueWithRecordIdCoder"
    value: <
      spec: <
        urn: "beam:coders:javasdk:0.1"
        payload: "\202SNAPPY\000\000\000\000\001\000\000\000\001\000\000\001\213\311\005\320\254\355\000\005sr\000Corg.apache.beam.sdk.values.ValueWithRecordId$B\022\000LCoder{\343\376bQ\014\204>\002\000\002L\000\007i\t\025\034t\000+Lorg/\t\\\000/\001\\\024/sdk/c\0012(s/ByteArray\005B\014;L\000\n\005u\005\016\010t\000\"n;\000\005$\020;xr\000*N\274\000\t`(.Structured\005/8s\277\022\016\325\3246\021\002\000\000xr\000 j9\000\005/\034C\335\325\211\256\274~\370\001/\020psr\000)j1\0006\312\000\034\351\277\005|\263\3746\333\001:\010r\000&j8\000\024Atomic\005o\034\307\354\265\314\205tPF\0015 q\000~\000\003sr\000-N;\000$io.kafka.K\001\006\000R%\227\005B<I\320\251Y\032\341{#\002\000\001L\000\007kv\005\025\010t\000$nH\001\000K\t&\000;\025s\000\"Ns\000-P\r- j\000\275\271\035\243\3126\002!\353\010\010ke)\277\001\264\000\0022\303\001\005\022\025Y\000(jY\000\030Nullabl)\372\034E\333\0336>\220\247\007\005\307]\022.O\000\001\014,\006sq\000~\000\016q\000~\000\020"
      >
    >
  >
  coders: <
    key: "mkJKBNKVCdVarIntCoder"
    value: <
      spec: <
        urn: "beam:coders:javasdk:0.1"
        payload: "\202SNAPPY\000\000\000\000\001\000\000\000\001\000\000\000\210\330\001\350\254\355\000\005sr\000&org.apache.beam.sdk.coders.VarIntCoder\300K2\332\251KVh\002\000\000xrr5\000\024Atomic\0055 \307\354\265\314\205tPF\002\0055\000*jj\000$Structured\0059\034s\277\022\016\325\3246\021\t9\000 j9\000\005/0C\335\325\211\256\274~\370\002\000\000xp"
      >
    >
  >
  environments: <
    key: "go"
    value: <
      urn: "beam:env:docker:v1"
      payload: "\n\026apache/beam_go_sdk:dev"
      capabilities: "beam:protocol:progress_reporting:v1"
      capabilities: "beam:protocol:multi_core_bundle_processing:v1"
      capabilities: "beam:transform:sdf_truncate_sized_restrictions:v1"
      capabilities: "beam:protocol:worker_status:v1"
      capabilities: "beam:protocol:monitoring_info_short_ids:v1"
      capabilities: "beam:version:sdk_base:go:apache/beam_go_sdk:2.51.0.dev"
      capabilities: "beam:coder:bytes:v1"
      capabilities: "beam:coder:bool:v1"
      capabilities: "beam:coder:varint:v1"
      capabilities: "beam:coder:double:v1"
      capabilities: "beam:coder:string_utf8:v1"
      capabilities: "beam:coder:length_prefix:v1"
      capabilities: "beam:coder:kv:v1"
      capabilities: "beam:coder:iterable:v1"
      capabilities: "beam:coder:state_backed_iterable:v1"
      capabilities: "beam:coder:windowed_value:v1"
      capabilities: "beam:coder:global_window:v1"
      capabilities: "beam:coder:interval_window:v1"
      capabilities: "beam:coder:row:v1"
      capabilities: "beam:coder:nullable:v1"
      capabilities: "beam:coder:timer:v1"
      dependencies: <
        type_urn: "beam:artifact:type:file:v1"
        role_urn: "beam:artifact:role:go_worker_binary:v1"
      >
    >
  >
  environments: <
    key: "mkJKBNKVCdbeam:env:docker:v1"
    value: <
      urn: "beam:env:docker:v1"
      payload: "\n apache/beam_java8_sdk:2.51.0.dev"
      capabilities: "beam:coder:bytes:v1"
      capabilities: "beam:coder:bool:v1"
      capabilities: "beam:coder:varint:v1"
      capabilities: "beam:coder:string_utf8:v1"
      capabilities: "beam:coder:iterable:v1"
      capabilities: "beam:coder:timer:v1"
      capabilities: "beam:coder:kv:v1"
      capabilities: "beam:coder:length_prefix:v1"
      capabilities: "beam:coder:global_window:v1"
      capabilities: "beam:coder:interval_window:v1"
      capabilities: "beam:coder:custom_window:v1"
      capabilities: "beam:coder:windowed_value:v1"
      capabilities: "beam:coder:double:v1"
      capabilities: "beam:coder:row:v1"
      capabilities: "beam:coder:param_windowed_value:v1"
      capabilities: "beam:coder:state_backed_iterable:v1"
      capabilities: "beam:coder:sharded_key:v1"
      capabilities: "beam:coder:nullable:v1"
      capabilities: "beam:protocol:multi_core_bundle_processing:v1"
      capabilities: "beam:protocol:progress_reporting:v1"
      capabilities: "beam:protocol:harness_monitoring_infos:v1"
      capabilities: "beam:protocol:control_request_elements_embedding:v1"
      capabilities: "beam:protocol:state_caching:v1"
      capabilities: "beam:version:sdk_base:apache/beam_java8_sdk:2.51.0.dev"
      capabilities: "beam:transform:sdf_truncate_sized_restrictions:v1"
      capabilities: "beam:transform:to_string:v1"
      capabilities: "beam:protocol:data_sampling:v1"
      dependencies: <
        type_urn: "beam:artifact:type:file:v1"
        type_payload: "\nL/tmp/artifacts/icedtea-sound-uoIQCGhMffp0D_gc1dkBtXBGXr18Bkb5Qx-e-CvP00s.jar\022@ba821008684c7dfa740ff81cd5d901b570465ebd7c0646f9431f9ef82bcfd34b"
        role_urn: "beam:artifact:role:staging_to:v1"
        role_payload: "\n=icedtea-sound-uoIQCGhMffp0D_gc1dkBtXBGXr18Bkb5Qx-e-CvP00s.jar"
      >
      dependencies: <
        type_urn: "beam:artifact:type:file:v1"
        type_payload: "\nF/tmp/artifacts/jaccess-T1qVdaqZDj2uNq1tdHEk1lwFMYQiwMhYa0jqGU9fUMg.jar\022@4f5a9575aa990e3dae36ad6d747124d65c05318422c0c8586b48ea194f5f50c8"
        role_urn: "beam:artifact:role:staging_to:v1"
        role_payload: "\n7jaccess-T1qVdaqZDj2uNq1tdHEk1lwFMYQiwMhYa0jqGU9fUMg.jar"
      >
      dependencies: <
        type_urn: "beam:artifact:type:file:v1"
        type_payload: "\nI/tmp/artifacts/localedata-dQT9YOGvbd1zEqcZsyJ1W4l8jNhxoX3b1nmMhdIbCb8.jar\022@7504fd60e1af6ddd7312a719b322755b897c8cd871a17ddbd6798c85d21b09bf"
        role_urn: "beam:artifact:role:staging_to:v1"
        role_payload: "\n:localedata-dQT9YOGvbd1zEqcZsyJ1W4l8jNhxoX3b1nmMhdIbCb8.jar"
      >
      dependencies: <
        type_urn: "beam:artifact:type:file:v1"
        type_payload: "\nF/tmp/artifacts/nashorn-gZxbPAWCb1KP7OCbxUu1prmT4YMEDX-mGdJFjkB3pfs.jar\022@819c5b3c05826f528fece09bc54bb5a6b993e183040d7fa619d2458e4077a5fb"
        role_urn: "beam:artifact:role:staging_to:v1"
        role_payload: "\n7nashorn-gZxbPAWCb1KP7OCbxUu1prmT4YMEDX-mGdJFjkB3pfs.jar"
      >
      dependencies: <
        type_urn: "beam:artifact:type:file:v1"
        type_payload: "\nG/tmp/artifacts/cldrdata-_GVjPlS0invvNh7wlTfv_CNVOxTj3Y-xvSW1Xw2r_-4.jar\022@fc65633e54b48a7bef361ef09537effc23553b14e3dd8fb1bd25b55f0dabffee"
        role_urn: "beam:artifact:role:staging_to:v1"
        role_payload: "\n8cldrdata-_GVjPlS0invvNh7wlTfv_CNVOxTj3Y-xvSW1Xw2r_-4.jar"
      >
      dependencies: <
        type_urn: "beam:artifact:type:file:v1"
        type_payload: "\nD/tmp/artifacts/dnsns-lI-xDSEZtu3C8A4-qt_7RcyP_ql7OU0LNZreNR5piTU.jar\022@948fb10d2119b6edc2f00e3eaadffb45cc8ffea97b394d0b359ade351e698935"
        role_urn: "beam:artifact:role:staging_to:v1"
        role_payload: "\n5dnsns-lI-xDSEZtu3C8A4-qt_7RcyP_ql7OU0LNZreNR5piTU.jar"
      >
      dependencies: <
        type_urn: "beam:artifact:type:file:v1"
        type_payload: "\n{/tmp/artifacts/beam-sdks-java-io-expansion-service-2.51.0-SNAPSHOT-SNAPSHOT-sdh9-LGyXe7Y5ESN6d3v1sPzLCQDF20pqUAepDIiTig.jar\022@b1d87df8b1b25deed8e4448de9ddefd6c3f32c2403176d29a9401ea432224e28"
        role_urn: "beam:artifact:role:staging_to:v1"
        role_payload: "\nlbeam-sdks-java-io-expansion-service-2.51.0-SNAPSHOT-SNAPSHOT-sdh9-LGyXe7Y5ESN6d3v1sPzLCQDF20pqUAepDIiTig.jar"
      >
    >
  >
>
root_transform_ids: "e4"
root_transform_ids: "e5"
root_transform_ids: "s1"
root_transform_ids: "s3"
2023/09/06 08:39:17 Cross-compiling <https://ci-beam.apache.org/job/beam_PostCommit_XVR_Spark3/ws/src/sdks/go/test/integration/io/xlang/kafka/kafka_test.go> with GOOS=linux GOARCH=amd64 CGO_ENABLED=0 as /tmp/worker-2-1693989557402451052
2023/09/06 08:39:19 Prepared job with id: go-testkafkaio_basicreadwrite-390_19b7485e-4b5c-4ac1-92cd-f5b8ef1fc21b and staging token: go-testkafkaio_basicreadwrite-390_19b7485e-4b5c-4ac1-92cd-f5b8ef1fc21b
2023/09/06 08:39:19 Staged binary artifact with token: 
2023/09/06 08:39:19 Submitted job: go0testkafkaio0basicreadwrite0390-jenkins-0906083919-3f07ad57_900ac720-6805-4fe8-8a18-7933d5acf814
2023/09/06 08:39:19 Job[go0testkafkaio0basicreadwrite0390-jenkins-0906083919-3f07ad57_900ac720-6805-4fe8-8a18-7933d5acf814] state: STOPPED
2023/09/06 08:39:19 Job[go0testkafkaio0basicreadwrite0390-jenkins-0906083919-3f07ad57_900ac720-6805-4fe8-8a18-7933d5acf814] state: STARTING
2023/09/06 08:39:19 Job[go0testkafkaio0basicreadwrite0390-jenkins-0906083919-3f07ad57_900ac720-6805-4fe8-8a18-7933d5acf814] state: RUNNING
2023/09/06 08:39:52 Job[go0testkafkaio0basicreadwrite0390-jenkins-0906083919-3f07ad57_900ac720-6805-4fe8-8a18-7933d5acf814] state: DONE
--- PASS: TestKafkaIO_BasicReadWrite (50.70s)
PASS
ok  	github.com/apache/beam/sdks/v2/go/test/integration/io/xlang/kafka	56.773s

> Task :runners:spark:3:job-server:validatesCrossLanguageRunnerJavaUsingPython
INFO:root:No image given, using default Python SDK image
INFO:root:Python SDK container image set to "apache/beam_python3.8_sdk:2.50.0" for Docker environment
INFO:__main__:Listening for expansion requests at 34639
INFO:root:Missing pipeline option (runner). Executing pipeline using the default runner: DirectRunner.
INFO:__main__:Shutting down expansion service.
INFO:apache_beam.runners.portability.stager:Executing command: ['/home/jenkins/.apache_beam/cache/venvs/py-3.8-beam-2.50.0-743bdccef67087512a7a190820e727aab7bdcb14/bin/python', '-m', 'pip', 'download', '--dest', '/tmp/dataflow-requirements-cache', '-r', '/tmp/tmpvf89xbaz/tmp_requirements.txt', '--exists-action', 'i', '--no-deps', '--implementation', 'cp', '--abi', 'cp38', '--platform', 'manylinux2014_x86_64']
INFO:root:No image given, using default Python SDK image
INFO:root:Python SDK container image set to "apache/beam_python3.8_sdk:2.50.0" for Docker environment
INFO:__main__:Listening for expansion requests at 44263
INFO:root:Missing pipeline option (runner). Executing pipeline using the default runner: DirectRunner.
INFO:__main__:Shutting down expansion service.

> Task :runners:spark:3:job-server:validatesCrossLanguageRunnerPythonUsingJava
> Task :runners:spark:3:job-server:validatesCrossLanguageRunnerPythonUsingSql FAILED
> Task :runners:spark:3:job-server:sparkJobServerCleanup
> Task :runners:spark:3:job-server:validatesCrossLanguageRunnerCleanup

FAILURE: Build failed with an exception.

* What went wrong:
Execution failed for task ':runners:spark:3:job-server:validatesCrossLanguageRunnerPythonUsingSql'.
> Process 'command 'sh'' finished with non-zero exit value 1

* Try:
> Run with --stacktrace option to get the stack trace.
> Run with --info or --debug option to get more log output.

* Get more help at https://help.gradle.org

Deprecated Gradle features were used in this build, making it incompatible with Gradle 8.0.

You can use '--warning-mode all' to show the individual deprecation warnings and determine if they come from your own scripts or plugins.

See https://docs.gradle.org/7.6.2/userguide/command_line_interface.html#sec:command_line_warnings

Execution optimizations have been disabled for 1 invalid unit(s) of work during this build to ensure correctness.
Please consult deprecation warnings for more details.

BUILD FAILED in 31m 11s
274 actionable tasks: 178 executed, 84 from cache, 12 up-to-date

Publishing build scan...
https://ge.apache.org/s/u532s2sbfkwgq

FATAL: command execution failed
hudson.remoting.ChannelClosedException: Channel "hudson.remoting.Channel@541ed4f1:apache-beam-jenkins-3": Remote call on apache-beam-jenkins-3 failed. The channel is closing down or has closed down
	at hudson.remoting.Channel.call(Channel.java:993)
	at hudson.remoting.RemoteInvocationHandler.invoke(RemoteInvocationHandler.java:285)
	at com.sun.proxy.$Proxy138.isAlive(Unknown Source)
	at hudson.Launcher$RemoteLauncher$ProcImpl.isAlive(Launcher.java:1215)
	at hudson.Launcher$RemoteLauncher$ProcImpl.join(Launcher.java:1207)
	at hudson.Launcher$ProcStarter.join(Launcher.java:524)
	at hudson.plugins.gradle.Gradle.perform(Gradle.java:321)
	at hudson.tasks.BuildStepMonitor$1.perform(BuildStepMonitor.java:20)
	at hudson.model.AbstractBuild$AbstractBuildExecution.perform(AbstractBuild.java:814)
	at hudson.model.Build$BuildExecution.build(Build.java:199)
	at hudson.model.Build$BuildExecution.doRun(Build.java:164)
	at hudson.model.AbstractBuild$AbstractBuildExecution.run(AbstractBuild.java:522)
	at hudson.model.Run.execute(Run.java:1896)
	at hudson.model.FreeStyleBuild.run(FreeStyleBuild.java:44)
	at hudson.model.ResourceController.execute(ResourceController.java:101)
	at hudson.model.Executor.run(Executor.java:442)
Caused by: java.io.IOException
	at hudson.remoting.Channel.close(Channel.java:1470)
	at hudson.remoting.Channel.close(Channel.java:1447)
	at hudson.slaves.SlaveComputer.closeChannel(SlaveComputer.java:902)
	at hudson.slaves.SlaveComputer.access$100(SlaveComputer.java:111)
	at hudson.slaves.SlaveComputer$2.run(SlaveComputer.java:782)
	at jenkins.util.ContextResettingExecutorService$1.run(ContextResettingExecutorService.java:28)
	at jenkins.security.ImpersonatingExecutorService$1.run(ImpersonatingExecutorService.java:68)
	at java.base/java.util.concurrent.Executors$RunnableAdapter.call(Executors.java:515)
	at java.base/java.util.concurrent.FutureTask.run(FutureTask.java:264)
	at java.base/java.util.concurrent.ThreadPoolExecutor.runWorker(ThreadPoolExecutor.java:1128)
	at java.base/java.util.concurrent.ThreadPoolExecutor$Worker.run(ThreadPoolExecutor.java:628)
	at java.base/java.lang.Thread.run(Thread.java:829)
Build step 'Invoke Gradle script' changed build result to FAILURE
Build step 'Invoke Gradle script' marked build as failure
FATAL: Channel "hudson.remoting.Channel@541ed4f1:apache-beam-jenkins-3": Remote call on apache-beam-jenkins-3 failed. The channel is closing down or has closed down
java.io.IOException
	at hudson.remoting.Channel.close(Channel.java:1470)
	at hudson.remoting.Channel.close(Channel.java:1447)
	at hudson.slaves.SlaveComputer.closeChannel(SlaveComputer.java:902)
	at hudson.slaves.SlaveComputer.access$100(SlaveComputer.java:111)
	at hudson.slaves.SlaveComputer$2.run(SlaveComputer.java:782)
	at jenkins.util.ContextResettingExecutorService$1.run(ContextResettingExecutorService.java:28)
	at jenkins.security.ImpersonatingExecutorService$1.run(ImpersonatingExecutorService.java:68)
	at java.base/java.util.concurrent.Executors$RunnableAdapter.call(Executors.java:515)
	at java.base/java.util.concurrent.FutureTask.run(FutureTask.java:264)
	at java.base/java.util.concurrent.ThreadPoolExecutor.runWorker(ThreadPoolExecutor.java:1128)
	at java.base/java.util.concurrent.ThreadPoolExecutor$Worker.run(ThreadPoolExecutor.java:628)
	at java.base/java.lang.Thread.run(Thread.java:829)
Caused: hudson.remoting.ChannelClosedException: Channel "hudson.remoting.Channel@541ed4f1:apache-beam-jenkins-3": Remote call on apache-beam-jenkins-3 failed. The channel is closing down or has closed down
	at hudson.remoting.Channel.call(Channel.java:993)
	at hudson.Launcher$RemoteLauncher.kill(Launcher.java:1150)
	at hudson.model.AbstractBuild$AbstractBuildExecution.run(AbstractBuild.java:534)
	at hudson.model.Run.execute(Run.java:1896)
	at hudson.model.FreeStyleBuild.run(FreeStyleBuild.java:44)
	at hudson.model.ResourceController.execute(ResourceController.java:101)
	at hudson.model.Executor.run(Executor.java:442)

---------------------------------------------------------------------
To unsubscribe, e-mail: builds-unsubscribe@beam.apache.org
For additional commands, e-mail: builds-help@beam.apache.org


Build failed in Jenkins: beam_PostCommit_XVR_Spark3 #3548

Posted by Apache Jenkins Server <je...@builds.apache.org>.
See <https://ci-beam.apache.org/job/beam_PostCommit_XVR_Spark3/3548/display/redirect>

Changes:


------------------------------------------
[...truncated 1.12 MB...]
    >
  >
  coders: <
    key: "mKICtPcOpMKvCoder1"
    value: <
      spec: <
        urn: "beam:coder:kv:v1"
      >
      component_coder_ids: "mKICtPcOpMVarIntCoder"
      component_coder_ids: "mKICtPcOpMSerializableCoder"
    >
  >
  coders: <
    key: "mKICtPcOpMKvCoder2"
    value: <
      spec: <
        urn: "beam:coder:kv:v1"
      >
      component_coder_ids: "mKICtPcOpMVarIntCoder"
      component_coder_ids: "mKICtPcOpMTimestampedValueCoder"
    >
  >
  coders: <
    key: "mKICtPcOpMKvCoder3"
    value: <
      spec: <
        urn: "beam:coder:kv:v1"
      >
      component_coder_ids: "mKICtPcOpMVarIntCoder"
      component_coder_ids: "mKICtPcOpMIterableCoder"
    >
  >
  coders: <
    key: "mKICtPcOpMNullableCoder"
    value: <
      spec: <
        urn: "beam:coder:nullable:v1"
      >
      component_coder_ids: "mKICtPcOpMByteArrayCoder"
    >
  >
  coders: <
    key: "mKICtPcOpMSerializableCoder"
    value: <
      spec: <
        urn: "beam:coders:javasdk:0.1"
        payload: "\202SNAPPY\000\000\000\000\001\000\000\000\001\000\000\000\312\214\002\360^\254\355\000\005sr\000,org.apache.beam.sdk.coders.SerializableCoder\010\364 \216\305ynl\002\000\001L\000\004typet\000\021Ljava/lang/Class;xr\000&ofV\000\024Custom\005P8j\260\010\235\013;\035\013\002\000\000xr\000 j\213\000\005/\034C\335\325\211\256\274~\370\001/\020pvr\000;N1\000Pio.BoundedReadFromUnb\t\021`Source$Shardd\236\240U\205\000j\363\002\000\000xp"
      >
    >
  >
  coders: <
    key: "mKICtPcOpMTimestampedValueCoder"
    value: <
      spec: <
        urn: "beam:coders:javasdk:0.1"
        payload: "\202SNAPPY\000\000\000\000\001\000\000\000\001\000\000\001?\315\003\270\254\355\000\005sr\000Aorg.apache.beam.sdk.values.TimestampedV\001\022\000$>\021\000LCoder\364\376\202p\274iX-\002\000\001L\000\nv\001)\005\030\034t\000\"Lorg/\t]\000/\001],/sdk/coders/\005$\020;xr\000*N\202\000\t%(.Structured\005/8s\277\022\016\325\3246\021\002\000\000xr\000 j9\000\005/\034C\335\325\211\256\274~\370\001/\020psr\000,j1\000(Serializabl\t\277\034\010\364 \216\305ynl\005\327\\\004typet\000\021Ljava/lang/Class\001\300\000&jV\000\024Custom\005\215Pj\260\010\235\013;\035\013\002\000\000xq\000~\000\003vr\000;N;\000Pio.BoundedReadFromUnb\t\021`Source$Shardd\236\240U\205\000j\363\002\000\000xp"
      >
    >
  >
  coders: <
    key: "mKICtPcOpMValueWithRecordIdCoder"
    value: <
      spec: <
        urn: "beam:coders:javasdk:0.1"
        payload: "\202SNAPPY\000\000\000\000\001\000\000\000\001\000\000\001\213\311\005\320\254\355\000\005sr\000Corg.apache.beam.sdk.values.ValueWithRecordId$B\022\000LCoder{\343\376bQ\014\204>\002\000\002L\000\007i\t\025\034t\000+Lorg/\t\\\000/\001\\\024/sdk/c\0012(s/ByteArray\005B\014;L\000\n\005u\005\016\010t\000\"n;\000\005$\020;xr\000*N\274\000\t`(.Structured\005/8s\277\022\016\325\3246\021\002\000\000xr\000 j9\000\005/\034C\335\325\211\256\274~\370\001/\020psr\000)j1\0006\312\000\034\351\277\005|\263\3746\333\001:\010r\000&j8\000\024Atomic\005o\034\307\354\265\314\205tPF\0015 q\000~\000\003sr\000-N;\000$io.kafka.K\001\006\000R%\227\005B<I\320\251Y\032\341{#\002\000\001L\000\007kv\005\025\010t\000$nH\001\000K\t&\000;\025s\000\"Ns\000-P\r- j\000\275\271\035\243\3126\002!\353\010\010ke)\277\001\264\000\0022\303\001\005\022\025Y\000(jY\000\030Nullabl)\372\034E\333\0336>\220\247\007\005\307]\022.O\000\001\014,\006sq\000~\000\016q\000~\000\020"
      >
    >
  >
  coders: <
    key: "mKICtPcOpMVarIntCoder"
    value: <
      spec: <
        urn: "beam:coders:javasdk:0.1"
        payload: "\202SNAPPY\000\000\000\000\001\000\000\000\001\000\000\000\210\330\001\350\254\355\000\005sr\000&org.apache.beam.sdk.coders.VarIntCoder\300K2\332\251KVh\002\000\000xrr5\000\024Atomic\0055 \307\354\265\314\205tPF\002\0055\000*jj\000$Structured\0059\034s\277\022\016\325\3246\021\t9\000 j9\000\005/0C\335\325\211\256\274~\370\002\000\000xp"
      >
    >
  >
  environments: <
    key: "go"
    value: <
      urn: "beam:env:docker:v1"
      payload: "\n\026apache/beam_go_sdk:dev"
      capabilities: "beam:protocol:progress_reporting:v1"
      capabilities: "beam:protocol:multi_core_bundle_processing:v1"
      capabilities: "beam:transform:sdf_truncate_sized_restrictions:v1"
      capabilities: "beam:protocol:worker_status:v1"
      capabilities: "beam:protocol:monitoring_info_short_ids:v1"
      capabilities: "beam:version:sdk_base:go:apache/beam_go_sdk:2.51.0.dev"
      capabilities: "beam:coder:bytes:v1"
      capabilities: "beam:coder:bool:v1"
      capabilities: "beam:coder:varint:v1"
      capabilities: "beam:coder:double:v1"
      capabilities: "beam:coder:string_utf8:v1"
      capabilities: "beam:coder:length_prefix:v1"
      capabilities: "beam:coder:kv:v1"
      capabilities: "beam:coder:iterable:v1"
      capabilities: "beam:coder:state_backed_iterable:v1"
      capabilities: "beam:coder:windowed_value:v1"
      capabilities: "beam:coder:global_window:v1"
      capabilities: "beam:coder:interval_window:v1"
      capabilities: "beam:coder:row:v1"
      capabilities: "beam:coder:nullable:v1"
      capabilities: "beam:coder:timer:v1"
      dependencies: <
        type_urn: "beam:artifact:type:file:v1"
        role_urn: "beam:artifact:role:go_worker_binary:v1"
      >
    >
  >
  environments: <
    key: "mKICtPcOpMbeam:env:docker:v1"
    value: <
      urn: "beam:env:docker:v1"
      payload: "\n apache/beam_java8_sdk:2.51.0.dev"
      capabilities: "beam:coder:bytes:v1"
      capabilities: "beam:coder:bool:v1"
      capabilities: "beam:coder:varint:v1"
      capabilities: "beam:coder:string_utf8:v1"
      capabilities: "beam:coder:iterable:v1"
      capabilities: "beam:coder:timer:v1"
      capabilities: "beam:coder:kv:v1"
      capabilities: "beam:coder:length_prefix:v1"
      capabilities: "beam:coder:global_window:v1"
      capabilities: "beam:coder:interval_window:v1"
      capabilities: "beam:coder:custom_window:v1"
      capabilities: "beam:coder:windowed_value:v1"
      capabilities: "beam:coder:double:v1"
      capabilities: "beam:coder:row:v1"
      capabilities: "beam:coder:param_windowed_value:v1"
      capabilities: "beam:coder:state_backed_iterable:v1"
      capabilities: "beam:coder:sharded_key:v1"
      capabilities: "beam:coder:nullable:v1"
      capabilities: "beam:protocol:multi_core_bundle_processing:v1"
      capabilities: "beam:protocol:progress_reporting:v1"
      capabilities: "beam:protocol:harness_monitoring_infos:v1"
      capabilities: "beam:protocol:control_request_elements_embedding:v1"
      capabilities: "beam:protocol:state_caching:v1"
      capabilities: "beam:version:sdk_base:apache/beam_java8_sdk:2.51.0.dev"
      capabilities: "beam:transform:sdf_truncate_sized_restrictions:v1"
      capabilities: "beam:transform:to_string:v1"
      capabilities: "beam:protocol:data_sampling:v1"
      dependencies: <
        type_urn: "beam:artifact:type:file:v1"
        type_payload: "\nL/tmp/artifacts/icedtea-sound-uoIQCGhMffp0D_gc1dkBtXBGXr18Bkb5Qx-e-CvP00s.jar\022@ba821008684c7dfa740ff81cd5d901b570465ebd7c0646f9431f9ef82bcfd34b"
        role_urn: "beam:artifact:role:staging_to:v1"
        role_payload: "\n=icedtea-sound-uoIQCGhMffp0D_gc1dkBtXBGXr18Bkb5Qx-e-CvP00s.jar"
      >
      dependencies: <
        type_urn: "beam:artifact:type:file:v1"
        type_payload: "\nF/tmp/artifacts/jaccess-T1qVdaqZDj2uNq1tdHEk1lwFMYQiwMhYa0jqGU9fUMg.jar\022@4f5a9575aa990e3dae36ad6d747124d65c05318422c0c8586b48ea194f5f50c8"
        role_urn: "beam:artifact:role:staging_to:v1"
        role_payload: "\n7jaccess-T1qVdaqZDj2uNq1tdHEk1lwFMYQiwMhYa0jqGU9fUMg.jar"
      >
      dependencies: <
        type_urn: "beam:artifact:type:file:v1"
        type_payload: "\nI/tmp/artifacts/localedata-dQT9YOGvbd1zEqcZsyJ1W4l8jNhxoX3b1nmMhdIbCb8.jar\022@7504fd60e1af6ddd7312a719b322755b897c8cd871a17ddbd6798c85d21b09bf"
        role_urn: "beam:artifact:role:staging_to:v1"
        role_payload: "\n:localedata-dQT9YOGvbd1zEqcZsyJ1W4l8jNhxoX3b1nmMhdIbCb8.jar"
      >
      dependencies: <
        type_urn: "beam:artifact:type:file:v1"
        type_payload: "\nF/tmp/artifacts/nashorn-gZxbPAWCb1KP7OCbxUu1prmT4YMEDX-mGdJFjkB3pfs.jar\022@819c5b3c05826f528fece09bc54bb5a6b993e183040d7fa619d2458e4077a5fb"
        role_urn: "beam:artifact:role:staging_to:v1"
        role_payload: "\n7nashorn-gZxbPAWCb1KP7OCbxUu1prmT4YMEDX-mGdJFjkB3pfs.jar"
      >
      dependencies: <
        type_urn: "beam:artifact:type:file:v1"
        type_payload: "\nG/tmp/artifacts/cldrdata-_GVjPlS0invvNh7wlTfv_CNVOxTj3Y-xvSW1Xw2r_-4.jar\022@fc65633e54b48a7bef361ef09537effc23553b14e3dd8fb1bd25b55f0dabffee"
        role_urn: "beam:artifact:role:staging_to:v1"
        role_payload: "\n8cldrdata-_GVjPlS0invvNh7wlTfv_CNVOxTj3Y-xvSW1Xw2r_-4.jar"
      >
      dependencies: <
        type_urn: "beam:artifact:type:file:v1"
        type_payload: "\nD/tmp/artifacts/dnsns-lI-xDSEZtu3C8A4-qt_7RcyP_ql7OU0LNZreNR5piTU.jar\022@948fb10d2119b6edc2f00e3eaadffb45cc8ffea97b394d0b359ade351e698935"
        role_urn: "beam:artifact:role:staging_to:v1"
        role_payload: "\n5dnsns-lI-xDSEZtu3C8A4-qt_7RcyP_ql7OU0LNZreNR5piTU.jar"
      >
      dependencies: <
        type_urn: "beam:artifact:type:file:v1"
        type_payload: "\n{/tmp/artifacts/beam-sdks-java-io-expansion-service-2.51.0-SNAPSHOT-SNAPSHOT-sdh9-LGyXe7Y5ESN6d3v1sPzLCQDF20pqUAepDIiTig.jar\022@b1d87df8b1b25deed8e4448de9ddefd6c3f32c2403176d29a9401ea432224e28"
        role_urn: "beam:artifact:role:staging_to:v1"
        role_payload: "\nlbeam-sdks-java-io-expansion-service-2.51.0-SNAPSHOT-SNAPSHOT-sdh9-LGyXe7Y5ESN6d3v1sPzLCQDF20pqUAepDIiTig.jar"
      >
    >
  >
>
root_transform_ids: "e4"
root_transform_ids: "e5"
root_transform_ids: "s1"
root_transform_ids: "s3"
2023/09/06 02:38:06 Cross-compiling <https://ci-beam.apache.org/job/beam_PostCommit_XVR_Spark3/ws/src/sdks/go/test/integration/io/xlang/kafka/kafka_test.go> with GOOS=linux GOARCH=amd64 CGO_ENABLED=0 as /tmp/worker-2-1693967886121730540
2023/09/06 02:38:08 Prepared job with id: go-testkafkaio_basicreadwrite-839_add1c277-271d-44db-ae28-40c163aac578 and staging token: go-testkafkaio_basicreadwrite-839_add1c277-271d-44db-ae28-40c163aac578
2023/09/06 02:38:08 Staged binary artifact with token: 
2023/09/06 02:38:08 Submitted job: go0testkafkaio0basicreadwrite0839-jenkins-0906023808-9cbb6781_f6201d81-1f02-442f-bc15-c71f9cc70099
2023/09/06 02:38:08 Job[go0testkafkaio0basicreadwrite0839-jenkins-0906023808-9cbb6781_f6201d81-1f02-442f-bc15-c71f9cc70099] state: STOPPED
2023/09/06 02:38:08 Job[go0testkafkaio0basicreadwrite0839-jenkins-0906023808-9cbb6781_f6201d81-1f02-442f-bc15-c71f9cc70099] state: STARTING
2023/09/06 02:38:08 Job[go0testkafkaio0basicreadwrite0839-jenkins-0906023808-9cbb6781_f6201d81-1f02-442f-bc15-c71f9cc70099] state: RUNNING
2023/09/06 02:38:30 Job[go0testkafkaio0basicreadwrite0839-jenkins-0906023808-9cbb6781_f6201d81-1f02-442f-bc15-c71f9cc70099] state: DONE
--- PASS: TestKafkaIO_BasicReadWrite (39.40s)
PASS
ok  	github.com/apache/beam/sdks/v2/go/test/integration/io/xlang/kafka	45.434s

> Task :runners:spark:3:job-server:validatesCrossLanguageRunnerJavaUsingPython
INFO:root:No image given, using default Python SDK image
INFO:root:Python SDK container image set to "apache/beam_python3.8_sdk:2.50.0" for Docker environment
INFO:__main__:Listening for expansion requests at 44207
INFO:root:Missing pipeline option (runner). Executing pipeline using the default runner: DirectRunner.
INFO:__main__:Shutting down expansion service.
INFO:apache_beam.runners.portability.stager:Executing command: ['/home/jenkins/.apache_beam/cache/venvs/py-3.8-beam-2.50.0-743bdccef67087512a7a190820e727aab7bdcb14/bin/python', '-m', 'pip', 'download', '--dest', '/tmp/dataflow-requirements-cache', '-r', '/tmp/tmp8avetpna/tmp_requirements.txt', '--exists-action', 'i', '--no-deps', '--implementation', 'cp', '--abi', 'cp38', '--platform', 'manylinux2014_x86_64']
INFO:root:No image given, using default Python SDK image
INFO:root:Python SDK container image set to "apache/beam_python3.8_sdk:2.50.0" for Docker environment
INFO:__main__:Listening for expansion requests at 40405
INFO:root:Missing pipeline option (runner). Executing pipeline using the default runner: DirectRunner.
INFO:__main__:Shutting down expansion service.

> Task :runners:spark:3:job-server:validatesCrossLanguageRunnerPythonUsingJava
> Task :runners:spark:3:job-server:validatesCrossLanguageRunnerPythonUsingSql FAILED
> Task :runners:spark:3:job-server:sparkJobServerCleanup
> Task :runners:spark:3:job-server:validatesCrossLanguageRunnerCleanup

FAILURE: Build failed with an exception.

* What went wrong:
Execution failed for task ':runners:spark:3:job-server:validatesCrossLanguageRunnerPythonUsingSql'.
> Process 'command 'sh'' finished with non-zero exit value 1

* Try:
> Run with --stacktrace option to get the stack trace.
> Run with --info or --debug option to get more log output.

* Get more help at https://help.gradle.org

Deprecated Gradle features were used in this build, making it incompatible with Gradle 8.0.

You can use '--warning-mode all' to show the individual deprecation warnings and determine if they come from your own scripts or plugins.

See https://docs.gradle.org/7.6.2/userguide/command_line_interface.html#sec:command_line_warnings

Execution optimizations have been disabled for 1 invalid unit(s) of work during this build to ensure correctness.
Please consult deprecation warnings for more details.

BUILD FAILED in 30m 8s
274 actionable tasks: 179 executed, 83 from cache, 12 up-to-date

Publishing build scan...
https://ge.apache.org/s/sgdc2jnpwq44y

Build step 'Invoke Gradle script' changed build result to FAILURE
Build step 'Invoke Gradle script' marked build as failure

---------------------------------------------------------------------
To unsubscribe, e-mail: builds-unsubscribe@beam.apache.org
For additional commands, e-mail: builds-help@beam.apache.org