You are viewing a plain text version of this content. The canonical link for it is here.
Posted to builds@beam.apache.org by Apache Jenkins Server <je...@builds.apache.org> on 2018/12/11 15:01:13 UTC
Build failed in Jenkins: beam_PostCommit_Py_VR_Dataflow #1986
See <https://builds.apache.org/job/beam_PostCommit_Py_VR_Dataflow/1986/display/redirect?page=changes>
Changes:
[robertwb] [BEAM-6186] Move combiner lifting out of line.
[robertwb] [BEAM-4678] Support combiner lifting in portable Flink runner.
------------------------------------------
[...truncated 273.38 KB...]
# Add --dataflow_worker_jar if provided
if [[ ! -z "$WORKER_JAR" ]]; then
opts+=("--dataflow_worker_jar=$WORKER_JAR")
fi
PIPELINE_OPTS=$(IFS=" " ; echo "${opts[*]}")
fi
pwd | sed 's/sdks\/python.*/sdks\/python/'
find ${SDK_LOCATION}
find ${SDK_LOCATION}
IFS=" " ; echo "${opts[*]}"
###########################################################################
# Run tests and validate that jobs finish successfully.
>>> RUNNING integration tests with pipeline options: --runner=TestDataflowRunner --project=apache-beam-testing --staging_location=gs://temp-storage-for-end-to-end-tests/staging-it --temp_location=gs://temp-storage-for-end-to-end-tests/temp-it --output=gs://temp-storage-for-end-to-end-tests/py-it-cloud/output --sdk_location=build/apache-beam.tar.gz --requirements_file=postcommit_requirements.txt --num_workers=1 --sleep_secs=20 --streaming --dataflow_worker_jar=<https://builds.apache.org/job/beam_PostCommit_Py_VR_Dataflow/ws/src/runners/google-cloud-dataflow-java/worker/build/libs/beam-runners-google-cloud-dataflow-java-fn-api-worker-2.10.0-SNAPSHOT.jar>
echo ">>> RUNNING integration tests with pipeline options: $PIPELINE_OPTS"
python setup.py nosetests \
--test-pipeline-options="$PIPELINE_OPTS" \
$TEST_OPTS
<https://builds.apache.org/job/beam_PostCommit_Py_VR_Dataflow/ws/src/build/gradleenv/1327086738/local/lib/python2.7/site-packages/setuptools/dist.py>:470: UserWarning: Normalizing '2.10.0.dev' to '2.10.0.dev0'
normalized_version,
running nosetests
running egg_info
writing requirements to apache_beam.egg-info/requires.txt
writing apache_beam.egg-info/PKG-INFO
writing top-level names to apache_beam.egg-info/top_level.txt
writing dependency_links to apache_beam.egg-info/dependency_links.txt
writing entry points to apache_beam.egg-info/entry_points.txt
reading manifest file 'apache_beam.egg-info/SOURCES.txt'
reading manifest template 'MANIFEST.in'
warning: no files found matching 'README.md'
warning: no files found matching 'NOTICE'
warning: no files found matching 'LICENSE'
writing manifest file 'apache_beam.egg-info/SOURCES.txt'
test_flatten_multiple_pcollections_having_multiple_consumers (apache_beam.transforms.ptransform_test.PTransformTest) ... ok
test_multiple_empty_outputs (apache_beam.transforms.ptransform_test.PTransformTest) ... ok
test_par_do_with_multiple_outputs_and_using_return (apache_beam.transforms.ptransform_test.PTransformTest) ... ok
test_as_dict_twice (apache_beam.transforms.sideinputs_test.SideInputsTest) ... ok
test_par_do_with_multiple_outputs_and_using_yield (apache_beam.transforms.ptransform_test.PTransformTest) ... ok
test_as_list_and_as_dict_side_inputs (apache_beam.transforms.sideinputs_test.SideInputsTest) ... ok
test_as_list_twice (apache_beam.transforms.sideinputs_test.SideInputsTest) ... ok
test_undeclared_outputs (apache_beam.transforms.ptransform_test.PTransformTest) ... ok
test_empty_singleton_side_input (apache_beam.transforms.sideinputs_test.SideInputsTest) ... ERROR
test_iterable_side_input (apache_beam.transforms.sideinputs_test.SideInputsTest) ... ERROR
test_flattened_side_input (apache_beam.transforms.sideinputs_test.SideInputsTest) ... ERROR
test_as_singleton_with_different_defaults (apache_beam.transforms.sideinputs_test.SideInputsTest) ... ok
test_default_value_singleton_side_input (apache_beam.transforms.sideinputs_test.SideInputsTest) ... ok
test_as_singleton_without_unique_labels (apache_beam.transforms.sideinputs_test.SideInputsTest) ... ok
======================================================================
ERROR: test_empty_singleton_side_input (apache_beam.transforms.sideinputs_test.SideInputsTest)
----------------------------------------------------------------------
Traceback (most recent call last):
File "<https://builds.apache.org/job/beam_PostCommit_Py_VR_Dataflow/ws/src/sdks/python/apache_beam/transforms/sideinputs_test.py",> line 149, in test_empty_singleton_side_input
pipeline.run()
File "<https://builds.apache.org/job/beam_PostCommit_Py_VR_Dataflow/ws/src/sdks/python/apache_beam/testing/test_pipeline.py",> line 107, in run
else test_runner_api))
File "<https://builds.apache.org/job/beam_PostCommit_Py_VR_Dataflow/ws/src/sdks/python/apache_beam/pipeline.py",> line 405, in run
self._options).run(False)
File "<https://builds.apache.org/job/beam_PostCommit_Py_VR_Dataflow/ws/src/sdks/python/apache_beam/pipeline.py",> line 418, in run
return self.runner.run_pipeline(self, self._options)
File "<https://builds.apache.org/job/beam_PostCommit_Py_VR_Dataflow/ws/src/sdks/python/apache_beam/runners/dataflow/test_dataflow_runner.py",> line 53, in run_pipeline
pipeline, options)
File "<https://builds.apache.org/job/beam_PostCommit_Py_VR_Dataflow/ws/src/sdks/python/apache_beam/runners/dataflow/dataflow_runner.py",> line 393, in run_pipeline
self.dataflow_client.create_job(self.job), self)
File "<https://builds.apache.org/job/beam_PostCommit_Py_VR_Dataflow/ws/src/sdks/python/apache_beam/utils/retry.py",> line 184, in wrapper
return fun(*args, **kwargs)
File "<https://builds.apache.org/job/beam_PostCommit_Py_VR_Dataflow/ws/src/sdks/python/apache_beam/runners/dataflow/internal/apiclient.py",> line 503, in create_job
self.create_job_description(job)
File "<https://builds.apache.org/job/beam_PostCommit_Py_VR_Dataflow/ws/src/sdks/python/apache_beam/runners/dataflow/internal/apiclient.py",> line 532, in create_job_description
resources = self._stage_resources(job.options)
File "<https://builds.apache.org/job/beam_PostCommit_Py_VR_Dataflow/ws/src/sdks/python/apache_beam/runners/dataflow/internal/apiclient.py",> line 465, in _stage_resources
staging_location=google_cloud_options.staging_location)
File "<https://builds.apache.org/job/beam_PostCommit_Py_VR_Dataflow/ws/src/sdks/python/apache_beam/runners/portability/stager.py",> line 166, in stage_job_resources
requirements_cache_path)
File "<https://builds.apache.org/job/beam_PostCommit_Py_VR_Dataflow/ws/src/sdks/python/apache_beam/utils/retry.py",> line 184, in wrapper
return fun(*args, **kwargs)
File "<https://builds.apache.org/job/beam_PostCommit_Py_VR_Dataflow/ws/src/sdks/python/apache_beam/runners/portability/stager.py",> line 426, in _populate_requirements_cache
processes.check_output(cmd_args, stderr=processes.STDOUT)
File "<https://builds.apache.org/job/beam_PostCommit_Py_VR_Dataflow/ws/src/sdks/python/apache_beam/utils/processes.py",> line 53, in check_output
return subprocess.check_output(*args, **kwargs)
File "/usr/lib/python2.7/subprocess.py", line 567, in check_output
process = Popen(stdout=PIPE, *popenargs, **kwargs)
File "/usr/lib/python2.7/subprocess.py", line 711, in __init__
errread, errwrite)
File "/usr/lib/python2.7/subprocess.py", line 1235, in _execute_child
self.pid = os.fork()
OSError: [Errno 12] Cannot allocate memory
-------------------- >> begin captured logging << --------------------
root: DEBUG: Connecting using Google Application Default Credentials.
root: INFO: Starting GCS upload to gs://temp-storage-for-end-to-end-tests/staging-it/beamapp-jenkins-1211145305-692876.1544539985.692990/pipeline.pb...
oauth2client.transport: INFO: Attempting refresh to obtain initial access_token
oauth2client.transport: INFO: Attempting refresh to obtain initial access_token
root: INFO: Completed GCS upload to gs://temp-storage-for-end-to-end-tests/staging-it/beamapp-jenkins-1211145305-692876.1544539985.692990/pipeline.pb
root: INFO: Starting GCS upload to gs://temp-storage-for-end-to-end-tests/staging-it/beamapp-jenkins-1211145305-692876.1544539985.692990/requirements.txt...
root: INFO: Completed GCS upload to gs://temp-storage-for-end-to-end-tests/staging-it/beamapp-jenkins-1211145305-692876.1544539985.692990/requirements.txt
root: INFO: Executing command: ['<https://builds.apache.org/job/beam_PostCommit_Py_VR_Dataflow/ws/src/build/gradleenv/1327086738/bin/python',> '-m', 'pip', 'download', '--dest', '/tmp/dataflow-requirements-cache', '-r', 'postcommit_requirements.txt', '--exists-action', 'i', '--no-binary', ':all:']
--------------------- >> end captured logging << ---------------------
======================================================================
ERROR: test_iterable_side_input (apache_beam.transforms.sideinputs_test.SideInputsTest)
----------------------------------------------------------------------
Traceback (most recent call last):
File "<https://builds.apache.org/job/beam_PostCommit_Py_VR_Dataflow/ws/src/sdks/python/apache_beam/transforms/sideinputs_test.py",> line 182, in test_iterable_side_input
pipeline.run()
File "<https://builds.apache.org/job/beam_PostCommit_Py_VR_Dataflow/ws/src/sdks/python/apache_beam/testing/test_pipeline.py",> line 107, in run
else test_runner_api))
File "<https://builds.apache.org/job/beam_PostCommit_Py_VR_Dataflow/ws/src/sdks/python/apache_beam/pipeline.py",> line 405, in run
self._options).run(False)
File "<https://builds.apache.org/job/beam_PostCommit_Py_VR_Dataflow/ws/src/sdks/python/apache_beam/pipeline.py",> line 418, in run
return self.runner.run_pipeline(self, self._options)
File "<https://builds.apache.org/job/beam_PostCommit_Py_VR_Dataflow/ws/src/sdks/python/apache_beam/runners/dataflow/test_dataflow_runner.py",> line 53, in run_pipeline
pipeline, options)
File "<https://builds.apache.org/job/beam_PostCommit_Py_VR_Dataflow/ws/src/sdks/python/apache_beam/runners/dataflow/dataflow_runner.py",> line 393, in run_pipeline
self.dataflow_client.create_job(self.job), self)
File "<https://builds.apache.org/job/beam_PostCommit_Py_VR_Dataflow/ws/src/sdks/python/apache_beam/utils/retry.py",> line 184, in wrapper
return fun(*args, **kwargs)
File "<https://builds.apache.org/job/beam_PostCommit_Py_VR_Dataflow/ws/src/sdks/python/apache_beam/runners/dataflow/internal/apiclient.py",> line 503, in create_job
self.create_job_description(job)
File "<https://builds.apache.org/job/beam_PostCommit_Py_VR_Dataflow/ws/src/sdks/python/apache_beam/runners/dataflow/internal/apiclient.py",> line 532, in create_job_description
resources = self._stage_resources(job.options)
File "<https://builds.apache.org/job/beam_PostCommit_Py_VR_Dataflow/ws/src/sdks/python/apache_beam/runners/dataflow/internal/apiclient.py",> line 465, in _stage_resources
staging_location=google_cloud_options.staging_location)
File "<https://builds.apache.org/job/beam_PostCommit_Py_VR_Dataflow/ws/src/sdks/python/apache_beam/runners/portability/stager.py",> line 166, in stage_job_resources
requirements_cache_path)
File "<https://builds.apache.org/job/beam_PostCommit_Py_VR_Dataflow/ws/src/sdks/python/apache_beam/utils/retry.py",> line 184, in wrapper
return fun(*args, **kwargs)
File "<https://builds.apache.org/job/beam_PostCommit_Py_VR_Dataflow/ws/src/sdks/python/apache_beam/runners/portability/stager.py",> line 426, in _populate_requirements_cache
processes.check_output(cmd_args, stderr=processes.STDOUT)
File "<https://builds.apache.org/job/beam_PostCommit_Py_VR_Dataflow/ws/src/sdks/python/apache_beam/utils/processes.py",> line 53, in check_output
return subprocess.check_output(*args, **kwargs)
File "/usr/lib/python2.7/subprocess.py", line 567, in check_output
process = Popen(stdout=PIPE, *popenargs, **kwargs)
File "/usr/lib/python2.7/subprocess.py", line 711, in __init__
errread, errwrite)
File "/usr/lib/python2.7/subprocess.py", line 1235, in _execute_child
self.pid = os.fork()
OSError: [Errno 12] Cannot allocate memory
-------------------- >> begin captured logging << --------------------
root: DEBUG: Connecting using Google Application Default Credentials.
root: INFO: Starting GCS upload to gs://temp-storage-for-end-to-end-tests/staging-it/beamapp-jenkins-1211145305-701692.1544539985.701832/pipeline.pb...
oauth2client.transport: INFO: Attempting refresh to obtain initial access_token
oauth2client.transport: INFO: Attempting refresh to obtain initial access_token
root: INFO: Completed GCS upload to gs://temp-storage-for-end-to-end-tests/staging-it/beamapp-jenkins-1211145305-701692.1544539985.701832/pipeline.pb
root: INFO: Starting GCS upload to gs://temp-storage-for-end-to-end-tests/staging-it/beamapp-jenkins-1211145305-701692.1544539985.701832/requirements.txt...
root: INFO: Completed GCS upload to gs://temp-storage-for-end-to-end-tests/staging-it/beamapp-jenkins-1211145305-701692.1544539985.701832/requirements.txt
root: INFO: Executing command: ['<https://builds.apache.org/job/beam_PostCommit_Py_VR_Dataflow/ws/src/build/gradleenv/1327086738/bin/python',> '-m', 'pip', 'download', '--dest', '/tmp/dataflow-requirements-cache', '-r', 'postcommit_requirements.txt', '--exists-action', 'i', '--no-binary', ':all:']
--------------------- >> end captured logging << ---------------------
======================================================================
ERROR: test_flattened_side_input (apache_beam.transforms.sideinputs_test.SideInputsTest)
----------------------------------------------------------------------
Traceback (most recent call last):
File "<https://builds.apache.org/job/beam_PostCommit_Py_VR_Dataflow/ws/src/sdks/python/apache_beam/transforms/sideinputs_test.py",> line 310, in test_flattened_side_input
pipeline.run()
File "<https://builds.apache.org/job/beam_PostCommit_Py_VR_Dataflow/ws/src/sdks/python/apache_beam/testing/test_pipeline.py",> line 107, in run
else test_runner_api))
File "<https://builds.apache.org/job/beam_PostCommit_Py_VR_Dataflow/ws/src/sdks/python/apache_beam/pipeline.py",> line 405, in run
self._options).run(False)
File "<https://builds.apache.org/job/beam_PostCommit_Py_VR_Dataflow/ws/src/sdks/python/apache_beam/pipeline.py",> line 418, in run
return self.runner.run_pipeline(self, self._options)
File "<https://builds.apache.org/job/beam_PostCommit_Py_VR_Dataflow/ws/src/sdks/python/apache_beam/runners/dataflow/test_dataflow_runner.py",> line 53, in run_pipeline
pipeline, options)
File "<https://builds.apache.org/job/beam_PostCommit_Py_VR_Dataflow/ws/src/sdks/python/apache_beam/runners/dataflow/dataflow_runner.py",> line 393, in run_pipeline
self.dataflow_client.create_job(self.job), self)
File "<https://builds.apache.org/job/beam_PostCommit_Py_VR_Dataflow/ws/src/sdks/python/apache_beam/utils/retry.py",> line 184, in wrapper
return fun(*args, **kwargs)
File "<https://builds.apache.org/job/beam_PostCommit_Py_VR_Dataflow/ws/src/sdks/python/apache_beam/runners/dataflow/internal/apiclient.py",> line 503, in create_job
self.create_job_description(job)
File "<https://builds.apache.org/job/beam_PostCommit_Py_VR_Dataflow/ws/src/sdks/python/apache_beam/runners/dataflow/internal/apiclient.py",> line 532, in create_job_description
resources = self._stage_resources(job.options)
File "<https://builds.apache.org/job/beam_PostCommit_Py_VR_Dataflow/ws/src/sdks/python/apache_beam/runners/dataflow/internal/apiclient.py",> line 465, in _stage_resources
staging_location=google_cloud_options.staging_location)
File "<https://builds.apache.org/job/beam_PostCommit_Py_VR_Dataflow/ws/src/sdks/python/apache_beam/runners/portability/stager.py",> line 166, in stage_job_resources
requirements_cache_path)
File "<https://builds.apache.org/job/beam_PostCommit_Py_VR_Dataflow/ws/src/sdks/python/apache_beam/utils/retry.py",> line 184, in wrapper
return fun(*args, **kwargs)
File "<https://builds.apache.org/job/beam_PostCommit_Py_VR_Dataflow/ws/src/sdks/python/apache_beam/runners/portability/stager.py",> line 426, in _populate_requirements_cache
processes.check_output(cmd_args, stderr=processes.STDOUT)
File "<https://builds.apache.org/job/beam_PostCommit_Py_VR_Dataflow/ws/src/sdks/python/apache_beam/utils/processes.py",> line 53, in check_output
return subprocess.check_output(*args, **kwargs)
File "/usr/lib/python2.7/subprocess.py", line 567, in check_output
process = Popen(stdout=PIPE, *popenargs, **kwargs)
File "/usr/lib/python2.7/subprocess.py", line 711, in __init__
errread, errwrite)
File "/usr/lib/python2.7/subprocess.py", line 1235, in _execute_child
self.pid = os.fork()
OSError: [Errno 12] Cannot allocate memory
-------------------- >> begin captured logging << --------------------
root: DEBUG: Connecting using Google Application Default Credentials.
root: INFO: Starting GCS upload to gs://temp-storage-for-end-to-end-tests/staging-it/beamapp-jenkins-1211145305-689750.1544539985.689885/pipeline.pb...
oauth2client.transport: INFO: Attempting refresh to obtain initial access_token
oauth2client.transport: INFO: Attempting refresh to obtain initial access_token
root: INFO: Completed GCS upload to gs://temp-storage-for-end-to-end-tests/staging-it/beamapp-jenkins-1211145305-689750.1544539985.689885/pipeline.pb
root: INFO: Starting GCS upload to gs://temp-storage-for-end-to-end-tests/staging-it/beamapp-jenkins-1211145305-689750.1544539985.689885/requirements.txt...
root: INFO: Completed GCS upload to gs://temp-storage-for-end-to-end-tests/staging-it/beamapp-jenkins-1211145305-689750.1544539985.689885/requirements.txt
root: INFO: Executing command: ['<https://builds.apache.org/job/beam_PostCommit_Py_VR_Dataflow/ws/src/build/gradleenv/1327086738/bin/python',> '-m', 'pip', 'download', '--dest', '/tmp/dataflow-requirements-cache', '-r', 'postcommit_requirements.txt', '--exists-action', 'i', '--no-binary', ':all:']
--------------------- >> end captured logging << ---------------------
----------------------------------------------------------------------
XML: <https://builds.apache.org/job/beam_PostCommit_Py_VR_Dataflow/ws/src/sdks/python/nosetests.xml>
----------------------------------------------------------------------
Ran 14 tests in 1013.729s
FAILED (errors=3)
Found: https://console.cloud.google.com/dataflow/jobsDetail/locations/us-central1/jobs/2018-12-11_06_44_25-5579492656988631720?project=apache-beam-testing.
Found: https://console.cloud.google.com/dataflow/jobsDetail/locations/us-central1/jobs/2018-12-11_06_54_01-13490397389917227254?project=apache-beam-testing.
Found: https://console.cloud.google.com/dataflow/jobsDetail/locations/us-central1/jobs/2018-12-11_06_44_26-7177741542037173547?project=apache-beam-testing.
Found: https://console.cloud.google.com/dataflow/jobsDetail/locations/us-central1/jobs/2018-12-11_06_50_49-6667144718328876839?project=apache-beam-testing.
Found: https://console.cloud.google.com/dataflow/jobsDetail/locations/us-central1/jobs/2018-12-11_06_44_28-14238319677828954862?project=apache-beam-testing.
Found: https://console.cloud.google.com/dataflow/jobsDetail/locations/us-central1/jobs/2018-12-11_06_54_01-12988389856912846851?project=apache-beam-testing.
Found: https://console.cloud.google.com/dataflow/jobsDetail/locations/us-central1/jobs/2018-12-11_06_44_24-13470736152015672338?project=apache-beam-testing.
Found: https://console.cloud.google.com/dataflow/jobsDetail/locations/us-central1/jobs/2018-12-11_06_44_24-4364935219481228124?project=apache-beam-testing.
Found: https://console.cloud.google.com/dataflow/jobsDetail/locations/us-central1/jobs/2018-12-11_06_44_27-17302685453488640230?project=apache-beam-testing.
Found: https://console.cloud.google.com/dataflow/jobsDetail/locations/us-central1/jobs/2018-12-11_06_44_24-4652552870733582302?project=apache-beam-testing.
Found: https://console.cloud.google.com/dataflow/jobsDetail/locations/us-central1/jobs/2018-12-11_06_44_24-1299296486857574536?project=apache-beam-testing.
> Task :beam-sdks-python:validatesRunnerStreamingTests FAILED
:beam-sdks-python:validatesRunnerStreamingTests (Thread[Task worker for ':',5,main]) completed. Took 16 mins 56.69 secs.
FAILURE: Build failed with an exception.
* Where:
Build file '<https://builds.apache.org/job/beam_PostCommit_Py_VR_Dataflow/ws/src/sdks/python/build.gradle'> line: 304
* What went wrong:
Execution failed for task ':beam-sdks-python:validatesRunnerStreamingTests'.
> Process 'command 'sh'' finished with non-zero exit value 1
* Try:
Run with --stacktrace option to get the stack trace. Run with --debug option to get more log output. Run with --scan to get full insights.
* Get more help at https://help.gradle.org
Deprecated Gradle features were used in this build, making it incompatible with Gradle 5.0.
Use '--warning-mode all' to show the individual deprecation warnings.
See https://docs.gradle.org/4.10.2/userguide/command_line_interface.html#sec:command_line_warnings
BUILD FAILED in 31m 41s
60 actionable tasks: 55 executed, 5 from cache
Publishing build scan...
https://gradle.com/s/e47wf2lf326uc
Build step 'Invoke Gradle script' changed build result to FAILURE
Build step 'Invoke Gradle script' marked build as failure
---------------------------------------------------------------------
To unsubscribe, e-mail: builds-unsubscribe@beam.apache.org
For additional commands, e-mail: builds-help@beam.apache.org
Jenkins build is back to normal : beam_PostCommit_Py_VR_Dataflow
#1987
Posted by Apache Jenkins Server <je...@builds.apache.org>.
See <https://builds.apache.org/job/beam_PostCommit_Py_VR_Dataflow/1987/display/redirect>
---------------------------------------------------------------------
To unsubscribe, e-mail: builds-unsubscribe@beam.apache.org
For additional commands, e-mail: builds-help@beam.apache.org