You are viewing a plain text version of this content. The canonical link for it is here.
Posted to dev@brooklyn.apache.org by Apache Jenkins Server <je...@builds.apache.org> on 2023/09/21 17:39:06 UTC
Build failed in Jenkins: Brooklyn » Brooklyn » master #850
See <https://ci-builds.apache.org/job/Brooklyn/job/brooklyn/job/master/850/display/redirect>
Changes:
------------------------------------------
[...truncated 31773 lines...]
at org.testng.SuiteRunner.run(SuiteRunner.java:286)
at org.testng.SuiteRunnerWorker.runSuite(SuiteRunnerWorker.java:53)
at org.testng.SuiteRunnerWorker.run(SuiteRunnerWorker.java:96)
at org.testng.TestNG.runSuitesSequentially(TestNG.java:1218)
at org.testng.TestNG.runSuitesLocally(TestNG.java:1140)
at org.testng.TestNG.runSuites(TestNG.java:1069)
at org.testng.TestNG.run(TestNG.java:1037)
at org.apache.maven.surefire.testng.TestNGExecutor.run(TestNGExecutor.java:132)
at org.apache.maven.surefire.testng.TestNGDirectoryTestSuite.executeMulti(TestNGDirectoryTestSuite.java:193)
at org.apache.maven.surefire.testng.TestNGDirectoryTestSuite.execute(TestNGDirectoryTestSuite.java:94)
at org.apache.maven.surefire.testng.TestNGProvider.invoke(TestNGProvider.java:147)
at org.apache.maven.surefire.booter.ForkedBooter.invokeProviderInSameClassLoader(ForkedBooter.java:290)
at org.apache.maven.surefire.booter.ForkedBooter.runSuitesInProcess(ForkedBooter.java:242)
at org.apache.maven.surefire.booter.ForkedBooter.main(ForkedBooter.java:121)
2023-09-21 17:32:37,431 INFO t.r.usage BrooklynLeakListener.onFinish attempting to terminate all extant ManagementContexts: name=Surefire test; includedGroups=[]; excludedGroups=[Acceptance, Integration, Live, Live-sanity, Broken, WIP]; suiteName=Surefire suite; outDir=/home/jenkins/workspace/Brooklyn_brooklyn_master/brooklyn-server/core/target/surefire-reports/testng-native-results/Surefire suite: 2 ManagementContexts terminated
[GC (Allocation Failure) 366306K->137418K(771584K), 0.0145631 secs]
[GC (Allocation Failure) 369866K->135874K(771584K), 0.0134437 secs]
2023-09-21 17:32:39,135 INFO o.a.b.t.s.LoggingVerboseReporter TESTNG RUNNING: Suite: "Surefire test" containing "0" Tests (config: null)
2023-09-21 17:32:39,484 INFO o.a.b.t.s.LoggingVerboseReporter TESTNG INVOKING: "Surefire test" - org.apache.brooklyn.util.core.logbook.opensearch.OpenSearchLogStoreTest.queryWithDateTimeTo()
2023-09-21 17:32:39,488 INFO o.a.b.t.s.LoggingVerboseReporter TESTNG PASSED: "Surefire test" - org.apache.brooklyn.util.core.logbook.opensearch.OpenSearchLogStoreTest.queryWithDateTimeTo() finished in 13 ms
2023-09-21 17:32:39,489 INFO o.a.b.t.s.LoggingVerboseReporter TESTNG INVOKING: "Surefire test" - org.apache.brooklyn.util.core.logbook.opensearch.OpenSearchLogStoreTest.queryWithEntityId()
2023-09-21 17:32:39,489 INFO o.a.b.t.s.LoggingVerboseReporter TESTNG PASSED: "Surefire test" - org.apache.brooklyn.util.core.logbook.opensearch.OpenSearchLogStoreTest.queryWithEntityId() finished in 14 ms
2023-09-21 17:32:39,489 INFO o.a.b.t.s.LoggingVerboseReporter TESTNG INVOKING: "Surefire test" - org.apache.brooklyn.util.core.logbook.opensearch.OpenSearchLogStoreTest.queryWithSearchSinglePhrase()
2023-09-21 17:32:39,489 INFO o.a.b.t.s.LoggingVerboseReporter TESTNG PASSED: "Surefire test" - org.apache.brooklyn.util.core.logbook.opensearch.OpenSearchLogStoreTest.queryWithSearchSinglePhrase() finished in 14 ms
2023-09-21 17:32:39,490 INFO o.a.b.t.s.LoggingVerboseReporter TESTNG INVOKING: "Surefire test" - org.apache.brooklyn.util.core.logbook.opensearch.OpenSearchLogStoreTest.queryWithEntityIdAndPhrase()
2023-09-21 17:32:39,490 INFO o.a.b.t.s.LoggingVerboseReporter TESTNG PASSED: "Surefire test" - org.apache.brooklyn.util.core.logbook.opensearch.OpenSearchLogStoreTest.queryWithEntityIdAndPhrase() finished in 15 ms
2023-09-21 17:32:39,490 INFO o.a.b.t.s.LoggingVerboseReporter TESTNG INVOKING: "Surefire test" - org.apache.brooklyn.util.core.logbook.opensearch.OpenSearchLogStoreTest.queryWithTaskId()
2023-09-21 17:32:39,490 INFO o.a.b.t.s.LoggingVerboseReporter TESTNG PASSED: "Surefire test" - org.apache.brooklyn.util.core.logbook.opensearch.OpenSearchLogStoreTest.queryWithTaskId() finished in 15 ms
2023-09-21 17:32:39,490 INFO o.a.b.t.s.LoggingVerboseReporter TESTNG INVOKING: "Surefire test" - org.apache.brooklyn.util.core.logbook.opensearch.OpenSearchLogStoreTest.queryWithTimeRange()
2023-09-21 17:32:39,490 INFO o.a.b.t.s.LoggingVerboseReporter TESTNG PASSED: "Surefire test" - org.apache.brooklyn.util.core.logbook.opensearch.OpenSearchLogStoreTest.queryWithTimeRange() finished in 14 ms
2023-09-21 17:32:39,491 INFO o.a.b.t.s.LoggingVerboseReporter TESTNG INVOKING: "Surefire test" - org.apache.brooklyn.util.core.logbook.opensearch.OpenSearchLogStoreTest.queryWithTaskIdAndPhrase()
2023-09-21 17:32:39,492 INFO o.a.b.t.s.LoggingVerboseReporter TESTNG PASSED: "Surefire test" - org.apache.brooklyn.util.core.logbook.opensearch.OpenSearchLogStoreTest.queryWithTaskIdAndPhrase() finished in 16 ms
2023-09-21 17:32:39,492 INFO o.a.b.t.s.LoggingVerboseReporter TESTNG INVOKING: "Surefire test" - org.apache.brooklyn.util.core.logbook.opensearch.OpenSearchLogStoreTest.queryWithTwoLogLevel()
2023-09-21 17:32:39,493 INFO o.a.b.t.s.LoggingVerboseReporter TESTNG PASSED: "Surefire test" - org.apache.brooklyn.util.core.logbook.opensearch.OpenSearchLogStoreTest.queryWithTwoLogLevel() finished in 17 ms
2023-09-21 17:32:39,494 INFO o.a.b.t.s.LoggingVerboseReporter TESTNG INVOKING: "Surefire test" - org.apache.brooklyn.util.core.logbook.opensearch.OpenSearchLogStoreTest.queryWithOneLogLevelAndRange()
2023-09-21 17:32:39,494 INFO o.a.b.t.s.LoggingVerboseReporter TESTNG PASSED: "Surefire test" - org.apache.brooklyn.util.core.logbook.opensearch.OpenSearchLogStoreTest.queryWithOneLogLevelAndRange() finished in 18 ms
2023-09-21 17:32:39,494 INFO o.a.b.t.s.LoggingVerboseReporter TESTNG INVOKING: "Surefire test" - org.apache.brooklyn.util.core.logbook.opensearch.OpenSearchLogStoreTest.queryWithDateTimeFrom()
2023-09-21 17:32:39,495 INFO o.a.b.t.s.LoggingVerboseReporter TESTNG PASSED: "Surefire test" - org.apache.brooklyn.util.core.logbook.opensearch.OpenSearchLogStoreTest.queryWithDateTimeFrom() finished in 18 ms
2023-09-21 17:32:39,495 INFO o.a.b.t.s.LoggingVerboseReporter TESTNG INVOKING: "Surefire test" - org.apache.brooklyn.util.core.logbook.opensearch.OpenSearchLogStoreTest.queryWithTwoLogLevelAndRange()
2023-09-21 17:32:39,495 INFO o.a.b.t.s.LoggingVerboseReporter TESTNG PASSED: "Surefire test" - org.apache.brooklyn.util.core.logbook.opensearch.OpenSearchLogStoreTest.queryWithTwoLogLevelAndRange() finished in 19 ms
2023-09-21 17:32:39,495 INFO o.a.b.t.s.LoggingVerboseReporter TESTNG INVOKING: "Surefire test" - org.apache.brooklyn.util.core.logbook.opensearch.OpenSearchLogStoreTest.queryWithTailRequest()
2023-09-21 17:32:39,495 INFO o.a.b.t.s.LoggingVerboseReporter TESTNG PASSED: "Surefire test" - org.apache.brooklyn.util.core.logbook.opensearch.OpenSearchLogStoreTest.queryWithTailRequest() finished in 19 ms
2023-09-21 17:32:39,498 INFO o.a.b.t.s.LoggingVerboseReporter TESTNG
===============================================
Surefire test
Tests run: 12, Failures: 0, Skips: 0
===============================================
Tests run: 2718, Failures: 1, Errors: 0, Skipped: 0, Time elapsed: 599.309 sec <<< FAILURE! - in TestSuite
testRetryInWorkflowOnError(org.apache.brooklyn.core.workflow.WorkflowRetryTest) Time elapsed: 1.914 sec <<< FAILURE!
org.apache.brooklyn.util.exceptions.PropagatedRuntimeException:
at org.apache.brooklyn.core.workflow.WorkflowRetryTest.doTestRetryOnError(WorkflowRetryTest.java:342)
at org.apache.brooklyn.core.workflow.WorkflowRetryTest.testRetryInWorkflowOnError(WorkflowRetryTest.java:306)
Caused by: java.util.concurrent.TimeoutException
at org.apache.brooklyn.core.workflow.WorkflowRetryTest.doTestRetryOnError(WorkflowRetryTest.java:342)
at org.apache.brooklyn.core.workflow.WorkflowRetryTest.testRetryInWorkflowOnError(WorkflowRetryTest.java:306)
2023-09-21 17:32:39,525 INFO o.a.b.c.m.i.BrooklynShutdownHooks Brooklyn shutdown: stopping entities [TestEntityImpl{id=vnxv3ogv4r}, TestEntityImpl{id=ty454gy6dz}, BlockingEntityImpl{id=zgt2f5lhog}]
Results :
Failed tests:
WorkflowRetryTest.testRetryInWorkflowOnError:306->doTestRetryOnError:342 ? PropagatedRuntime
Tests run: 2718, Failures: 1, Errors: 0, Skipped: 0
[INFO] ------------------------------------------------------------------------
[INFO] Reactor Summary for Brooklyn Root 1.1.0-SNAPSHOT:
[INFO]
[INFO] Brooklyn Server Root ............................... SUCCESS [ 7.452 s]
[INFO] Brooklyn Parent Project ............................ SUCCESS [ 11.624 s]
[INFO] Brooklyn Test Support Utilities .................... SUCCESS [ 11.732 s]
[INFO] Brooklyn Logback Includable Configuration .......... SUCCESS [ 1.119 s]
[INFO] Brooklyn Common Utilities .......................... SUCCESS [ 46.443 s]
[INFO] Brooklyn API ....................................... SUCCESS [ 4.371 s]
[INFO] CAMP Server Parent Project ......................... SUCCESS [ 1.385 s]
[INFO] CAMP Base .......................................... SUCCESS [ 4.202 s]
[INFO] Brooklyn Test Support .............................. SUCCESS [ 4.430 s]
[INFO] Brooklyn REST Swagger Apidoc Utilities ............. SUCCESS [ 3.130 s]
[INFO] Brooklyn Logback Configuration ..................... SUCCESS [ 0.535 s]
[INFO] CAMP Server ........................................ SUCCESS [ 10.936 s]
[INFO] Brooklyn Felix Runtime ............................. SUCCESS [ 5.475 s]
[INFO] Brooklyn Groovy Utilities .......................... SUCCESS [ 3.550 s]
[INFO] Brooklyn Core ...................................... FAILURE [11:42 min]
[INFO] Brooklyn Policies .................................. SKIPPED
[INFO] Brooklyn WinRM Software Entities ................... SKIPPED
[INFO] Brooklyn Secure JMXMP Agent ........................ SKIPPED
[INFO] Brooklyn JMX RMI Agent ............................. SKIPPED
[INFO] Brooklyn Jclouds Location Targets .................. SKIPPED
[INFO] Brooklyn Software Base ............................. SKIPPED
[INFO] Brooklyn CAMP ...................................... SKIPPED
[INFO] Brooklyn Launcher Common ........................... SKIPPED
[INFO] Brooklyn REST API .................................. SKIPPED
[INFO] Brooklyn REST Resources ............................ SKIPPED
[INFO] Brooklyn REST Server ............................... SKIPPED
[INFO] Brooklyn Launcher .................................. SKIPPED
[INFO] Brooklyn Container Location Targets ................ SKIPPED
[INFO] Brooklyn Command Line Interface .................... SKIPPED
[INFO] Brooklyn Test Framework ............................ SKIPPED
[INFO] Brooklyn OSGi init ................................. SKIPPED
[INFO] Brooklyn OSGi start ................................ SKIPPED
[INFO] Brooklyn Karaf ..................................... SKIPPED
[INFO] Jetty config fragment .............................. SKIPPED
[INFO] Apache Http Component extension .................... SKIPPED
[INFO] Brooklyn Karaf Features ............................ SKIPPED
[INFO] Brooklyn Karaf Shell Commands ...................... SKIPPED
[INFO] Brooklyn UI :: Parent .............................. SKIPPED
[INFO] Brooklyn UI :: Modularity Server (parent) .......... SKIPPED
[INFO] Brooklyn UI :: Modularity Server :: UI Module API .. SKIPPED
[INFO] Brooklyn UI :: Modularity Server :: UI Module Registry SKIPPED
[INFO] Brooklyn UI :: Modularity Server :: UI Proxy ....... SKIPPED
[INFO] Brooklyn UI :: Modularity Server :: UI Metadata Registry SKIPPED
[INFO] Brooklyn UI :: Modularity Server :: External UI Modules Registration Hooks SKIPPED
[INFO] Brooklyn UI :: Modularity Server :: Features ....... SKIPPED
[INFO] Brooklyn UI :: Modules (parent) .................... SKIPPED
[INFO] Brooklyn UI :: Modules - UI Utils .................. SKIPPED
[INFO] Brooklyn UI :: Modules - Home ...................... SKIPPED
[INFO] Brooklyn UI :: Modules - App inspector ............. SKIPPED
[INFO] Brooklyn UI :: Modules - Blueprint composer ........ SKIPPED
[INFO] Brooklyn UI :: Modules - Blueprint importer ........ SKIPPED
[INFO] Brooklyn UI :: Modules - Catalog ................... SKIPPED
[INFO] Brooklyn UI :: Modules - Location manager .......... SKIPPED
[INFO] Brooklyn UI :: Modules - REST API Docs ............. SKIPPED
[INFO] Brooklyn UI :: Modules - Groovy console ............ SKIPPED
[INFO] Brooklyn UI :: Modules - Logout .................... SKIPPED
[INFO] Brooklyn UI :: Modules - Login ..................... SKIPPED
[INFO] Brooklyn UI :: Modules - Features .................. SKIPPED
[INFO] Brooklyn UI :: Features ............................ SKIPPED
[INFO] Brooklyn Library Root .............................. SKIPPED
[INFO] Brooklyn CM Chef ................................... SKIPPED
[INFO] Brooklyn CM SaltStack .............................. SKIPPED
[INFO] Brooklyn CM Ansible ................................ SKIPPED
[INFO] Brooklyn CM Integration Root ....................... SKIPPED
[INFO] Brooklyn Network Software Entities ................. SKIPPED
[INFO] Brooklyn OSGi Software Entities .................... SKIPPED
[INFO] Brooklyn Database Software Entities ................ SKIPPED
[INFO] Brooklyn Web App Software Entities ................. SKIPPED
[INFO] Brooklyn Messaging Software Entities ............... SKIPPED
[INFO] Brooklyn NoSQL Data Store Software Entities ........ SKIPPED
[INFO] Brooklyn Monitoring Software Entities .............. SKIPPED
[INFO] Brooklyn Web App Software Entities ................. SKIPPED
[INFO] Brooklyn QA ........................................ SKIPPED
[INFO] Brooklyn Examples Aggregator Project ............... SKIPPED
[INFO] Brooklyn Examples Aggregator Project - Webapps ..... SKIPPED
[INFO] hello-world-webapp Maven Webapp .................... SKIPPED
[INFO] hello-world-sql-webapp Maven Webapp ................ SKIPPED
[INFO] Brooklyn Simple Web Cluster Example ................ SKIPPED
[INFO] Brooklyn Library Karaf integration ................. SKIPPED
[INFO] Brooklyn Library Catalog ........................... SKIPPED
[INFO] Brooklyn Library Karaf Features .................... SKIPPED
[INFO] Brooklyn Downstream Project Parent ................. SKIPPED
[INFO] Brooklyn Dist Root ................................. SKIPPED
[INFO] Brooklyn All Things ................................ SKIPPED
[INFO] Brooklyn Distribution .............................. SKIPPED
[INFO] Brooklyn Karaf Distribution Parent ................. SKIPPED
[INFO] Brooklyn Dist Karaf Features ....................... SKIPPED
[INFO] Brooklyn Karaf Distribution ........................ SKIPPED
[INFO] Brooklyn Karaf pax-exam itest ...................... SKIPPED
[INFO] Brooklyn Vagrant Getting Started Environment ....... SKIPPED
[INFO] Brooklyn Quick-Start Project Archetype ............. SKIPPED
[INFO] Brooklyn Shared Package Files ...................... SKIPPED
[INFO] Brooklyn RPM Package ............................... SKIPPED
[INFO] Brooklyn DEB Package ............................... SKIPPED
[INFO] Brooklyn Root ...................................... SKIPPED
[INFO] ------------------------------------------------------------------------
[INFO] BUILD FAILURE
[INFO] ------------------------------------------------------------------------
[INFO] Total time: 14:01 min
[INFO] Finished at: 2023-09-21T17:32:40Z
[INFO] ------------------------------------------------------------------------
[ERROR] Failed to execute goal org.apache.maven.plugins:maven-surefire-plugin:2.19.1:test (default-test) on project brooklyn-core: There are test failures.
[ERROR]
[ERROR] Please refer to /home/jenkins/workspace/Brooklyn_brooklyn_master/brooklyn-server/core/target/surefire-reports for the individual test results.
[ERROR] -> [Help 1]
[ERROR]
[ERROR] To see the full stack trace of the errors, re-run Maven with the -e switch.
[ERROR] Re-run Maven using the -X switch to enable full debug logging.
[ERROR]
[ERROR] For more information about the errors and possible solutions, please read the following articles:
[ERROR] [Help 1] http://cwiki.apache.org/confluence/display/MAVEN/MojoFailureException
[ERROR]
[ERROR] After correcting the problems, you can resume the build with the command
[ERROR] mvn <args> -rf :brooklyn-core
[Pipeline] }
$ docker stop --time=1 64c3b965dd56956933a18161f1e3f300b0c14e15643a6865cf36b6c34f0e6993
$ docker rm -f --volumes 64c3b965dd56956933a18161f1e3f300b0c14e15643a6865cf36b6c34f0e6993
[Pipeline] // withDockerContainer
[Pipeline] }
[Pipeline] // stage
[Pipeline] }
[Pipeline] // withEnv
[Pipeline] }
ERROR: script returned exit code 1
[Pipeline] // catchError
[Pipeline] stage
[Pipeline] { (Publish test results)
[Pipeline] junit
Recording test results
[Checks API] No suitable checks publisher found.
[Pipeline] testNG
TestNG Reports Processing: START
Looking for TestNG results report in workspace using pattern: **/testng-results.xml
testng-results.xml was last modified before this build started. Ignoring it.
testng-results.xml was last modified before this build started. Ignoring it.
testng-results.xml was last modified before this build started. Ignoring it.
testng-results.xml was last modified before this build started. Ignoring it.
testng-results.xml was last modified before this build started. Ignoring it.
testng-results.xml was last modified before this build started. Ignoring it.
testng-results.xml was last modified before this build started. Ignoring it.
testng-results.xml was last modified before this build started. Ignoring it.
testng-results.xml was last modified before this build started. Ignoring it.
testng-results.xml was last modified before this build started. Ignoring it.
testng-results.xml was last modified before this build started. Ignoring it.
testng-results.xml was last modified before this build started. Ignoring it.
testng-results.xml was last modified before this build started. Ignoring it.
testng-results.xml was last modified before this build started. Ignoring it.
testng-results.xml was last modified before this build started. Ignoring it.
testng-results.xml was last modified before this build started. Ignoring it.
testng-results.xml was last modified before this build started. Ignoring it.
testng-results.xml was last modified before this build started. Ignoring it.
testng-results.xml was last modified before this build started. Ignoring it.
testng-results.xml was last modified before this build started. Ignoring it.
testng-results.xml was last modified before this build started. Ignoring it.
testng-results.xml was last modified before this build started. Ignoring it.
testng-results.xml was last modified before this build started. Ignoring it.
testng-results.xml was last modified before this build started. Ignoring it.
testng-results.xml was last modified before this build started. Ignoring it.
testng-results.xml was last modified before this build started. Ignoring it.
testng-results.xml was last modified before this build started. Ignoring it.
testng-results.xml was last modified before this build started. Ignoring it.
testng-results.xml was last modified before this build started. Ignoring it.
testng-results.xml was last modified before this build started. Ignoring it.
testng-results.xml was last modified before this build started. Ignoring it.
Saving reports...
Processing '/home/jenkins/jenkins-home/jobs/Brooklyn/jobs/brooklyn/branches/master/builds/850/testng/testng-results-1.xml'
Processing '/home/jenkins/jenkins-home/jobs/Brooklyn/jobs/brooklyn/branches/master/builds/850/testng/testng-results-2.xml'
Processing '/home/jenkins/jenkins-home/jobs/Brooklyn/jobs/brooklyn/branches/master/builds/850/testng/testng-results-3.xml'
Processing '/home/jenkins/jenkins-home/jobs/Brooklyn/jobs/brooklyn/branches/master/builds/850/testng/testng-results-4.xml'
Processing '/home/jenkins/jenkins-home/jobs/Brooklyn/jobs/brooklyn/branches/master/builds/850/testng/testng-results-5.xml'
Processing '/home/jenkins/jenkins-home/jobs/Brooklyn/jobs/brooklyn/branches/master/builds/850/testng/testng-results-6.xml'
Processing '/home/jenkins/jenkins-home/jobs/Brooklyn/jobs/brooklyn/branches/master/builds/850/testng/testng-results-7.xml'
Processing '/home/jenkins/jenkins-home/jobs/Brooklyn/jobs/brooklyn/branches/master/builds/850/testng/testng-results.xml'
0.029718% of tests failed, which exceeded threshold of 0%. Marking build as UNSTABLE
TestNG Reports Processing: FINISH
[Pipeline] }
[Pipeline] // stage
[Pipeline] stage
[Pipeline] { (Send notifications)
[Pipeline] step
Build failed in Jenkins: Brooklyn » Brooklyn » master #852
Posted by Apache Jenkins Server <je...@builds.apache.org>.
See <https://ci-builds.apache.org/job/Brooklyn/job/brooklyn/job/master/852/display/redirect>
Changes:
------------------------------------------
[...truncated 108250 lines...]
Progress (1): 15 kB
Downloaded from central: https://repo.maven.apache.org/maven2/org/apache/maven/plugin-tools/maven-plugin-annotations/3.2/maven-plugin-annotations-3.2.jar (15 kB at 110 kB/s)
[INFO] Installing node version v16.14.2
[INFO] Downloading https://nodejs.org/dist/v16.14.2/node-v16.14.2-linux-x64.tar.gz to /var/maven/.m2/repository/com/github/eirslett/node/16.14.2/node-16.14.2-linux-x64.tar.gz
[INFO] No proxies configured
[INFO] No proxy was configured, downloading directly
[INFO] Unpacking /var/maven/.m2/repository/com/github/eirslett/node/16.14.2/node-16.14.2-linux-x64.tar.gz into /home/jenkins/jenkins-agent/workspace/Brooklyn_brooklyn_master/target/node/tmp
[INFO] Copying node binary from /home/jenkins/jenkins-agent/workspace/Brooklyn_brooklyn_master/target/node/tmp/node-v16.14.2-linux-x64/bin/node to /home/jenkins/jenkins-agent/workspace/Brooklyn_brooklyn_master/target/node/node
[INFO] Installed node locally.
[INFO] Installing npm version 8.5.0
[INFO] Downloading https://registry.npmjs.org/npm/-/npm-8.5.0.tgz to /var/maven/.m2/repository/com/github/eirslett/npm/8.5.0/npm-8.5.0.tar.gz
[INFO] No proxies configured
[INFO] No proxy was configured, downloading directly
[INFO] Unpacking /var/maven/.m2/repository/com/github/eirslett/npm/8.5.0/npm-8.5.0.tar.gz into /home/jenkins/jenkins-agent/workspace/Brooklyn_brooklyn_master/target/node/node_modules
[INFO] Installed npm locally.
[INFO]
[INFO] --- frontend:1.9.0:npm (npm install) @ brooklyn-ui-utils ---
[INFO] Running 'npm install' in /home/jenkins/jenkins-agent/workspace/Brooklyn_brooklyn_master/brooklyn-ui/ui-modules/utils
[INFO] npm WARN EBADENGINE Unsupported engine {
[INFO] npm WARN EBADENGINE package: 'karma@1.7.1',
[INFO] npm WARN EBADENGINE required: { node: '0.10 || 0.12 || 4 || 5 || 6 || 7 || 8' },
[INFO] npm WARN EBADENGINE current: { node: 'v16.14.2', npm: '8.5.0' }
[INFO] npm WARN EBADENGINE }
[INFO] npm WARN deprecated source-map-url@0.4.1: See https://github.com/lydell/source-map-url#deprecated
[INFO] npm WARN deprecated resolve-url@0.2.1: https://github.com/lydell/resolve-url#deprecated
[INFO] npm WARN deprecated urix@0.1.0: Please see https://github.com/lydell/urix#deprecated
[INFO] npm WARN deprecated har-validator@5.1.5: this library is no longer supported
[INFO] npm WARN deprecated source-map-resolve@0.5.3: See https://github.com/lydell/source-map-resolve#deprecated
[INFO] npm WARN deprecated json3@3.3.2: Please use the native JSON object instead of JSON 3
[INFO] npm WARN deprecated chokidar@1.7.0: Chokidar 2 will break on node v14+. Upgrade to chokidar 3 with 15x less dependencies.
[INFO] npm WARN deprecated angular-sanitize@1.8.3: For the actively supported Angular, see https://www.npmjs.com/package/@angular/core. AngularJS support has officially ended. For extended AngularJS support options, see https://goo.gle/angularjs-path-forward.
[INFO] npm WARN deprecated uuid@3.4.0: Please upgrade to version 7 or higher. Older versions may use Math.random() in certain circumstances, which is known to be problematic. See https://v8.dev/blog/math-random for details.
[INFO] npm WARN deprecated jssha@2.4.2: jsSHA versions < 3.0.0 will no longer receive feature updates
[INFO] npm WARN deprecated karma-phantomjs-launcher@1.0.4: PhantomJS development have stopped, use puppeteer or similar
[INFO] npm WARN deprecated phantomjs-prebuilt@2.1.16: this package is now deprecated
[INFO] npm WARN deprecated angular-animate@1.8.3: For the actively supported Angular, see https://www.npmjs.com/package/@angular/core. AngularJS support has officially ended. For extended AngularJS support options, see https://goo.gle/angularjs-path-forward.
[INFO] npm WARN deprecated request@2.88.2: request has been deprecated, see https://github.com/request/request/issues/3142
[INFO] npm WARN deprecated log4js@0.6.38: 0.x is no longer supported. Please upgrade to 6.x or higher.
[INFO] npm WARN deprecated angular@1.8.3: For the actively supported Angular, see https://www.npmjs.com/package/@angular/core. AngularJS support has officially ended. For extended AngularJS support options, see https://goo.gle/angularjs-path-forward.
[INFO] npm WARN deprecated core-js@2.6.12: core-js@<3.23.3 is no longer maintained and not recommended for usage due to the number of issues. Because of the V8 engine whims, feature detection in old core-js versions could cause a slowdown up to 100x even if nothing is polyfilled. Some versions have web compatibility issues. Please, upgrade your dependencies to the actual version of core-js.
[INFO] npm ERR! code 1
[INFO] npm ERR! path /home/jenkins/jenkins-agent/workspace/Brooklyn_brooklyn_master/brooklyn-ui/ui-modules/utils/node_modules/phantomjs-prebuilt
[INFO] npm ERR! command failed
[INFO] npm ERR! command sh -c node install.js
[INFO] npm ERR! PhantomJS not found on PATH
[INFO] npm ERR! Downloading https://github.com/Medium/phantomjs/releases/download/v2.1.1/phantomjs-2.1.1-linux-x86_64.tar.bz2
[INFO] npm ERR! Saving to /tmp/phantomjs/phantomjs-2.1.1-linux-x86_64.tar.bz2
[INFO] npm ERR! Receiving...
[INFO] npm ERR!
[INFO] npm ERR! Received 22866K total.
[INFO] npm ERR! Extracting tar contents (via spawned process)
[INFO] npm ERR! Error extracting archive
[INFO] npm ERR! Phantom installation failed Error: Command failed: tar jxf /tmp/phantomjs/phantomjs-2.1.1-linux-x86_64.tar.bz2
[INFO] npm ERR! tar (child): bzip2: Cannot exec: No such file or directory
[INFO] npm ERR! tar (child): Error is not recoverable: exiting now
[INFO] npm ERR! tar: Child returned status 2
[INFO] npm ERR! tar: Error is not recoverable: exiting now
[INFO] npm ERR!
[INFO] npm ERR! at ChildProcess.exithandler (node:child_process:399:12)
[INFO] npm ERR! at ChildProcess.emit (node:events:526:28)
[INFO] npm ERR! at maybeClose (node:internal/child_process:1092:16)
[INFO] npm ERR! at Socket.<anonymous> (node:internal/child_process:451:11)
[INFO] npm ERR! at Socket.emit (node:events:526:28)
[INFO] npm ERR! at Pipe.<anonymous> (node:net:687:12) {
[INFO] npm ERR! killed: false,
[INFO] npm ERR! code: 2,
[INFO] npm ERR! signal: null,
[INFO] npm ERR! cmd: 'tar jxf /tmp/phantomjs/phantomjs-2.1.1-linux-x86_64.tar.bz2'
[INFO] npm ERR! } Error: Command failed: tar jxf /tmp/phantomjs/phantomjs-2.1.1-linux-x86_64.tar.bz2
[INFO] npm ERR! tar (child): bzip2: Cannot exec: No such file or directory
[INFO] npm ERR! tar (child): Error is not recoverable: exiting now
[INFO] npm ERR! tar: Child returned status 2
[INFO] npm ERR! tar: Error is not recoverable: exiting now
[INFO] npm ERR!
[INFO] npm ERR! at ChildProcess.exithandler (node:child_process:399:12)
[INFO] npm ERR! at ChildProcess.emit (node:events:526:28)
[INFO] npm ERR! at maybeClose (node:internal/child_process:1092:16)
[INFO] npm ERR! at Socket.<anonymous> (node:internal/child_process:451:11)
[INFO] npm ERR! at Socket.emit (node:events:526:28)
[INFO] npm ERR! at Pipe.<anonymous> (node:net:687:12)
[INFO]
[INFO] npm ERR! A complete log of this run can be found in:
[INFO] npm ERR! /.npm/_logs/2023-09-22T23_28_07_077Z-debug-0.log
[INFO] ------------------------------------------------------------------------
[INFO] Reactor Summary for Brooklyn Root 1.1.0-SNAPSHOT:
[INFO]
[INFO] Brooklyn Server Root ............................... SUCCESS [ 9.126 s]
[INFO] Brooklyn Parent Project ............................ SUCCESS [ 9.054 s]
[INFO] Brooklyn Test Support Utilities .................... SUCCESS [ 8.006 s]
[INFO] Brooklyn Logback Includable Configuration .......... SUCCESS [ 0.510 s]
[INFO] Brooklyn Common Utilities .......................... SUCCESS [ 29.825 s]
[INFO] Brooklyn API ....................................... SUCCESS [ 2.656 s]
[INFO] CAMP Server Parent Project ......................... SUCCESS [ 0.147 s]
[INFO] CAMP Base .......................................... SUCCESS [ 3.318 s]
[INFO] Brooklyn Test Support .............................. SUCCESS [ 2.640 s]
[INFO] Brooklyn REST Swagger Apidoc Utilities ............. SUCCESS [ 2.437 s]
[INFO] Brooklyn Logback Configuration ..................... SUCCESS [ 0.234 s]
[INFO] CAMP Server ........................................ SUCCESS [ 6.860 s]
[INFO] Brooklyn Felix Runtime ............................. SUCCESS [ 3.435 s]
[INFO] Brooklyn Groovy Utilities .......................... SUCCESS [ 2.569 s]
[INFO] Brooklyn Core ...................................... SUCCESS [07:53 min]
[INFO] Brooklyn Policies .................................. SUCCESS [ 45.495 s]
[INFO] Brooklyn WinRM Software Entities ................... SUCCESS [ 15.505 s]
[INFO] Brooklyn Secure JMXMP Agent ........................ SUCCESS [ 10.185 s]
[INFO] Brooklyn JMX RMI Agent ............................. SUCCESS [ 0.535 s]
[INFO] Brooklyn Jclouds Location Targets .................. SUCCESS [ 45.944 s]
[INFO] Brooklyn Software Base ............................. SUCCESS [01:57 min]
[INFO] Brooklyn CAMP ...................................... SUCCESS [03:55 min]
[INFO] Brooklyn Launcher Common ........................... SUCCESS [ 4.751 s]
[INFO] Brooklyn REST API .................................. SUCCESS [ 12.562 s]
[INFO] Brooklyn REST Resources ............................ SUCCESS [01:06 min]
[INFO] Brooklyn REST Server ............................... SUCCESS [ 31.300 s]
[INFO] Brooklyn Launcher .................................. SUCCESS [01:27 min]
[INFO] Brooklyn Container Location Targets ................ SUCCESS [ 11.660 s]
[INFO] Brooklyn Command Line Interface .................... SUCCESS [ 11.269 s]
[INFO] Brooklyn Test Framework ............................ SUCCESS [ 25.164 s]
[INFO] Brooklyn OSGi init ................................. SUCCESS [ 2.395 s]
[INFO] Brooklyn OSGi start ................................ SUCCESS [ 1.584 s]
[INFO] Brooklyn Karaf ..................................... SUCCESS [ 0.033 s]
[INFO] Jetty config fragment .............................. SUCCESS [ 1.845 s]
[INFO] Apache Http Component extension .................... SUCCESS [ 0.248 s]
[INFO] Brooklyn Karaf Features ............................ SUCCESS [ 2.907 s]
[INFO] Brooklyn Karaf Shell Commands ...................... SUCCESS [ 2.821 s]
[INFO] Brooklyn UI :: Parent .............................. SUCCESS [ 4.320 s]
[INFO] Brooklyn UI :: Modularity Server (parent) .......... SUCCESS [ 0.141 s]
[INFO] Brooklyn UI :: Modularity Server :: UI Module API .. SUCCESS [ 3.634 s]
[INFO] Brooklyn UI :: Modularity Server :: UI Module Registry SUCCESS [ 0.801 s]
[INFO] Brooklyn UI :: Modularity Server :: UI Proxy ....... SUCCESS [ 2.982 s]
[INFO] Brooklyn UI :: Modularity Server :: UI Metadata Registry SUCCESS [ 0.905 s]
[INFO] Brooklyn UI :: Modularity Server :: External UI Modules Registration Hooks SUCCESS [ 5.769 s]
[INFO] Brooklyn UI :: Modularity Server :: Features ....... SUCCESS [ 4.950 s]
[INFO] Brooklyn UI :: Modules (parent) .................... SUCCESS [ 0.158 s]
[INFO] Brooklyn UI :: Modules - UI Utils .................. FAILURE [ 42.731 s]
[INFO] Brooklyn UI :: Modules - Home ...................... SKIPPED
[INFO] Brooklyn UI :: Modules - App inspector ............. SKIPPED
[INFO] Brooklyn UI :: Modules - Blueprint composer ........ SKIPPED
[INFO] Brooklyn UI :: Modules - Blueprint importer ........ SKIPPED
[INFO] Brooklyn UI :: Modules - Catalog ................... SKIPPED
[INFO] Brooklyn UI :: Modules - Location manager .......... SKIPPED
[INFO] Brooklyn UI :: Modules - REST API Docs ............. SKIPPED
[INFO] Brooklyn UI :: Modules - Groovy console ............ SKIPPED
[INFO] Brooklyn UI :: Modules - Logout .................... SKIPPED
[INFO] Brooklyn UI :: Modules - Login ..................... SKIPPED
[INFO] Brooklyn UI :: Modules - Features .................. SKIPPED
[INFO] Brooklyn UI :: Features ............................ SKIPPED
[INFO] Brooklyn Library Root .............................. SKIPPED
[INFO] Brooklyn CM Chef ................................... SKIPPED
[INFO] Brooklyn CM SaltStack .............................. SKIPPED
[INFO] Brooklyn CM Ansible ................................ SKIPPED
[INFO] Brooklyn CM Integration Root ....................... SKIPPED
[INFO] Brooklyn Network Software Entities ................. SKIPPED
[INFO] Brooklyn OSGi Software Entities .................... SKIPPED
[INFO] Brooklyn Database Software Entities ................ SKIPPED
[INFO] Brooklyn Web App Software Entities ................. SKIPPED
[INFO] Brooklyn Messaging Software Entities ............... SKIPPED
[INFO] Brooklyn NoSQL Data Store Software Entities ........ SKIPPED
[INFO] Brooklyn Monitoring Software Entities .............. SKIPPED
[INFO] Brooklyn Web App Software Entities ................. SKIPPED
[INFO] Brooklyn QA ........................................ SKIPPED
[INFO] Brooklyn Examples Aggregator Project ............... SKIPPED
[INFO] Brooklyn Examples Aggregator Project - Webapps ..... SKIPPED
[INFO] hello-world-webapp Maven Webapp .................... SKIPPED
[INFO] hello-world-sql-webapp Maven Webapp ................ SKIPPED
[INFO] Brooklyn Simple Web Cluster Example ................ SKIPPED
[INFO] Brooklyn Library Karaf integration ................. SKIPPED
[INFO] Brooklyn Library Catalog ........................... SKIPPED
[INFO] Brooklyn Library Karaf Features .................... SKIPPED
[INFO] Brooklyn Downstream Project Parent ................. SKIPPED
[INFO] Brooklyn Dist Root ................................. SKIPPED
[INFO] Brooklyn All Things ................................ SKIPPED
[INFO] Brooklyn Distribution .............................. SKIPPED
[INFO] Brooklyn Karaf Distribution Parent ................. SKIPPED
[INFO] Brooklyn Dist Karaf Features ....................... SKIPPED
[INFO] Brooklyn Karaf Distribution ........................ SKIPPED
[INFO] Brooklyn Karaf pax-exam itest ...................... SKIPPED
[INFO] Brooklyn Vagrant Getting Started Environment ....... SKIPPED
[INFO] Brooklyn Quick-Start Project Archetype ............. SKIPPED
[INFO] Brooklyn Shared Package Files ...................... SKIPPED
[INFO] Brooklyn RPM Package ............................... SKIPPED
[INFO] Brooklyn DEB Package ............................... SKIPPED
[INFO] Brooklyn Root ...................................... SKIPPED
[INFO] ------------------------------------------------------------------------
[INFO] BUILD FAILURE
[INFO] ------------------------------------------------------------------------
[INFO] Total time: 22:56 min
[INFO] Finished at: 2023-09-22T23:28:43Z
[INFO] ------------------------------------------------------------------------
[ERROR] Failed to execute goal com.github.eirslett:frontend-maven-plugin:1.9.0:npm (npm install) on project brooklyn-ui-utils: Failed to run task: 'npm install' failed. org.apache.commons.exec.ExecuteException: Process exited with an error: 1 (Exit value: 1) -> [Help 1]
[ERROR]
[ERROR] To see the full stack trace of the errors, re-run Maven with the -e switch.
[ERROR] Re-run Maven using the -X switch to enable full debug logging.
[ERROR]
[ERROR] For more information about the errors and possible solutions, please read the following articles:
[ERROR] [Help 1] http://cwiki.apache.org/confluence/display/MAVEN/MojoFailureException
[ERROR]
[ERROR] After correcting the problems, you can resume the build with the command
[ERROR] mvn <args> -rf :brooklyn-ui-utils
[Pipeline] }
$ docker stop --time=1 b429b91bd7f6e12cfbb54f95782c8451f6388c25afd4c1c70e299129d3e94064
$ docker rm -f --volumes b429b91bd7f6e12cfbb54f95782c8451f6388c25afd4c1c70e299129d3e94064
[Pipeline] // withDockerContainer
[Pipeline] }
[Pipeline] // stage
[Pipeline] }
[Pipeline] // withEnv
[Pipeline] }
ERROR: script returned exit code 1
[Pipeline] // catchError
[Pipeline] stage
[Pipeline] { (Publish test results)
[Pipeline] junit
Recording test results
[Checks API] No suitable checks publisher found.
[Pipeline] testNG
TestNG Reports Processing: START
Looking for TestNG results report in workspace using pattern: **/testng-results.xml
Saving reports...
Processing '/home/jenkins/jenkins-home/jobs/Brooklyn/jobs/brooklyn/branches/master/builds/852/testng/testng-results-1.xml'
Processing '/home/jenkins/jenkins-home/jobs/Brooklyn/jobs/brooklyn/branches/master/builds/852/testng/testng-results-10.xml'
Processing '/home/jenkins/jenkins-home/jobs/Brooklyn/jobs/brooklyn/branches/master/builds/852/testng/testng-results-11.xml'
Processing '/home/jenkins/jenkins-home/jobs/Brooklyn/jobs/brooklyn/branches/master/builds/852/testng/testng-results-12.xml'
Processing '/home/jenkins/jenkins-home/jobs/Brooklyn/jobs/brooklyn/branches/master/builds/852/testng/testng-results-13.xml'
Processing '/home/jenkins/jenkins-home/jobs/Brooklyn/jobs/brooklyn/branches/master/builds/852/testng/testng-results-14.xml'
Processing '/home/jenkins/jenkins-home/jobs/Brooklyn/jobs/brooklyn/branches/master/builds/852/testng/testng-results-15.xml'
Processing '/home/jenkins/jenkins-home/jobs/Brooklyn/jobs/brooklyn/branches/master/builds/852/testng/testng-results-16.xml'
Processing '/home/jenkins/jenkins-home/jobs/Brooklyn/jobs/brooklyn/branches/master/builds/852/testng/testng-results-17.xml'
Processing '/home/jenkins/jenkins-home/jobs/Brooklyn/jobs/brooklyn/branches/master/builds/852/testng/testng-results-18.xml'
Processing '/home/jenkins/jenkins-home/jobs/Brooklyn/jobs/brooklyn/branches/master/builds/852/testng/testng-results-19.xml'
Processing '/home/jenkins/jenkins-home/jobs/Brooklyn/jobs/brooklyn/branches/master/builds/852/testng/testng-results-2.xml'
Processing '/home/jenkins/jenkins-home/jobs/Brooklyn/jobs/brooklyn/branches/master/builds/852/testng/testng-results-20.xml'
Processing '/home/jenkins/jenkins-home/jobs/Brooklyn/jobs/brooklyn/branches/master/builds/852/testng/testng-results-21.xml'
Processing '/home/jenkins/jenkins-home/jobs/Brooklyn/jobs/brooklyn/branches/master/builds/852/testng/testng-results-22.xml'
Processing '/home/jenkins/jenkins-home/jobs/Brooklyn/jobs/brooklyn/branches/master/builds/852/testng/testng-results-23.xml'
Processing '/home/jenkins/jenkins-home/jobs/Brooklyn/jobs/brooklyn/branches/master/builds/852/testng/testng-results-24.xml'
Processing '/home/jenkins/jenkins-home/jobs/Brooklyn/jobs/brooklyn/branches/master/builds/852/testng/testng-results-3.xml'
Processing '/home/jenkins/jenkins-home/jobs/Brooklyn/jobs/brooklyn/branches/master/builds/852/testng/testng-results-4.xml'
Processing '/home/jenkins/jenkins-home/jobs/Brooklyn/jobs/brooklyn/branches/master/builds/852/testng/testng-results-5.xml'
Processing '/home/jenkins/jenkins-home/jobs/Brooklyn/jobs/brooklyn/branches/master/builds/852/testng/testng-results-6.xml'
Processing '/home/jenkins/jenkins-home/jobs/Brooklyn/jobs/brooklyn/branches/master/builds/852/testng/testng-results-7.xml'
Processing '/home/jenkins/jenkins-home/jobs/Brooklyn/jobs/brooklyn/branches/master/builds/852/testng/testng-results-8.xml'
Processing '/home/jenkins/jenkins-home/jobs/Brooklyn/jobs/brooklyn/branches/master/builds/852/testng/testng-results-9.xml'
Processing '/home/jenkins/jenkins-home/jobs/Brooklyn/jobs/brooklyn/branches/master/builds/852/testng/testng-results.xml'
TestNG Reports Processing: FINISH
[Pipeline] }
[Pipeline] // stage
[Pipeline] stage
[Pipeline] { (Send notifications)
[Pipeline] step
Build failed in Jenkins: Brooklyn » Brooklyn » master #851
Posted by Apache Jenkins Server <je...@builds.apache.org>.
See <https://ci-builds.apache.org/job/Brooklyn/job/brooklyn/job/master/851/display/redirect>
Changes:
------------------------------------------
[...truncated 80644 lines...]
[INFO] Storing buildNumber: 22baa3c at timestamp: 1695320614644
[WARNING] Cannot get the branch information from the git repository:
Detecting the current branch failed: fatal: ref HEAD is not a symbolic ref
[INFO] ShortRevision tag detected. The value is '7'.
[INFO] Executing: /bin/sh -c cd '/home/jenkins/jenkins-agent/workspace/Brooklyn_brooklyn_master/brooklyn-ui/ui-modules/utils' && 'git' 'rev-parse' '--verify' '--short=7' 'HEAD'
[INFO] Working directory: /home/jenkins/jenkins-agent/workspace/Brooklyn_brooklyn_master/brooklyn-ui/ui-modules/utils
[INFO] Storing buildScmBranch: UNKNOWN
[INFO]
[INFO] --- enforcer:1.4.1:enforce (brooklyn-build-req) @ brooklyn-ui-utils ---
[INFO]
[INFO] --- remote-resources:1.5:process (default) @ brooklyn-ui-utils ---
[INFO]
[INFO] --- frontend:1.9.0:install-node-and-npm (install node and npm) @ brooklyn-ui-utils ---
[INFO] Node v16.14.2 is already installed.
[INFO] NPM 8.5.0 is already installed.
[INFO]
[INFO] --- frontend:1.9.0:npm (npm install) @ brooklyn-ui-utils ---
[INFO] Running 'npm install' in /home/jenkins/jenkins-agent/workspace/Brooklyn_brooklyn_master/brooklyn-ui/ui-modules/utils
[INFO] npm WARN EBADENGINE Unsupported engine {
[INFO] npm WARN EBADENGINE package: 'karma@1.7.1',
[INFO] npm WARN EBADENGINE required: { node: '0.10 || 0.12 || 4 || 5 || 6 || 7 || 8' },
[INFO] npm WARN EBADENGINE current: { node: 'v16.14.2', npm: '8.5.0' }
[INFO] npm WARN EBADENGINE }
[INFO] npm WARN deprecated source-map-url@0.4.1: See https://github.com/lydell/source-map-url#deprecated
[INFO] npm WARN deprecated resolve-url@0.2.1: https://github.com/lydell/resolve-url#deprecated
[INFO] npm WARN deprecated urix@0.1.0: Please see https://github.com/lydell/urix#deprecated
[INFO] npm WARN deprecated har-validator@5.1.5: this library is no longer supported
[INFO] npm WARN deprecated source-map-resolve@0.5.3: See https://github.com/lydell/source-map-resolve#deprecated
[INFO] npm WARN deprecated json3@3.3.2: Please use the native JSON object instead of JSON 3
[INFO] npm WARN deprecated chokidar@1.7.0: Chokidar 2 will break on node v14+. Upgrade to chokidar 3 with 15x less dependencies.
[INFO] npm WARN deprecated angular-sanitize@1.8.3: For the actively supported Angular, see https://www.npmjs.com/package/@angular/core. AngularJS support has officially ended. For extended AngularJS support options, see https://goo.gle/angularjs-path-forward.
[INFO] npm WARN deprecated uuid@3.4.0: Please upgrade to version 7 or higher. Older versions may use Math.random() in certain circumstances, which is known to be problematic. See https://v8.dev/blog/math-random for details.
[INFO] npm WARN deprecated jssha@2.4.2: jsSHA versions < 3.0.0 will no longer receive feature updates
[INFO] npm WARN deprecated angular-animate@1.8.3: For the actively supported Angular, see https://www.npmjs.com/package/@angular/core. AngularJS support has officially ended. For extended AngularJS support options, see https://goo.gle/angularjs-path-forward.
[INFO] npm WARN deprecated phantomjs-prebuilt@2.1.16: this package is now deprecated
[INFO] npm WARN deprecated karma-phantomjs-launcher@1.0.4: PhantomJS development have stopped, use puppeteer or similar
[INFO] npm WARN deprecated request@2.88.2: request has been deprecated, see https://github.com/request/request/issues/3142
[INFO] npm WARN deprecated log4js@0.6.38: 0.x is no longer supported. Please upgrade to 6.x or higher.
[INFO] npm WARN deprecated angular@1.8.3: For the actively supported Angular, see https://www.npmjs.com/package/@angular/core. AngularJS support has officially ended. For extended AngularJS support options, see https://goo.gle/angularjs-path-forward.
[INFO] npm WARN deprecated core-js@2.6.12: core-js@<3.23.3 is no longer maintained and not recommended for usage due to the number of issues. Because of the V8 engine whims, feature detection in old core-js versions could cause a slowdown up to 100x even if nothing is polyfilled. Some versions have web compatibility issues. Please, upgrade your dependencies to the actual version of core-js.
[INFO] npm ERR! code 1
[INFO] npm ERR! path /home/jenkins/jenkins-agent/workspace/Brooklyn_brooklyn_master/brooklyn-ui/ui-modules/utils/node_modules/phantomjs-prebuilt
[INFO] npm ERR! command failed
[INFO] npm ERR! command sh -c node install.js
[INFO] npm ERR! PhantomJS not found on PATH
[INFO] npm ERR! Downloading https://github.com/Medium/phantomjs/releases/download/v2.1.1/phantomjs-2.1.1-linux-x86_64.tar.bz2
[INFO] npm ERR! Saving to /tmp/phantomjs/phantomjs-2.1.1-linux-x86_64.tar.bz2
[INFO] npm ERR! Receiving...
[INFO] npm ERR!
[INFO] npm ERR! Received 22866K total.
[INFO] npm ERR! Extracting tar contents (via spawned process)
[INFO] npm ERR! Error extracting archive
[INFO] npm ERR! Phantom installation failed Error: Command failed: tar jxf /tmp/phantomjs/phantomjs-2.1.1-linux-x86_64.tar.bz2
[INFO] npm ERR! tar (child): bzip2: Cannot exec: No such file or directory
[INFO] npm ERR! tar (child): Error is not recoverable: exiting now
[INFO] npm ERR! tar: Child returned status 2
[INFO] npm ERR! tar: Error is not recoverable: exiting now
[INFO] npm ERR!
[INFO] npm ERR! at ChildProcess.exithandler (node:child_process:399:12)
[INFO] npm ERR! at ChildProcess.emit (node:events:526:28)
[INFO] npm ERR! at maybeClose (node:internal/child_process:1092:16)
[INFO] npm ERR! at Socket.<anonymous> (node:internal/child_process:451:11)
[INFO] npm ERR! at Socket.emit (node:events:526:28)
[INFO] npm ERR! at Pipe.<anonymous> (node:net:687:12) {
[INFO] npm ERR! killed: false,
[INFO] npm ERR! code: 2,
[INFO] npm ERR! signal: null,
[INFO] npm ERR! cmd: 'tar jxf /tmp/phantomjs/phantomjs-2.1.1-linux-x86_64.tar.bz2'
[INFO] npm ERR! } Error: Command failed: tar jxf /tmp/phantomjs/phantomjs-2.1.1-linux-x86_64.tar.bz2
[INFO] npm ERR! tar (child): bzip2: Cannot exec: No such file or directory
[INFO] npm ERR! tar (child): Error is not recoverable: exiting now
[INFO] npm ERR! tar: Child returned status 2
[INFO] npm ERR! tar: Error is not recoverable: exiting now
[INFO] npm ERR!
[INFO] npm ERR! at ChildProcess.exithandler (node:child_process:399:12)
[INFO] npm ERR! at ChildProcess.emit (node:events:526:28)
[INFO] npm ERR! at maybeClose (node:internal/child_process:1092:16)
[INFO] npm ERR! at Socket.<anonymous> (node:internal/child_process:451:11)
[INFO] npm ERR! at Socket.emit (node:events:526:28)
[INFO] npm ERR! at Pipe.<anonymous> (node:net:687:12)
[INFO]
[INFO] npm ERR! A complete log of this run can be found in:
[INFO] npm ERR! /.npm/_logs/2023-09-21T18_23_36_853Z-debug-0.log
[INFO] ------------------------------------------------------------------------
[INFO] Reactor Summary for Brooklyn Root 1.1.0-SNAPSHOT:
[INFO]
[INFO] Brooklyn Server Root ............................... SUCCESS [ 2.146 s]
[INFO] Brooklyn Parent Project ............................ SUCCESS [ 4.469 s]
[INFO] Brooklyn Test Support Utilities .................... SUCCESS [ 8.254 s]
[INFO] Brooklyn Logback Includable Configuration .......... SUCCESS [ 0.896 s]
[INFO] Brooklyn Common Utilities .......................... SUCCESS [ 45.626 s]
[INFO] Brooklyn API ....................................... SUCCESS [ 4.483 s]
[INFO] CAMP Server Parent Project ......................... SUCCESS [ 0.390 s]
[INFO] CAMP Base .......................................... SUCCESS [ 5.396 s]
[INFO] Brooklyn Test Support .............................. SUCCESS [ 4.346 s]
[INFO] Brooklyn REST Swagger Apidoc Utilities ............. SUCCESS [ 1.822 s]
[INFO] Brooklyn Logback Configuration ..................... SUCCESS [ 0.378 s]
[INFO] CAMP Server ........................................ SUCCESS [ 8.723 s]
[INFO] Brooklyn Felix Runtime ............................. SUCCESS [ 4.626 s]
[INFO] Brooklyn Groovy Utilities .......................... SUCCESS [ 3.944 s]
[INFO] Brooklyn Core ...................................... SUCCESS [10:23 min]
[INFO] Brooklyn Policies .................................. SUCCESS [ 57.777 s]
[INFO] Brooklyn WinRM Software Entities ................... SUCCESS [ 17.240 s]
[INFO] Brooklyn Secure JMXMP Agent ........................ SUCCESS [ 14.544 s]
[INFO] Brooklyn JMX RMI Agent ............................. SUCCESS [ 0.805 s]
[INFO] Brooklyn Jclouds Location Targets .................. SUCCESS [ 59.319 s]
[INFO] Brooklyn Software Base ............................. SUCCESS [02:18 min]
[INFO] Brooklyn CAMP ...................................... SUCCESS [05:03 min]
[INFO] Brooklyn Launcher Common ........................... SUCCESS [ 7.627 s]
[INFO] Brooklyn REST API .................................. SUCCESS [ 16.335 s]
[INFO] Brooklyn REST Resources ............................ SUCCESS [01:42 min]
[INFO] Brooklyn REST Server ............................... SUCCESS [ 51.544 s]
[INFO] Brooklyn Launcher .................................. SUCCESS [01:51 min]
[INFO] Brooklyn Container Location Targets ................ SUCCESS [ 14.248 s]
[INFO] Brooklyn Command Line Interface .................... SUCCESS [ 16.518 s]
[INFO] Brooklyn Test Framework ............................ SUCCESS [ 36.327 s]
[INFO] Brooklyn OSGi init ................................. SUCCESS [ 3.765 s]
[INFO] Brooklyn OSGi start ................................ SUCCESS [ 2.843 s]
[INFO] Brooklyn Karaf ..................................... SUCCESS [ 0.054 s]
[INFO] Jetty config fragment .............................. SUCCESS [ 1.890 s]
[INFO] Apache Http Component extension .................... SUCCESS [ 0.388 s]
[INFO] Brooklyn Karaf Features ............................ SUCCESS [ 4.398 s]
[INFO] Brooklyn Karaf Shell Commands ...................... SUCCESS [ 4.335 s]
[INFO] Brooklyn UI :: Parent .............................. SUCCESS [ 1.438 s]
[INFO] Brooklyn UI :: Modularity Server (parent) .......... SUCCESS [ 0.221 s]
[INFO] Brooklyn UI :: Modularity Server :: UI Module API .. SUCCESS [ 4.039 s]
[INFO] Brooklyn UI :: Modularity Server :: UI Module Registry SUCCESS [ 1.287 s]
[INFO] Brooklyn UI :: Modularity Server :: UI Proxy ....... SUCCESS [ 4.198 s]
[INFO] Brooklyn UI :: Modularity Server :: UI Metadata Registry SUCCESS [ 1.609 s]
[INFO] Brooklyn UI :: Modularity Server :: External UI Modules Registration Hooks SUCCESS [ 8.784 s]
[INFO] Brooklyn UI :: Modularity Server :: Features ....... SUCCESS [ 5.227 s]
[INFO] Brooklyn UI :: Modules (parent) .................... SUCCESS [ 0.334 s]
[INFO] Brooklyn UI :: Modules - UI Utils .................. FAILURE [ 54.285 s]
[INFO] Brooklyn UI :: Modules - Home ...................... SKIPPED
[INFO] Brooklyn UI :: Modules - App inspector ............. SKIPPED
[INFO] Brooklyn UI :: Modules - Blueprint composer ........ SKIPPED
[INFO] Brooklyn UI :: Modules - Blueprint importer ........ SKIPPED
[INFO] Brooklyn UI :: Modules - Catalog ................... SKIPPED
[INFO] Brooklyn UI :: Modules - Location manager .......... SKIPPED
[INFO] Brooklyn UI :: Modules - REST API Docs ............. SKIPPED
[INFO] Brooklyn UI :: Modules - Groovy console ............ SKIPPED
[INFO] Brooklyn UI :: Modules - Logout .................... SKIPPED
[INFO] Brooklyn UI :: Modules - Login ..................... SKIPPED
[INFO] Brooklyn UI :: Modules - Features .................. SKIPPED
[INFO] Brooklyn UI :: Features ............................ SKIPPED
[INFO] Brooklyn Library Root .............................. SKIPPED
[INFO] Brooklyn CM Chef ................................... SKIPPED
[INFO] Brooklyn CM SaltStack .............................. SKIPPED
[INFO] Brooklyn CM Ansible ................................ SKIPPED
[INFO] Brooklyn CM Integration Root ....................... SKIPPED
[INFO] Brooklyn Network Software Entities ................. SKIPPED
[INFO] Brooklyn OSGi Software Entities .................... SKIPPED
[INFO] Brooklyn Database Software Entities ................ SKIPPED
[INFO] Brooklyn Web App Software Entities ................. SKIPPED
[INFO] Brooklyn Messaging Software Entities ............... SKIPPED
[INFO] Brooklyn NoSQL Data Store Software Entities ........ SKIPPED
[INFO] Brooklyn Monitoring Software Entities .............. SKIPPED
[INFO] Brooklyn Web App Software Entities ................. SKIPPED
[INFO] Brooklyn QA ........................................ SKIPPED
[INFO] Brooklyn Examples Aggregator Project ............... SKIPPED
[INFO] Brooklyn Examples Aggregator Project - Webapps ..... SKIPPED
[INFO] hello-world-webapp Maven Webapp .................... SKIPPED
[INFO] hello-world-sql-webapp Maven Webapp ................ SKIPPED
[INFO] Brooklyn Simple Web Cluster Example ................ SKIPPED
[INFO] Brooklyn Library Karaf integration ................. SKIPPED
[INFO] Brooklyn Library Catalog ........................... SKIPPED
[INFO] Brooklyn Library Karaf Features .................... SKIPPED
[INFO] Brooklyn Downstream Project Parent ................. SKIPPED
[INFO] Brooklyn Dist Root ................................. SKIPPED
[INFO] Brooklyn All Things ................................ SKIPPED
[INFO] Brooklyn Distribution .............................. SKIPPED
[INFO] Brooklyn Karaf Distribution Parent ................. SKIPPED
[INFO] Brooklyn Dist Karaf Features ....................... SKIPPED
[INFO] Brooklyn Karaf Distribution ........................ SKIPPED
[INFO] Brooklyn Karaf pax-exam itest ...................... SKIPPED
[INFO] Brooklyn Vagrant Getting Started Environment ....... SKIPPED
[INFO] Brooklyn Quick-Start Project Archetype ............. SKIPPED
[INFO] Brooklyn Shared Package Files ...................... SKIPPED
[INFO] Brooklyn RPM Package ............................... SKIPPED
[INFO] Brooklyn DEB Package ............................... SKIPPED
[INFO] Brooklyn Root ...................................... SKIPPED
[INFO] ------------------------------------------------------------------------
[INFO] BUILD FAILURE
[INFO] ------------------------------------------------------------------------
[INFO] Total time: 29:33 min
[INFO] Finished at: 2023-09-21T18:24:28Z
[INFO] ------------------------------------------------------------------------
[ERROR] Failed to execute goal com.github.eirslett:frontend-maven-plugin:1.9.0:npm (npm install) on project brooklyn-ui-utils: Failed to run task: 'npm install' failed. org.apache.commons.exec.ExecuteException: Process exited with an error: 1 (Exit value: 1) -> [Help 1]
[ERROR]
[ERROR] To see the full stack trace of the errors, re-run Maven with the -e switch.
[ERROR] Re-run Maven using the -X switch to enable full debug logging.
[ERROR]
[ERROR] For more information about the errors and possible solutions, please read the following articles:
[ERROR] [Help 1] http://cwiki.apache.org/confluence/display/MAVEN/MojoFailureException
[ERROR]
[ERROR] After correcting the problems, you can resume the build with the command
[ERROR] mvn <args> -rf :brooklyn-ui-utils
[Pipeline] }
$ docker stop --time=1 f2fdeb70e2966277e8bcd3b82c97947d843b4ec8ab39665d4a6f1a5ab8743abd
$ docker rm -f --volumes f2fdeb70e2966277e8bcd3b82c97947d843b4ec8ab39665d4a6f1a5ab8743abd
[Pipeline] // withDockerContainer
[Pipeline] }
[Pipeline] // stage
[Pipeline] }
[Pipeline] // withEnv
[Pipeline] }
ERROR: script returned exit code 1
[Pipeline] // catchError
[Pipeline] stage
[Pipeline] { (Publish test results)
[Pipeline] junit
Recording test results
[Checks API] No suitable checks publisher found.
[Pipeline] testNG
TestNG Reports Processing: START
Looking for TestNG results report in workspace using pattern: **/testng-results.xml
Saving reports...
Processing '/home/jenkins/jenkins-home/jobs/Brooklyn/jobs/brooklyn/branches/master/builds/851/testng/testng-results-1.xml'
Processing '/home/jenkins/jenkins-home/jobs/Brooklyn/jobs/brooklyn/branches/master/builds/851/testng/testng-results-10.xml'
Processing '/home/jenkins/jenkins-home/jobs/Brooklyn/jobs/brooklyn/branches/master/builds/851/testng/testng-results-11.xml'
Processing '/home/jenkins/jenkins-home/jobs/Brooklyn/jobs/brooklyn/branches/master/builds/851/testng/testng-results-12.xml'
Processing '/home/jenkins/jenkins-home/jobs/Brooklyn/jobs/brooklyn/branches/master/builds/851/testng/testng-results-13.xml'
Processing '/home/jenkins/jenkins-home/jobs/Brooklyn/jobs/brooklyn/branches/master/builds/851/testng/testng-results-14.xml'
Processing '/home/jenkins/jenkins-home/jobs/Brooklyn/jobs/brooklyn/branches/master/builds/851/testng/testng-results-15.xml'
Processing '/home/jenkins/jenkins-home/jobs/Brooklyn/jobs/brooklyn/branches/master/builds/851/testng/testng-results-16.xml'
Processing '/home/jenkins/jenkins-home/jobs/Brooklyn/jobs/brooklyn/branches/master/builds/851/testng/testng-results-17.xml'
Processing '/home/jenkins/jenkins-home/jobs/Brooklyn/jobs/brooklyn/branches/master/builds/851/testng/testng-results-18.xml'
Processing '/home/jenkins/jenkins-home/jobs/Brooklyn/jobs/brooklyn/branches/master/builds/851/testng/testng-results-19.xml'
Processing '/home/jenkins/jenkins-home/jobs/Brooklyn/jobs/brooklyn/branches/master/builds/851/testng/testng-results-2.xml'
Processing '/home/jenkins/jenkins-home/jobs/Brooklyn/jobs/brooklyn/branches/master/builds/851/testng/testng-results-20.xml'
Processing '/home/jenkins/jenkins-home/jobs/Brooklyn/jobs/brooklyn/branches/master/builds/851/testng/testng-results-21.xml'
Processing '/home/jenkins/jenkins-home/jobs/Brooklyn/jobs/brooklyn/branches/master/builds/851/testng/testng-results-22.xml'
Processing '/home/jenkins/jenkins-home/jobs/Brooklyn/jobs/brooklyn/branches/master/builds/851/testng/testng-results-23.xml'
Processing '/home/jenkins/jenkins-home/jobs/Brooklyn/jobs/brooklyn/branches/master/builds/851/testng/testng-results-24.xml'
Processing '/home/jenkins/jenkins-home/jobs/Brooklyn/jobs/brooklyn/branches/master/builds/851/testng/testng-results-3.xml'
Processing '/home/jenkins/jenkins-home/jobs/Brooklyn/jobs/brooklyn/branches/master/builds/851/testng/testng-results-4.xml'
Processing '/home/jenkins/jenkins-home/jobs/Brooklyn/jobs/brooklyn/branches/master/builds/851/testng/testng-results-5.xml'
Processing '/home/jenkins/jenkins-home/jobs/Brooklyn/jobs/brooklyn/branches/master/builds/851/testng/testng-results-6.xml'
Processing '/home/jenkins/jenkins-home/jobs/Brooklyn/jobs/brooklyn/branches/master/builds/851/testng/testng-results-7.xml'
Processing '/home/jenkins/jenkins-home/jobs/Brooklyn/jobs/brooklyn/branches/master/builds/851/testng/testng-results-8.xml'
Processing '/home/jenkins/jenkins-home/jobs/Brooklyn/jobs/brooklyn/branches/master/builds/851/testng/testng-results-9.xml'
Processing '/home/jenkins/jenkins-home/jobs/Brooklyn/jobs/brooklyn/branches/master/builds/851/testng/testng-results.xml'
TestNG Reports Processing: FINISH
[Pipeline] }
[Pipeline] // stage
[Pipeline] stage
[Pipeline] { (Send notifications)
[Pipeline] step