You are viewing a plain text version of this content. The canonical link for it is here.
Posted to builds@beam.apache.org by Apache Jenkins Server <je...@builds.apache.org> on 2022/07/18 19:17:35 UTC

Build failed in Jenkins: beam_PerformanceTests_InfluxDbIO_IT #2109

See <https://ci-beam.apache.org/job/beam_PerformanceTests_InfluxDbIO_IT/2109/display/redirect?page=changes>

Changes:

[noreply] [BEAM-14117] Unvendor bytebuddy dependency (#17317)


------------------------------------------
[...truncated 152.79 KB...]
Loaded cache entry for task ':sdks:java:harness:compileJava' with cache key f5941153ccf7187046e1195fabcfc494
:sdks:java:harness:compileJava (Thread[Execution worker for ':' Thread 6,5,main]) completed. Took 0.094 secs.
:sdks:java:harness:classes (Thread[Execution worker for ':' Thread 6,5,main]) started.

> Task :sdks:java:harness:classes UP-TO-DATE
Skipping task ':sdks:java:harness:classes' as it has no actions.
:sdks:java:harness:classes (Thread[Execution worker for ':' Thread 6,5,main]) completed. Took 0.0 secs.
:sdks:java:harness:jar (Thread[Execution worker for ':' Thread 6,5,main]) started.

> Task :sdks:java:harness:jar
Caching disabled for task ':sdks:java:harness:jar' because:
  Not worth caching
Task ':sdks:java:harness:jar' is not up-to-date because:
  No history is available.
file or directory '<https://ci-beam.apache.org/job/beam_PerformanceTests_InfluxDbIO_IT/ws/src/sdks/java/harness/build/resources/main',> not found
:sdks:java:harness:jar (Thread[Execution worker for ':' Thread 6,5,main]) completed. Took 0.064 secs.
:runners:java-fn-execution:compileJava (Thread[Execution worker for ':' Thread 6,5,main]) started.

> Task :runners:java-fn-execution:compileJava FROM-CACHE
Custom actions are attached to task ':runners:java-fn-execution:compileJava'.
Build cache key for task ':runners:java-fn-execution:compileJava' is 3472c01e89a975606a75b52400a143e5
Task ':runners:java-fn-execution:compileJava' is not up-to-date because:
  No history is available.
Loaded cache entry for task ':runners:java-fn-execution:compileJava' with cache key 3472c01e89a975606a75b52400a143e5
:runners:java-fn-execution:compileJava (Thread[Execution worker for ':' Thread 6,5,main]) completed. Took 0.098 secs.
:runners:java-fn-execution:classes (Thread[Execution worker for ':' Thread 6,5,main]) started.

> Task :runners:java-fn-execution:classes UP-TO-DATE
Skipping task ':runners:java-fn-execution:classes' as it has no actions.
:runners:java-fn-execution:classes (Thread[Execution worker for ':' Thread 6,5,main]) completed. Took 0.0 secs.
:runners:java-fn-execution:jar (Thread[Execution worker for ':' Thread 6,5,main]) started.

> Task :runners:java-fn-execution:jar
Caching disabled for task ':runners:java-fn-execution:jar' because:
  Not worth caching
Task ':runners:java-fn-execution:jar' is not up-to-date because:
  No history is available.
file or directory '<https://ci-beam.apache.org/job/beam_PerformanceTests_InfluxDbIO_IT/ws/src/runners/java-fn-execution/build/resources/main',> not found
:runners:java-fn-execution:jar (Thread[Execution worker for ':' Thread 6,5,main]) completed. Took 0.044 secs.
:runners:direct-java:compileJava (Thread[Execution worker for ':' Thread 6,5,main]) started.

> Task :runners:direct-java:compileJava FROM-CACHE
Custom actions are attached to task ':runners:direct-java:compileJava'.
Build cache key for task ':runners:direct-java:compileJava' is 43ff20d3d458e2d5c7042456120c6104
Task ':runners:direct-java:compileJava' is not up-to-date because:
  No history is available.
Loaded cache entry for task ':runners:direct-java:compileJava' with cache key 43ff20d3d458e2d5c7042456120c6104
:runners:direct-java:compileJava (Thread[Execution worker for ':' Thread 6,5,main]) completed. Took 0.105 secs.
:runners:direct-java:classes (Thread[Execution worker for ':' Thread 6,5,main]) started.

> Task :runners:direct-java:classes UP-TO-DATE
Skipping task ':runners:direct-java:classes' as it has no actions.
:runners:direct-java:classes (Thread[Execution worker for ':' Thread 6,5,main]) completed. Took 0.0 secs.
:runners:direct-java:shadowJar (Thread[Execution worker for ':' Thread 6,5,main]) started.

> Task :runners:core-java:compileTestJava FROM-CACHE
Custom actions are attached to task ':runners:core-java:compileTestJava'.
Build cache key for task ':runners:core-java:compileTestJava' is 9571634a58584f895a1928a16f0bf76f
Task ':runners:core-java:compileTestJava' is not up-to-date because:
  No history is available.
Loaded cache entry for task ':runners:core-java:compileTestJava' with cache key 9571634a58584f895a1928a16f0bf76f
:runners:core-java:compileTestJava (Thread[Execution worker for ':',5,main]) completed. Took 0.363 secs.
:runners:core-java:testClasses (Thread[Execution worker for ':',5,main]) started.

> Task :runners:core-java:testClasses UP-TO-DATE
Skipping task ':runners:core-java:testClasses' as it has no actions.
:runners:core-java:testClasses (Thread[Execution worker for ':',5,main]) completed. Took 0.0 secs.
:runners:core-java:testJar (Thread[Execution worker for ':',5,main]) started.

> Task :runners:core-java:testJar
Caching disabled for task ':runners:core-java:testJar' because:
  Not worth caching
Task ':runners:core-java:testJar' is not up-to-date because:
  No history is available.
file or directory '<https://ci-beam.apache.org/job/beam_PerformanceTests_InfluxDbIO_IT/ws/src/runners/core-java/build/resources/test',> not found
:runners:core-java:testJar (Thread[Execution worker for ':',5,main]) completed. Took 0.038 secs.

> Task :runners:direct-java:shadowJar FROM-CACHE
Custom actions are attached to task ':runners:direct-java:shadowJar'.
Build cache key for task ':runners:direct-java:shadowJar' is c7f96ec9199bfbde0eb3ee6c472b9692
Task ':runners:direct-java:shadowJar' is not up-to-date because:
  No history is available.
Loaded cache entry for task ':runners:direct-java:shadowJar' with cache key c7f96ec9199bfbde0eb3ee6c472b9692
:runners:direct-java:shadowJar (Thread[Execution worker for ':' Thread 6,5,main]) completed. Took 0.301 secs.
:runners:direct-java:compileTestJava (Thread[Execution worker for ':' Thread 6,5,main]) started.

> Task :runners:direct-java:compileTestJava FROM-CACHE
Custom actions are attached to task ':runners:direct-java:compileTestJava'.
Build cache key for task ':runners:direct-java:compileTestJava' is 802aedae191252b948d1cef719856914
Task ':runners:direct-java:compileTestJava' is not up-to-date because:
  No history is available.
Loaded cache entry for task ':runners:direct-java:compileTestJava' with cache key 802aedae191252b948d1cef719856914
:runners:direct-java:compileTestJava (Thread[Execution worker for ':' Thread 6,5,main]) completed. Took 0.143 secs.
:runners:direct-java:testClasses (Thread[Execution worker for ':' Thread 6,5,main]) started.

> Task :runners:direct-java:testClasses UP-TO-DATE
Skipping task ':runners:direct-java:testClasses' as it has no actions.
:runners:direct-java:testClasses (Thread[Execution worker for ':' Thread 6,5,main]) completed. Took 0.0 secs.
:runners:direct-java:shadowTestJar (Thread[Execution worker for ':' Thread 6,5,main]) started.

> Task :runners:direct-java:shadowTestJar FROM-CACHE
Build cache key for task ':runners:direct-java:shadowTestJar' is 472ecd04ca9426f295bd2508880ea516
Task ':runners:direct-java:shadowTestJar' is not up-to-date because:
  No history is available.
Loaded cache entry for task ':runners:direct-java:shadowTestJar' with cache key 472ecd04ca9426f295bd2508880ea516
:runners:direct-java:shadowTestJar (Thread[Execution worker for ':' Thread 6,5,main]) completed. Took 0.217 secs.

> Task :sdks:java:io:influxdb:compileJava
Custom actions are attached to task ':sdks:java:io:influxdb:compileJava'.
Build cache key for task ':sdks:java:io:influxdb:compileJava' is d5eac8c865bd93c7eba345431a9c7d14
Task ':sdks:java:io:influxdb:compileJava' is not up-to-date because:
  No history is available.
The input changes require a full rebuild for incremental task ':sdks:java:io:influxdb:compileJava'.
Full recompilation is required because no incremental change information is available. This is usually caused by clean builds or changing compiler arguments.
Compiling with toolchain '/usr/lib/jvm/java-8-openjdk-amd64'.
Invalidating in-memory cache of /home/jenkins/.gradle/caches/7.4/fileContent/java-modules.bin
Invalidating in-memory cache of /home/jenkins/.gradle/caches/7.4/fileContent/annotation-processors.bin
Starting process 'Gradle Worker Daemon 93'. Working directory: /home/jenkins/.gradle/workers Command: /usr/lib/jvm/java-8-openjdk-amd64/bin/java -Djava.security.manager=worker.org.gradle.process.internal.worker.child.BootstrapSecurityManager -Xbootclasspath/p:/home/jenkins/.gradle/caches/modules-2/files-2.1/com.google.errorprone/javac/9+181-r4173-1/bdf4c0aa7d540ee1f7bf14d47447aea4bbf450c5/javac-9+181-r4173-1.jar -Xbootclasspath/p:/home/jenkins/.gradle/caches/modules-2/files-2.1/com.google.errorprone/javac/9+181-r4173-1/bdf4c0aa7d540ee1f7bf14d47447aea4bbf450c5/javac-9+181-r4173-1.jar -Xmx512m -Dfile.encoding=UTF-8 -Duser.country=US -Duser.language=en -Duser.variant -cp /home/jenkins/.gradle/caches/7.4/workerMain/gradle-worker.jar worker.org.gradle.process.internal.worker.GradleWorkerMain 'Gradle Worker Daemon 93'
Successfully started process 'Gradle Worker Daemon 93'
Started Gradle worker daemon (0.347 secs) with fork options DaemonForkOptions{executable=/usr/lib/jvm/java-8-openjdk-amd64/bin/java, minHeapSize=null, maxHeapSize=null, jvmArgs=[-Xbootclasspath/p:/home/jenkins/.gradle/caches/modules-2/files-2.1/com.google.errorprone/javac/9+181-r4173-1/bdf4c0aa7d540ee1f7bf14d47447aea4bbf450c5/javac-9+181-r4173-1.jar, -Xbootclasspath/p:/home/jenkins/.gradle/caches/modules-2/files-2.1/com.google.errorprone/javac/9+181-r4173-1/bdf4c0aa7d540ee1f7bf14d47447aea4bbf450c5/javac-9+181-r4173-1.jar], keepAliveMode=SESSION}.
Compiling with JDK Java compiler API.
Note: <https://ci-beam.apache.org/job/beam_PerformanceTests_InfluxDbIO_IT/ws/src/sdks/java/io/influxdb/src/main/java/org/apache/beam/sdk/io/influxdb/InfluxDbIO.java> uses unchecked or unsafe operations.
Note: Recompile with -Xlint:unchecked for details.
Invalidating in-memory cache of /home/jenkins/.gradle/caches/7.4/javaCompile/jarAnalysis.bin
Invalidating in-memory cache of /home/jenkins/.gradle/caches/7.4/javaCompile/classAnalysis.bin
Class dependency analysis for incremental compilation took 0.008 secs.
Created classpath snapshot for incremental compilation in 0.108 secs.
Stored cache entry for task ':sdks:java:io:influxdb:compileJava' with cache key d5eac8c865bd93c7eba345431a9c7d14
:sdks:java:io:influxdb:compileJava (Thread[Execution worker for ':' Thread 4,5,main]) completed. Took 8.404 secs.
:sdks:java:io:influxdb:classes (Thread[Execution worker for ':' Thread 4,5,main]) started.

> Task :sdks:java:io:influxdb:classes
Skipping task ':sdks:java:io:influxdb:classes' as it has no actions.
:sdks:java:io:influxdb:classes (Thread[Execution worker for ':' Thread 4,5,main]) completed. Took 0.0 secs.
:sdks:java:io:influxdb:compileTestJava (Thread[Execution worker for ':' Thread 4,5,main]) started.

> Task :sdks:java:io:influxdb:compileTestJava
Custom actions are attached to task ':sdks:java:io:influxdb:compileTestJava'.
Build cache key for task ':sdks:java:io:influxdb:compileTestJava' is f7ac9d3147989b1d280391cd22e36857
Task ':sdks:java:io:influxdb:compileTestJava' is not up-to-date because:
  No history is available.
The input changes require a full rebuild for incremental task ':sdks:java:io:influxdb:compileTestJava'.
Full recompilation is required because no incremental change information is available. This is usually caused by clean builds or changing compiler arguments.
Compiling with toolchain '/usr/lib/jvm/java-8-openjdk-amd64'.
Compiling with JDK Java compiler API.
Note: <https://ci-beam.apache.org/job/beam_PerformanceTests_InfluxDbIO_IT/ws/src/sdks/java/io/influxdb/src/test/java/org/apache/beam/sdk/io/influxdb/InfluxDbIOTest.java> uses unchecked or unsafe operations.
Note: Recompile with -Xlint:unchecked for details.
Class dependency analysis for incremental compilation took 0.002 secs.
Created classpath snapshot for incremental compilation in 0.061 secs.
Stored cache entry for task ':sdks:java:io:influxdb:compileTestJava' with cache key f7ac9d3147989b1d280391cd22e36857
:sdks:java:io:influxdb:compileTestJava (Thread[Execution worker for ':' Thread 4,5,main]) completed. Took 1.874 secs.
:sdks:java:io:influxdb:testClasses (Thread[Execution worker for ':' Thread 4,5,main]) started.

> Task :sdks:java:io:influxdb:testClasses
Skipping task ':sdks:java:io:influxdb:testClasses' as it has no actions.
:sdks:java:io:influxdb:testClasses (Thread[Execution worker for ':' Thread 4,5,main]) completed. Took 0.0 secs.
:sdks:java:io:influxdb:integrationTest (Thread[Execution worker for ':' Thread 4,5,main]) started.
producer locations for task group 0 (Thread[Execution worker for ':' Thread 2,5,main]) started.
producer locations for task group 0 (Thread[Execution worker for ':' Thread 2,5,main]) completed. Took 0.0 secs.
Gradle Test Executor 94 started executing tests.

> Task :sdks:java:io:influxdb:integrationTest
Custom actions are attached to task ':sdks:java:io:influxdb:integrationTest'.
Build cache key for task ':sdks:java:io:influxdb:integrationTest' is d70de399adbab40f9cd891b39e229fd4
Task ':sdks:java:io:influxdb:integrationTest' is not up-to-date because:
  Task.upToDateWhen is false.
Starting process 'Gradle Test Executor 94'. Working directory: <https://ci-beam.apache.org/job/beam_PerformanceTests_InfluxDbIO_IT/ws/src/sdks/java/io/influxdb> Command: /usr/lib/jvm/java-8-openjdk-amd64/bin/java -DbeamTestPipelineOptions=["--influxDBURL=http://35.188.187.77:8086","--influxDBUserName=superadmin","--influxDBPassword=supersecretpassword","--databaseName=db1"] -Djava.security.manager=worker.org.gradle.process.internal.worker.child.BootstrapSecurityManager -Dorg.gradle.internal.worker.tmpdir=<https://ci-beam.apache.org/job/beam_PerformanceTests_InfluxDbIO_IT/ws/src/sdks/java/io/influxdb/build/tmp/integrationTest/work> -Dorg.gradle.native=false -Xmx2g -Dfile.encoding=UTF-8 -Duser.country=US -Duser.language=en -Duser.variant -ea -cp /home/jenkins/.gradle/caches/7.4/workerMain/gradle-worker.jar worker.org.gradle.process.internal.worker.GradleWorkerMain 'Gradle Test Executor 94'
Successfully started process 'Gradle Test Executor 94'

org.apache.beam.sdk.io.influxdb.InfluxDbIOIT > testWriteAndReadWithMultipleMetric FAILED
    org.influxdb.InfluxDBIOException: java.net.SocketTimeoutException: connect timed out
        at org.influxdb.impl.InfluxDBImpl.execute(InfluxDBImpl.java:836)
        at org.influxdb.impl.InfluxDBImpl.executeQuery(InfluxDBImpl.java:819)
        at org.influxdb.impl.InfluxDBImpl.query(InfluxDBImpl.java:554)
        at org.apache.beam.sdk.io.influxdb.InfluxDbIOIT.initTest(InfluxDbIOIT.java:99)

        Caused by:
        java.net.SocketTimeoutException: connect timed out
            at java.net.PlainSocketImpl.socketConnect(Native Method)
            at java.net.AbstractPlainSocketImpl.doConnect(AbstractPlainSocketImpl.java:350)
            at java.net.AbstractPlainSocketImpl.connectToAddress(AbstractPlainSocketImpl.java:206)
            at java.net.AbstractPlainSocketImpl.connect(AbstractPlainSocketImpl.java:188)
            at java.net.SocksSocketImpl.connect(SocksSocketImpl.java:392)
            at java.net.Socket.connect(Socket.java:607)
            at okhttp3.internal.platform.Platform.connectSocket(Platform.kt:119)
            at okhttp3.internal.connection.RealConnection.connectSocket(RealConnection.kt:283)
            at okhttp3.internal.connection.RealConnection.connect(RealConnection.kt:195)
            at okhttp3.internal.connection.ExchangeFinder.findConnection(ExchangeFinder.kt:249)
            at okhttp3.internal.connection.ExchangeFinder.findHealthyConnection(ExchangeFinder.kt:108)
            at okhttp3.internal.connection.ExchangeFinder.find(ExchangeFinder.kt:76)
            at okhttp3.internal.connection.RealCall.initExchange$okhttp(RealCall.kt:245)
            at okhttp3.internal.connection.ConnectInterceptor.intercept(ConnectInterceptor.kt:32)
            at okhttp3.internal.http.RealInterceptorChain.proceed(RealInterceptorChain.kt:100)
            at okhttp3.internal.cache.CacheInterceptor.intercept(CacheInterceptor.kt:82)
            at okhttp3.internal.http.RealInterceptorChain.proceed(RealInterceptorChain.kt:100)
            at okhttp3.internal.http.BridgeInterceptor.intercept(BridgeInterceptor.kt:83)
            at okhttp3.internal.http.RealInterceptorChain.proceed(RealInterceptorChain.kt:100)
            at okhttp3.internal.http.RetryAndFollowUpInterceptor.intercept(RetryAndFollowUpInterceptor.kt:76)
            at okhttp3.internal.http.RealInterceptorChain.proceed(RealInterceptorChain.kt:100)
            at org.influxdb.impl.BasicAuthInterceptor.intercept(BasicAuthInterceptor.java:22)
            at okhttp3.internal.http.RealInterceptorChain.proceed(RealInterceptorChain.kt:100)
            at org.influxdb.impl.GzipRequestInterceptor.intercept(GzipRequestInterceptor.java:42)
            at okhttp3.internal.http.RealInterceptorChain.proceed(RealInterceptorChain.kt:100)
            at okhttp3.logging.HttpLoggingInterceptor.intercept(HttpLoggingInterceptor.kt:152)
            at okhttp3.internal.http.RealInterceptorChain.proceed(RealInterceptorChain.kt:100)
            at okhttp3.internal.connection.RealCall.getResponseWithInterceptorChain$okhttp(RealCall.kt:197)
            at okhttp3.internal.connection.RealCall.execute(RealCall.kt:148)
            at retrofit2.OkHttpCall.execute(OkHttpCall.java:190)
            at org.influxdb.impl.InfluxDBImpl.execute(InfluxDBImpl.java:824)
            ... 3 more

Gradle Test Executor 94 finished executing tests.

> Task :sdks:java:io:influxdb:integrationTest FAILED

6 tests completed, 1 failed
Finished generating test XML results (0.001 secs) into: <https://ci-beam.apache.org/job/beam_PerformanceTests_InfluxDbIO_IT/ws/src/sdks/java/io/influxdb/build/test-results/integrationTest>
Generating HTML test report...
Finished generating test html results (0.003 secs) into: <https://ci-beam.apache.org/job/beam_PerformanceTests_InfluxDbIO_IT/ws/src/sdks/java/io/influxdb/build/reports/tests/integrationTest>
:sdks:java:io:influxdb:integrationTest (Thread[Execution worker for ':' Thread 4,5,main]) completed. Took 16.89 secs.

FAILURE: Build failed with an exception.

* What went wrong:
Execution failed for task ':sdks:java:io:influxdb:integrationTest'.
> There were failing tests. See the report at: file://<https://ci-beam.apache.org/job/beam_PerformanceTests_InfluxDbIO_IT/ws/src/sdks/java/io/influxdb/build/reports/tests/integrationTest/index.html>

* Try:
> Run with --stacktrace option to get the stack trace.
> Run with --debug option to get more log output.
> Run with --scan to get full insights.

* Get more help at https://help.gradle.org

Deprecated Gradle features were used in this build, making it incompatible with Gradle 8.0.

You can use '--warning-mode all' to show the individual deprecation warnings and determine if they come from your own scripts or plugins.

See https://docs.gradle.org/7.4/userguide/command_line_interface.html#sec:command_line_warnings

BUILD FAILED in 33s
77 actionable tasks: 44 executed, 31 from cache, 2 up-to-date

Publishing build scan...
https://gradle.com/s/nsd24sxe6jr5g

Stopped 1 worker daemon(s).
Build step 'Invoke Gradle script' changed build result to FAILURE
Build step 'Invoke Gradle script' marked build as failure

---------------------------------------------------------------------
To unsubscribe, e-mail: builds-unsubscribe@beam.apache.org
For additional commands, e-mail: builds-help@beam.apache.org


Jenkins build is back to normal : beam_PerformanceTests_InfluxDbIO_IT #2110

Posted by Apache Jenkins Server <je...@builds.apache.org>.
See <https://ci-beam.apache.org/job/beam_PerformanceTests_InfluxDbIO_IT/2110/display/redirect?page=changes>


---------------------------------------------------------------------
To unsubscribe, e-mail: builds-unsubscribe@beam.apache.org
For additional commands, e-mail: builds-help@beam.apache.org