You are viewing a plain text version of this content. The canonical link for it is here.
Posted to dev@hbase.apache.org by Apache Jenkins Server <je...@builds.apache.org> on 2012/04/04 20:30:22 UTC
Build failed in Jenkins: HBase-0.92 #353
See <https://builds.apache.org/job/HBase-0.92/353/changes>
Changes:
[stack] HBASE-5533 Add more metrics to HBase
------------------------------------------
[...truncated 7005 lines...]
Tests run: 3, Failures: 0, Errors: 0, Skipped: 0, Time elapsed: 0.22 sec
Forking command line: /bin/sh -c cd <https://builds.apache.org/job/HBase-0.92/ws/trunk> && /home/jenkins/tools/java/jdk1.6.0_27-32/jre/bin/java -enableassertions -Xmx1400m -Djava.security.egd=file:/dev/./urandom -jar <https://builds.apache.org/job/HBase-0.92/ws/trunk/target/surefire/surefirebooter6713951073761430806.jar> <https://builds.apache.org/job/HBase-0.92/ws/trunk/target/surefire/surefire3425460861967508515tmp> <https://builds.apache.org/job/HBase-0.92/ws/trunk/target/surefire/surefire4596138307012252257tmp>
Running org.apache.hadoop.hbase.monitoring.TestMemoryBoundedLogMessageBuffer
Tests run: 2, Failures: 0, Errors: 0, Skipped: 0, Time elapsed: 0.098 sec
Forking command line: /bin/sh -c cd <https://builds.apache.org/job/HBase-0.92/ws/trunk> && /home/jenkins/tools/java/jdk1.6.0_27-32/jre/bin/java -enableassertions -Xmx1400m -Djava.security.egd=file:/dev/./urandom -jar <https://builds.apache.org/job/HBase-0.92/ws/trunk/target/surefire/surefirebooter7065485555722904651.jar> <https://builds.apache.org/job/HBase-0.92/ws/trunk/target/surefire/surefire246226231161603257tmp> <https://builds.apache.org/job/HBase-0.92/ws/trunk/target/surefire/surefire5236623842684759807tmp>
Running org.apache.hadoop.hbase.regionserver.TestHRegionInfo
Tests run: 6, Failures: 0, Errors: 0, Skipped: 0, Time elapsed: 0.62 sec
Forking command line: /bin/sh -c cd <https://builds.apache.org/job/HBase-0.92/ws/trunk> && /home/jenkins/tools/java/jdk1.6.0_27-32/jre/bin/java -enableassertions -Xmx1400m -Djava.security.egd=file:/dev/./urandom -jar <https://builds.apache.org/job/HBase-0.92/ws/trunk/target/surefire/surefirebooter5494459563174077477.jar> <https://builds.apache.org/job/HBase-0.92/ws/trunk/target/surefire/surefire5229976183020105821tmp> <https://builds.apache.org/job/HBase-0.92/ws/trunk/target/surefire/surefire2307322124567290601tmp>
Running org.apache.hadoop.hbase.regionserver.TestMemStore
Tests run: 21, Failures: 0, Errors: 0, Skipped: 0, Time elapsed: 27.546 sec
Forking command line: /bin/sh -c cd <https://builds.apache.org/job/HBase-0.92/ws/trunk> && /home/jenkins/tools/java/jdk1.6.0_27-32/jre/bin/java -enableassertions -Xmx1400m -Djava.security.egd=file:/dev/./urandom -jar <https://builds.apache.org/job/HBase-0.92/ws/trunk/target/surefire/surefirebooter5262191704024360000.jar> <https://builds.apache.org/job/HBase-0.92/ws/trunk/target/surefire/surefire7899001296078563309tmp> <https://builds.apache.org/job/HBase-0.92/ws/trunk/target/surefire/surefire7239019956363189568tmp>
Running org.apache.hadoop.hbase.regionserver.TestHRegion
Tests run: 60, Failures: 0, Errors: 0, Skipped: 0, Time elapsed: 36.246 sec
Forking command line: /bin/sh -c cd <https://builds.apache.org/job/HBase-0.92/ws/trunk> && /home/jenkins/tools/java/jdk1.6.0_27-32/jre/bin/java -enableassertions -Xmx1400m -Djava.security.egd=file:/dev/./urandom -jar <https://builds.apache.org/job/HBase-0.92/ws/trunk/target/surefire/surefirebooter1625460841757376190.jar> <https://builds.apache.org/job/HBase-0.92/ws/trunk/target/surefire/surefire4791996229362198037tmp> <https://builds.apache.org/job/HBase-0.92/ws/trunk/target/surefire/surefire4692217419036440927tmp>
Running org.apache.hadoop.hbase.regionserver.TestMasterAddressManager
Tests run: 1, Failures: 0, Errors: 0, Skipped: 0, Time elapsed: 0.652 sec
Forking command line: /bin/sh -c cd <https://builds.apache.org/job/HBase-0.92/ws/trunk> && /home/jenkins/tools/java/jdk1.6.0_27-32/jre/bin/java -enableassertions -Xmx1400m -Djava.security.egd=file:/dev/./urandom -jar <https://builds.apache.org/job/HBase-0.92/ws/trunk/target/surefire/surefirebooter8766837723181867323.jar> <https://builds.apache.org/job/HBase-0.92/ws/trunk/target/surefire/surefire6740569941811614255tmp> <https://builds.apache.org/job/HBase-0.92/ws/trunk/target/surefire/surefire3378897758082427854tmp>
Running org.apache.hadoop.hbase.regionserver.TestCompoundBloomFilter
Tests run: 3, Failures: 0, Errors: 0, Skipped: 0, Time elapsed: 21.211 sec
Forking command line: /bin/sh -c cd <https://builds.apache.org/job/HBase-0.92/ws/trunk> && /home/jenkins/tools/java/jdk1.6.0_27-32/jre/bin/java -enableassertions -Xmx1400m -Djava.security.egd=file:/dev/./urandom -jar <https://builds.apache.org/job/HBase-0.92/ws/trunk/target/surefire/surefirebooter7155805699467912319.jar> <https://builds.apache.org/job/HBase-0.92/ws/trunk/target/surefire/surefire862774787319961295tmp> <https://builds.apache.org/job/HBase-0.92/ws/trunk/target/surefire/surefire6165551323020398980tmp>
Running org.apache.hadoop.hbase.regionserver.TestSplitLogWorker
Tests run: 5, Failures: 0, Errors: 0, Skipped: 0, Time elapsed: 2.181 sec
Forking command line: /bin/sh -c cd <https://builds.apache.org/job/HBase-0.92/ws/trunk> && /home/jenkins/tools/java/jdk1.6.0_27-32/jre/bin/java -enableassertions -Xmx1400m -Djava.security.egd=file:/dev/./urandom -jar <https://builds.apache.org/job/HBase-0.92/ws/trunk/target/surefire/surefirebooter812313540983125676.jar> <https://builds.apache.org/job/HBase-0.92/ws/trunk/target/surefire/surefire7744717979755332233tmp> <https://builds.apache.org/job/HBase-0.92/ws/trunk/target/surefire/surefire6633119627830737005tmp>
Running org.apache.hadoop.hbase.regionserver.TestServerCustomProtocol
Tests run: 7, Failures: 0, Errors: 0, Skipped: 0, Time elapsed: 21.933 sec
Forking command line: /bin/sh -c cd <https://builds.apache.org/job/HBase-0.92/ws/trunk> && /home/jenkins/tools/java/jdk1.6.0_27-32/jre/bin/java -enableassertions -Xmx1400m -Djava.security.egd=file:/dev/./urandom -jar <https://builds.apache.org/job/HBase-0.92/ws/trunk/target/surefire/surefirebooter275794036432981595.jar> <https://builds.apache.org/job/HBase-0.92/ws/trunk/target/surefire/surefire5949954517160892851tmp> <https://builds.apache.org/job/HBase-0.92/ws/trunk/target/surefire/surefire5520965055974097231tmp>
Running org.apache.hadoop.hbase.regionserver.TestScanWithBloomError
Tests run: 3, Failures: 0, Errors: 0, Skipped: 0, Time elapsed: 1.114 sec
Forking command line: /bin/sh -c cd <https://builds.apache.org/job/HBase-0.92/ws/trunk> && /home/jenkins/tools/java/jdk1.6.0_27-32/jre/bin/java -enableassertions -Xmx1400m -Djava.security.egd=file:/dev/./urandom -jar <https://builds.apache.org/job/HBase-0.92/ws/trunk/target/surefire/surefirebooter1845685668245583241.jar> <https://builds.apache.org/job/HBase-0.92/ws/trunk/target/surefire/surefire7155136793533471137tmp> <https://builds.apache.org/job/HBase-0.92/ws/trunk/target/surefire/surefire4795591890943683462tmp>
Running org.apache.hadoop.hbase.regionserver.TestStoreFileBlockCacheSummary
Tests run: 1, Failures: 0, Errors: 0, Skipped: 0, Time elapsed: 21.491 sec
Forking command line: /bin/sh -c cd <https://builds.apache.org/job/HBase-0.92/ws/trunk> && /home/jenkins/tools/java/jdk1.6.0_27-32/jre/bin/java -enableassertions -Xmx1400m -Djava.security.egd=file:/dev/./urandom -jar <https://builds.apache.org/job/HBase-0.92/ws/trunk/target/surefire/surefirebooter8220246815746806568.jar> <https://builds.apache.org/job/HBase-0.92/ws/trunk/target/surefire/surefire8797981399876683074tmp> <https://builds.apache.org/job/HBase-0.92/ws/trunk/target/surefire/surefire5674543555606351920tmp>
Running org.apache.hadoop.hbase.regionserver.TestStore
Tests run: 11, Failures: 0, Errors: 0, Skipped: 0, Time elapsed: 1.804 sec
Forking command line: /bin/sh -c cd <https://builds.apache.org/job/HBase-0.92/ws/trunk> && /home/jenkins/tools/java/jdk1.6.0_27-32/jre/bin/java -enableassertions -Xmx1400m -Djava.security.egd=file:/dev/./urandom -jar <https://builds.apache.org/job/HBase-0.92/ws/trunk/target/surefire/surefirebooter1181344096344073815.jar> <https://builds.apache.org/job/HBase-0.92/ws/trunk/target/surefire/surefire4262075596888736334tmp> <https://builds.apache.org/job/HBase-0.92/ws/trunk/target/surefire/surefire6640071857103195997tmp>
Running org.apache.hadoop.hbase.regionserver.TestBlocksRead
Tests run: 3, Failures: 0, Errors: 0, Skipped: 0, Time elapsed: 1.06 sec
Forking command line: /bin/sh -c cd <https://builds.apache.org/job/HBase-0.92/ws/trunk> && /home/jenkins/tools/java/jdk1.6.0_27-32/jre/bin/java -enableassertions -Xmx1400m -Djava.security.egd=file:/dev/./urandom -jar <https://builds.apache.org/job/HBase-0.92/ws/trunk/target/surefire/surefirebooter6415940313040848563.jar> <https://builds.apache.org/job/HBase-0.92/ws/trunk/target/surefire/surefire391495261857006321tmp> <https://builds.apache.org/job/HBase-0.92/ws/trunk/target/surefire/surefire9145255080843827214tmp>
Running org.apache.hadoop.hbase.regionserver.TestRSKilledWhenMasterInitializing
Tests run: 1, Failures: 0, Errors: 0, Skipped: 0, Time elapsed: 78.553 sec
Forking command line: /bin/sh -c cd <https://builds.apache.org/job/HBase-0.92/ws/trunk> && /home/jenkins/tools/java/jdk1.6.0_27-32/jre/bin/java -enableassertions -Xmx1400m -Djava.security.egd=file:/dev/./urandom -jar <https://builds.apache.org/job/HBase-0.92/ws/trunk/target/surefire/surefirebooter4926914358546116862.jar> <https://builds.apache.org/job/HBase-0.92/ws/trunk/target/surefire/surefire9100489435195612650tmp> <https://builds.apache.org/job/HBase-0.92/ws/trunk/target/surefire/surefire7890651392673166655tmp>
Running org.apache.hadoop.hbase.regionserver.TestFSErrorsExposed
Tests run: 3, Failures: 0, Errors: 0, Skipped: 0, Time elapsed: 33.773 sec
Forking command line: /bin/sh -c cd <https://builds.apache.org/job/HBase-0.92/ws/trunk> && /home/jenkins/tools/java/jdk1.6.0_27-32/jre/bin/java -enableassertions -Xmx1400m -Djava.security.egd=file:/dev/./urandom -jar <https://builds.apache.org/job/HBase-0.92/ws/trunk/target/surefire/surefirebooter2756045828376865810.jar> <https://builds.apache.org/job/HBase-0.92/ws/trunk/target/surefire/surefire6090924612806902825tmp> <https://builds.apache.org/job/HBase-0.92/ws/trunk/target/surefire/surefire6334090638818830064tmp>
Running org.apache.hadoop.hbase.regionserver.handler.TestCloseRegionHandler
Tests run: 3, Failures: 0, Errors: 0, Skipped: 0, Time elapsed: 1.285 sec
Forking command line: /bin/sh -c cd <https://builds.apache.org/job/HBase-0.92/ws/trunk> && /home/jenkins/tools/java/jdk1.6.0_27-32/jre/bin/java -enableassertions -Xmx1400m -Djava.security.egd=file:/dev/./urandom -jar <https://builds.apache.org/job/HBase-0.92/ws/trunk/target/surefire/surefirebooter5389356857884145955.jar> <https://builds.apache.org/job/HBase-0.92/ws/trunk/target/surefire/surefire2495726749415686715tmp> <https://builds.apache.org/job/HBase-0.92/ws/trunk/target/surefire/surefire5657648289576905401tmp>
Running org.apache.hadoop.hbase.regionserver.handler.TestOpenRegionHandler
Tests run: 3, Failures: 0, Errors: 0, Skipped: 0, Time elapsed: 1.088 sec
Forking command line: /bin/sh -c cd <https://builds.apache.org/job/HBase-0.92/ws/trunk> && /home/jenkins/tools/java/jdk1.6.0_27-32/jre/bin/java -enableassertions -Xmx1400m -Djava.security.egd=file:/dev/./urandom -jar <https://builds.apache.org/job/HBase-0.92/ws/trunk/target/surefire/surefirebooter3574502204347792141.jar> <https://builds.apache.org/job/HBase-0.92/ws/trunk/target/surefire/surefire3575932203703488849tmp> <https://builds.apache.org/job/HBase-0.92/ws/trunk/target/surefire/surefire939711205687026733tmp>
Running org.apache.hadoop.hbase.regionserver.TestScanDeleteTracker
Tests run: 6, Failures: 0, Errors: 0, Skipped: 0, Time elapsed: 0.603 sec
Forking command line: /bin/sh -c cd <https://builds.apache.org/job/HBase-0.92/ws/trunk> && /home/jenkins/tools/java/jdk1.6.0_27-32/jre/bin/java -enableassertions -Xmx1400m -Djava.security.egd=file:/dev/./urandom -jar <https://builds.apache.org/job/HBase-0.92/ws/trunk/target/surefire/surefirebooter7677729248819086685.jar> <https://builds.apache.org/job/HBase-0.92/ws/trunk/target/surefire/surefire4101204095584220882tmp> <https://builds.apache.org/job/HBase-0.92/ws/trunk/target/surefire/surefire3354898986190071111tmp>
Running org.apache.hadoop.hbase.regionserver.TestSplitTransactionOnCluster
Tests run: 4, Failures: 0, Errors: 0, Skipped: 0, Time elapsed: 48.364 sec
Forking command line: /bin/sh -c cd <https://builds.apache.org/job/HBase-0.92/ws/trunk> && /home/jenkins/tools/java/jdk1.6.0_27-32/jre/bin/java -enableassertions -Xmx1400m -Djava.security.egd=file:/dev/./urandom -jar <https://builds.apache.org/job/HBase-0.92/ws/trunk/target/surefire/surefirebooter4476868821483983828.jar> <https://builds.apache.org/job/HBase-0.92/ws/trunk/target/surefire/surefire4674639216110126515tmp> <https://builds.apache.org/job/HBase-0.92/ws/trunk/target/surefire/surefire203492620430357863tmp>
Running org.apache.hadoop.hbase.regionserver.TestHRegionServerBulkLoad
Tests run: 1, Failures: 0, Errors: 0, Skipped: 0, Time elapsed: 50.873 sec
Forking command line: /bin/sh -c cd <https://builds.apache.org/job/HBase-0.92/ws/trunk> && /home/jenkins/tools/java/jdk1.6.0_27-32/jre/bin/java -enableassertions -Xmx1400m -Djava.security.egd=file:/dev/./urandom -jar <https://builds.apache.org/job/HBase-0.92/ws/trunk/target/surefire/surefirebooter1126013378704017412.jar> <https://builds.apache.org/job/HBase-0.92/ws/trunk/target/surefire/surefire9095555191608872011tmp> <https://builds.apache.org/job/HBase-0.92/ws/trunk/target/surefire/surefire8750935965277606001tmp>
Running org.apache.hadoop.hbase.regionserver.TestSplitTransaction
Tests run: 7, Failures: 0, Errors: 0, Skipped: 0, Time elapsed: 4.043 sec
Forking command line: /bin/sh -c cd <https://builds.apache.org/job/HBase-0.92/ws/trunk> && /home/jenkins/tools/java/jdk1.6.0_27-32/jre/bin/java -enableassertions -Xmx1400m -Djava.security.egd=file:/dev/./urandom -jar <https://builds.apache.org/job/HBase-0.92/ws/trunk/target/surefire/surefirebooter5768530379368501357.jar> <https://builds.apache.org/job/HBase-0.92/ws/trunk/target/surefire/surefire4566304193856197614tmp> <https://builds.apache.org/job/HBase-0.92/ws/trunk/target/surefire/surefire5223077201320589345tmp>
Running org.apache.hadoop.hbase.regionserver.TestReadWriteConsistencyControl
Tests run: 1, Failures: 0, Errors: 0, Skipped: 0, Time elapsed: 10.107 sec
Forking command line: /bin/sh -c cd <https://builds.apache.org/job/HBase-0.92/ws/trunk> && /home/jenkins/tools/java/jdk1.6.0_27-32/jre/bin/java -enableassertions -Xmx1400m -Djava.security.egd=file:/dev/./urandom -jar <https://builds.apache.org/job/HBase-0.92/ws/trunk/target/surefire/surefirebooter2620916471363160193.jar> <https://builds.apache.org/job/HBase-0.92/ws/trunk/target/surefire/surefire8376260760386686920tmp> <https://builds.apache.org/job/HBase-0.92/ws/trunk/target/surefire/surefire2108551000139468352tmp>
Running org.apache.hadoop.hbase.regionserver.TestKeyValueHeap
Tests run: 3, Failures: 0, Errors: 0, Skipped: 0, Time elapsed: 0.501 sec
Forking command line: /bin/sh -c cd <https://builds.apache.org/job/HBase-0.92/ws/trunk> && /home/jenkins/tools/java/jdk1.6.0_27-32/jre/bin/java -enableassertions -Xmx1400m -Djava.security.egd=file:/dev/./urandom -jar <https://builds.apache.org/job/HBase-0.92/ws/trunk/target/surefire/surefirebooter5828886857700415311.jar> <https://builds.apache.org/job/HBase-0.92/ws/trunk/target/surefire/surefire5028719194463912406tmp> <https://builds.apache.org/job/HBase-0.92/ws/trunk/target/surefire/surefire7147669883622391345tmp>
Running org.apache.hadoop.hbase.regionserver.TestCompactSelection
Tests run: 1, Failures: 0, Errors: 0, Skipped: 0, Time elapsed: 0.728 sec
Forking command line: /bin/sh -c cd <https://builds.apache.org/job/HBase-0.92/ws/trunk> && /home/jenkins/tools/java/jdk1.6.0_27-32/jre/bin/java -enableassertions -Xmx1400m -Djava.security.egd=file:/dev/./urandom -jar <https://builds.apache.org/job/HBase-0.92/ws/trunk/target/surefire/surefirebooter9038991372772818793.jar> <https://builds.apache.org/job/HBase-0.92/ws/trunk/target/surefire/surefire7398758393915141458tmp> <https://builds.apache.org/job/HBase-0.92/ws/trunk/target/surefire/surefire1407296238405719625tmp>
Running org.apache.hadoop.hbase.regionserver.TestMinVersions
Tests run: 6, Failures: 0, Errors: 0, Skipped: 0, Time elapsed: 1.23 sec
Forking command line: /bin/sh -c cd <https://builds.apache.org/job/HBase-0.92/ws/trunk> && /home/jenkins/tools/java/jdk1.6.0_27-32/jre/bin/java -enableassertions -Xmx1400m -Djava.security.egd=file:/dev/./urandom -jar <https://builds.apache.org/job/HBase-0.92/ws/trunk/target/surefire/surefirebooter2534369254313727408.jar> <https://builds.apache.org/job/HBase-0.92/ws/trunk/target/surefire/surefire4958625687507982384tmp> <https://builds.apache.org/job/HBase-0.92/ws/trunk/target/surefire/surefire8552081896567940927tmp>
Running org.apache.hadoop.hbase.regionserver.TestWideScanner
Tests run: 1, Failures: 0, Errors: 0, Skipped: 0, Time elapsed: 1.956 sec
Forking command line: /bin/sh -c cd <https://builds.apache.org/job/HBase-0.92/ws/trunk> && /home/jenkins/tools/java/jdk1.6.0_27-32/jre/bin/java -enableassertions -Xmx1400m -Djava.security.egd=file:/dev/./urandom -jar <https://builds.apache.org/job/HBase-0.92/ws/trunk/target/surefire/surefirebooter8429958485191634205.jar> <https://builds.apache.org/job/HBase-0.92/ws/trunk/target/surefire/surefire7240368325586585469tmp> <https://builds.apache.org/job/HBase-0.92/ws/trunk/target/surefire/surefire8949681424336203195tmp>
Running org.apache.hadoop.hbase.regionserver.TestColumnSeeking
Tests run: 2, Failures: 0, Errors: 0, Skipped: 0, Time elapsed: 4.494 sec
Forking command line: /bin/sh -c cd <https://builds.apache.org/job/HBase-0.92/ws/trunk> && /home/jenkins/tools/java/jdk1.6.0_27-32/jre/bin/java -enableassertions -Xmx1400m -Djava.security.egd=file:/dev/./urandom -jar <https://builds.apache.org/job/HBase-0.92/ws/trunk/target/surefire/surefirebooter2241650544189435833.jar> <https://builds.apache.org/job/HBase-0.92/ws/trunk/target/surefire/surefire8838726908308656187tmp> <https://builds.apache.org/job/HBase-0.92/ws/trunk/target/surefire/surefire5044922018653509699tmp>
Running org.apache.hadoop.hbase.regionserver.TestGetClosestAtOrBefore
Tests run: 3, Failures: 0, Errors: 0, Skipped: 0, Time elapsed: 1.27 sec
Forking command line: /bin/sh -c cd <https://builds.apache.org/job/HBase-0.92/ws/trunk> && /home/jenkins/tools/java/jdk1.6.0_27-32/jre/bin/java -enableassertions -Xmx1400m -Djava.security.egd=file:/dev/./urandom -jar <https://builds.apache.org/job/HBase-0.92/ws/trunk/target/surefire/surefirebooter8072220053847771266.jar> <https://builds.apache.org/job/HBase-0.92/ws/trunk/target/surefire/surefire6500036300815518672tmp> <https://builds.apache.org/job/HBase-0.92/ws/trunk/target/surefire/surefire1994387939631411312tmp>
Running org.apache.hadoop.hbase.regionserver.TestExplicitColumnTracker
Tests run: 4, Failures: 0, Errors: 0, Skipped: 0, Time elapsed: 0.893 sec
Forking command line: /bin/sh -c cd <https://builds.apache.org/job/HBase-0.92/ws/trunk> && /home/jenkins/tools/java/jdk1.6.0_27-32/jre/bin/java -enableassertions -Xmx1400m -Djava.security.egd=file:/dev/./urandom -jar <https://builds.apache.org/job/HBase-0.92/ws/trunk/target/surefire/surefirebooter4672316492451173311.jar> <https://builds.apache.org/job/HBase-0.92/ws/trunk/target/surefire/surefire1459115146258751548tmp> <https://builds.apache.org/job/HBase-0.92/ws/trunk/target/surefire/surefire1461325453850320134tmp>
Running org.apache.hadoop.hbase.regionserver.TestMemStoreLAB
Tests run: 3, Failures: 0, Errors: 0, Skipped: 0, Time elapsed: 1.381 sec
Forking command line: /bin/sh -c cd <https://builds.apache.org/job/HBase-0.92/ws/trunk> && /home/jenkins/tools/java/jdk1.6.0_27-32/jre/bin/java -enableassertions -Xmx1400m -Djava.security.egd=file:/dev/./urandom -jar <https://builds.apache.org/job/HBase-0.92/ws/trunk/target/surefire/surefirebooter4288191586422384259.jar> <https://builds.apache.org/job/HBase-0.92/ws/trunk/target/surefire/surefire4605097681242172590tmp> <https://builds.apache.org/job/HBase-0.92/ws/trunk/target/surefire/surefire8531521373397973099tmp>
Running org.apache.hadoop.hbase.regionserver.TestKeyValueScanFixture
Tests run: 1, Failures: 0, Errors: 0, Skipped: 0, Time elapsed: 0.115 sec
Forking command line: /bin/sh -c cd <https://builds.apache.org/job/HBase-0.92/ws/trunk> && /home/jenkins/tools/java/jdk1.6.0_27-32/jre/bin/java -enableassertions -Xmx1400m -Djava.security.egd=file:/dev/./urandom -jar <https://builds.apache.org/job/HBase-0.92/ws/trunk/target/surefire/surefirebooter3173816307435958410.jar> <https://builds.apache.org/job/HBase-0.92/ws/trunk/target/surefire/surefire3845638051956048296tmp> <https://builds.apache.org/job/HBase-0.92/ws/trunk/target/surefire/surefire1179308145029632694tmp>
Running org.apache.hadoop.hbase.regionserver.wal.TestLogRollAbort
Tests run: 1, Failures: 0, Errors: 0, Skipped: 0, Time elapsed: 156.69 sec
Forking command line: /bin/sh -c cd <https://builds.apache.org/job/HBase-0.92/ws/trunk> && /home/jenkins/tools/java/jdk1.6.0_27-32/jre/bin/java -enableassertions -Xmx1400m -Djava.security.egd=file:/dev/./urandom -jar <https://builds.apache.org/job/HBase-0.92/ws/trunk/target/surefire/surefirebooter1559337372314060089.jar> <https://builds.apache.org/job/HBase-0.92/ws/trunk/target/surefire/surefire903158201837701881tmp> <https://builds.apache.org/job/HBase-0.92/ws/trunk/target/surefire/surefire2735780761266725664tmp>
Running org.apache.hadoop.hbase.regionserver.wal.TestWALActionsListener
Tests run: 1, Failures: 0, Errors: 0, Skipped: 0, Time elapsed: 0.737 sec
Forking command line: /bin/sh -c cd <https://builds.apache.org/job/HBase-0.92/ws/trunk> && /home/jenkins/tools/java/jdk1.6.0_27-32/jre/bin/java -enableassertions -Xmx1400m -Djava.security.egd=file:/dev/./urandom -jar <https://builds.apache.org/job/HBase-0.92/ws/trunk/target/surefire/surefirebooter5416598769080946577.jar> <https://builds.apache.org/job/HBase-0.92/ws/trunk/target/surefire/surefire860206329182782480tmp> <https://builds.apache.org/job/HBase-0.92/ws/trunk/target/surefire/surefire6560505293349695591tmp>
Running org.apache.hadoop.hbase.regionserver.wal.TestLogRolling
Tests run: 3, Failures: 0, Errors: 0, Skipped: 0, Time elapsed: 751.54 sec
Forking command line: /bin/sh -c cd <https://builds.apache.org/job/HBase-0.92/ws/trunk> && /home/jenkins/tools/java/jdk1.6.0_27-32/jre/bin/java -enableassertions -Xmx1400m -Djava.security.egd=file:/dev/./urandom -jar <https://builds.apache.org/job/HBase-0.92/ws/trunk/target/surefire/surefirebooter8596836964873260078.jar> <https://builds.apache.org/job/HBase-0.92/ws/trunk/target/surefire/surefire614677119094059604tmp> <https://builds.apache.org/job/HBase-0.92/ws/trunk/target/surefire/surefire4584873813145920796tmp>
Running org.apache.hadoop.hbase.regionserver.wal.TestHLog
Tests run: 9, Failures: 0, Errors: 0, Skipped: 0, Time elapsed: 64.926 sec
Forking command line: /bin/sh -c cd <https://builds.apache.org/job/HBase-0.92/ws/trunk> && /home/jenkins/tools/java/jdk1.6.0_27-32/jre/bin/java -enableassertions -Xmx1400m -Djava.security.egd=file:/dev/./urandom -jar <https://builds.apache.org/job/HBase-0.92/ws/trunk/target/surefire/surefirebooter940624379629326172.jar> <https://builds.apache.org/job/HBase-0.92/ws/trunk/target/surefire/surefire6639711796588365183tmp> <https://builds.apache.org/job/HBase-0.92/ws/trunk/target/surefire/surefire8157124677885995793tmp>
Running org.apache.hadoop.hbase.regionserver.wal.TestHLogSplit
Tests run: 30, Failures: 0, Errors: 0, Skipped: 1, Time elapsed: 233.927 sec
Forking command line: /bin/sh -c cd <https://builds.apache.org/job/HBase-0.92/ws/trunk> && /home/jenkins/tools/java/jdk1.6.0_27-32/jre/bin/java -enableassertions -Xmx1400m -Djava.security.egd=file:/dev/./urandom -jar <https://builds.apache.org/job/HBase-0.92/ws/trunk/target/surefire/surefirebooter2102808414999222338.jar> <https://builds.apache.org/job/HBase-0.92/ws/trunk/target/surefire/surefire8217600515476120397tmp> <https://builds.apache.org/job/HBase-0.92/ws/trunk/target/surefire/surefire5636656716610546134tmp>
Running org.apache.hadoop.hbase.regionserver.wal.TestWALReplay
Tests run: 5, Failures: 0, Errors: 0, Skipped: 0, Time elapsed: 27.188 sec
Forking command line: /bin/sh -c cd <https://builds.apache.org/job/HBase-0.92/ws/trunk> && /home/jenkins/tools/java/jdk1.6.0_27-32/jre/bin/java -enableassertions -Xmx1400m -Djava.security.egd=file:/dev/./urandom -jar <https://builds.apache.org/job/HBase-0.92/ws/trunk/target/surefire/surefirebooter8195190874740472891.jar> <https://builds.apache.org/job/HBase-0.92/ws/trunk/target/surefire/surefire4261802808795003209tmp> <https://builds.apache.org/job/HBase-0.92/ws/trunk/target/surefire/surefire4011333465813709703tmp>
Running org.apache.hadoop.hbase.regionserver.wal.TestHLogMethods
Tests run: 3, Failures: 0, Errors: 0, Skipped: 0, Time elapsed: 0.909 sec
Forking command line: /bin/sh -c cd <https://builds.apache.org/job/HBase-0.92/ws/trunk> && /home/jenkins/tools/java/jdk1.6.0_27-32/jre/bin/java -enableassertions -Xmx1400m -Djava.security.egd=file:/dev/./urandom -jar <https://builds.apache.org/job/HBase-0.92/ws/trunk/target/surefire/surefirebooter8545090193135337835.jar> <https://builds.apache.org/job/HBase-0.92/ws/trunk/target/surefire/surefire2744566385535957672tmp> <https://builds.apache.org/job/HBase-0.92/ws/trunk/target/surefire/surefire7711500812463706092tmp>
Running org.apache.hadoop.hbase.regionserver.TestRSStatusServlet
Tests run: 2, Failures: 0, Errors: 0, Skipped: 0, Time elapsed: 0.728 sec
Forking command line: /bin/sh -c cd <https://builds.apache.org/job/HBase-0.92/ws/trunk> && /home/jenkins/tools/java/jdk1.6.0_27-32/jre/bin/java -enableassertions -Xmx1400m -Djava.security.egd=file:/dev/./urandom -jar <https://builds.apache.org/job/HBase-0.92/ws/trunk/target/surefire/surefirebooter1775522789550143828.jar> <https://builds.apache.org/job/HBase-0.92/ws/trunk/target/surefire/surefire1879345178443332110tmp> <https://builds.apache.org/job/HBase-0.92/ws/trunk/target/surefire/surefire6032555499645954049tmp>
Running org.apache.hadoop.hbase.regionserver.TestStoreScanner
Tests run: 14, Failures: 0, Errors: 0, Skipped: 0, Time elapsed: 0.143 sec
Forking command line: /bin/sh -c cd <https://builds.apache.org/job/HBase-0.92/ws/trunk> && /home/jenkins/tools/java/jdk1.6.0_27-32/jre/bin/java -enableassertions -Xmx1400m -Djava.security.egd=file:/dev/./urandom -jar <https://builds.apache.org/job/HBase-0.92/ws/trunk/target/surefire/surefirebooter2978758271017649591.jar> <https://builds.apache.org/job/HBase-0.92/ws/trunk/target/surefire/surefire8413367195199411872tmp> <https://builds.apache.org/job/HBase-0.92/ws/trunk/target/surefire/surefire795927350854455307tmp>
Running org.apache.hadoop.hbase.regionserver.TestResettingCounters
Tests run: 1, Failures: 0, Errors: 0, Skipped: 0, Time elapsed: 0.822 sec
Forking command line: /bin/sh -c cd <https://builds.apache.org/job/HBase-0.92/ws/trunk> && /home/jenkins/tools/java/jdk1.6.0_27-32/jre/bin/java -enableassertions -Xmx1400m -Djava.security.egd=file:/dev/./urandom -jar <https://builds.apache.org/job/HBase-0.92/ws/trunk/target/surefire/surefirebooter7301760714988164191.jar> <https://builds.apache.org/job/HBase-0.92/ws/trunk/target/surefire/surefire3041901349524658594tmp> <https://builds.apache.org/job/HBase-0.92/ws/trunk/target/surefire/surefire105505529083953653tmp>
Running org.apache.hadoop.hbase.regionserver.TestStoreFile
Tests run: 8, Failures: 0, Errors: 0, Skipped: 0, Time elapsed: 1.725 sec
Forking command line: /bin/sh -c cd <https://builds.apache.org/job/HBase-0.92/ws/trunk> && /home/jenkins/tools/java/jdk1.6.0_27-32/jre/bin/java -enableassertions -Xmx1400m -Djava.security.egd=file:/dev/./urandom -jar <https://builds.apache.org/job/HBase-0.92/ws/trunk/target/surefire/surefirebooter8484041389463245776.jar> <https://builds.apache.org/job/HBase-0.92/ws/trunk/target/surefire/surefire2695373247394394281tmp> <https://builds.apache.org/job/HBase-0.92/ws/trunk/target/surefire/surefire3979788460748297918tmp>
Running org.apache.hadoop.hbase.regionserver.TestEndToEndSplitTransaction
Tests run: 1, Failures: 0, Errors: 0, Skipped: 0, Time elapsed: 48.346 sec
Forking command line: /bin/sh -c cd <https://builds.apache.org/job/HBase-0.92/ws/trunk> && /home/jenkins/tools/java/jdk1.6.0_27-32/jre/bin/java -enableassertions -Xmx1400m -Djava.security.egd=file:/dev/./urandom -jar <https://builds.apache.org/job/HBase-0.92/ws/trunk/target/surefire/surefirebooter5065178991185795440.jar> <https://builds.apache.org/job/HBase-0.92/ws/trunk/target/surefire/surefire1519987511624390262tmp> <https://builds.apache.org/job/HBase-0.92/ws/trunk/target/surefire/surefire5925758627456822923tmp>
Running org.apache.hadoop.hbase.regionserver.TestScanWildcardColumnTracker
Tests run: 2, Failures: 0, Errors: 0, Skipped: 0, Time elapsed: 0.461 sec
Forking command line: /bin/sh -c cd <https://builds.apache.org/job/HBase-0.92/ws/trunk> && /home/jenkins/tools/java/jdk1.6.0_27-32/jre/bin/java -enableassertions -Xmx1400m -Djava.security.egd=file:/dev/./urandom -jar <https://builds.apache.org/job/HBase-0.92/ws/trunk/target/surefire/surefirebooter4732866032422204210.jar> <https://builds.apache.org/job/HBase-0.92/ws/trunk/target/surefire/surefire1950052677366928705tmp> <https://builds.apache.org/job/HBase-0.92/ws/trunk/target/surefire/surefire2953791451306689489tmp>
Running org.apache.hadoop.hbase.regionserver.TestCompaction
Tests run: 10, Failures: 0, Errors: 0, Skipped: 0, Time elapsed: 12.331 sec
Forking command line: /bin/sh -c cd <https://builds.apache.org/job/HBase-0.92/ws/trunk> && /home/jenkins/tools/java/jdk1.6.0_27-32/jre/bin/java -enableassertions -Xmx1400m -Djava.security.egd=file:/dev/./urandom -jar <https://builds.apache.org/job/HBase-0.92/ws/trunk/target/surefire/surefirebooter4263844640604253670.jar> <https://builds.apache.org/job/HBase-0.92/ws/trunk/target/surefire/surefire3060965619468201255tmp> <https://builds.apache.org/job/HBase-0.92/ws/trunk/target/surefire/surefire6600648196508552969tmp>
Running org.apache.hadoop.hbase.regionserver.TestMXBean
Tests run: 1, Failures: 0, Errors: 0, Skipped: 0, Time elapsed: 21.492 sec
Forking command line: /bin/sh -c cd <https://builds.apache.org/job/HBase-0.92/ws/trunk> && /home/jenkins/tools/java/jdk1.6.0_27-32/jre/bin/java -enableassertions -Xmx1400m -Djava.security.egd=file:/dev/./urandom -jar <https://builds.apache.org/job/HBase-0.92/ws/trunk/target/surefire/surefirebooter2382141999574711250.jar> <https://builds.apache.org/job/HBase-0.92/ws/trunk/target/surefire/surefire686850050500073047tmp> <https://builds.apache.org/job/HBase-0.92/ws/trunk/target/surefire/surefire5121507894007320219tmp>
Running org.apache.hadoop.hbase.regionserver.TestQueryMatcher
Tests run: 4, Failures: 0, Errors: 0, Skipped: 0, Time elapsed: 0.536 sec
Forking command line: /bin/sh -c cd <https://builds.apache.org/job/HBase-0.92/ws/trunk> && /home/jenkins/tools/java/jdk1.6.0_27-32/jre/bin/java -enableassertions -Xmx1400m -Djava.security.egd=file:/dev/./urandom -jar <https://builds.apache.org/job/HBase-0.92/ws/trunk/target/surefire/surefirebooter9202648489440074279.jar> <https://builds.apache.org/job/HBase-0.92/ws/trunk/target/surefire/surefire3300202848962412147tmp> <https://builds.apache.org/job/HBase-0.92/ws/trunk/target/surefire/surefire7708936296090744428tmp>
Running org.apache.hadoop.hbase.regionserver.TestRpcMetrics
Tests run: 1, Failures: 0, Errors: 0, Skipped: 0, Time elapsed: 2.134 sec
Forking command line: /bin/sh -c cd <https://builds.apache.org/job/HBase-0.92/ws/trunk> && /home/jenkins/tools/java/jdk1.6.0_27-32/jre/bin/java -enableassertions -Xmx1400m -Djava.security.egd=file:/dev/./urandom -jar <https://builds.apache.org/job/HBase-0.92/ws/trunk/target/surefire/surefirebooter6613830437674776943.jar> <https://builds.apache.org/job/HBase-0.92/ws/trunk/target/surefire/surefire7956565732929387658tmp> <https://builds.apache.org/job/HBase-0.92/ws/trunk/target/surefire/surefire4033588846441374439tmp>
Running org.apache.hadoop.hbase.regionserver.TestScanner
Tests run: 7, Failures: 0, Errors: 0, Skipped: 0, Time elapsed: 4.869 sec
Forking command line: /bin/sh -c cd <https://builds.apache.org/job/HBase-0.92/ws/trunk> && /home/jenkins/tools/java/jdk1.6.0_27-32/jre/bin/java -enableassertions -Xmx1400m -Djava.security.egd=file:/dev/./urandom -jar <https://builds.apache.org/job/HBase-0.92/ws/trunk/target/surefire/surefirebooter7927582620926654144.jar> <https://builds.apache.org/job/HBase-0.92/ws/trunk/target/surefire/surefire1031705143680259249tmp> <https://builds.apache.org/job/HBase-0.92/ws/trunk/target/surefire/surefire6411145671102810594tmp>
Running org.apache.hadoop.hbase.regionserver.TestMultiColumnScanner
Tests run: 6, Failures: 0, Errors: 0, Skipped: 0, Time elapsed: 18.521 sec
Forking command line: /bin/sh -c cd <https://builds.apache.org/job/HBase-0.92/ws/trunk> && /home/jenkins/tools/java/jdk1.6.0_27-32/jre/bin/java -enableassertions -Xmx1400m -Djava.security.egd=file:/dev/./urandom -jar <https://builds.apache.org/job/HBase-0.92/ws/trunk/target/surefire/surefirebooter30613593712326158.jar> <https://builds.apache.org/job/HBase-0.92/ws/trunk/target/surefire/surefire8896911320394934096tmp> <https://builds.apache.org/job/HBase-0.92/ws/trunk/target/surefire/surefire2942443895152742622tmp>
Running org.apache.hadoop.hbase.regionserver.TestRegionSplitPolicy
Tests run: 3, Failures: 0, Errors: 0, Skipped: 0, Time elapsed: 0.7 sec
Forking command line: /bin/sh -c cd <https://builds.apache.org/job/HBase-0.92/ws/trunk> && /home/jenkins/tools/java/jdk1.6.0_27-32/jre/bin/java -enableassertions -Xmx1400m -Djava.security.egd=file:/dev/./urandom -jar <https://builds.apache.org/job/HBase-0.92/ws/trunk/target/surefire/surefirebooter8484835610043055071.jar> <https://builds.apache.org/job/HBase-0.92/ws/trunk/target/surefire/surefire6680086481789762261tmp> <https://builds.apache.org/job/HBase-0.92/ws/trunk/target/surefire/surefire1803389873163331492tmp>
Running org.apache.hadoop.hbase.regionserver.TestKeyValueSkipListSet
Tests run: 4, Failures: 0, Errors: 0, Skipped: 0, Time elapsed: 0.122 sec
Forking command line: /bin/sh -c cd <https://builds.apache.org/job/HBase-0.92/ws/trunk> && /home/jenkins/tools/java/jdk1.6.0_27-32/jre/bin/java -enableassertions -Xmx1400m -Djava.security.egd=file:/dev/./urandom -jar <https://builds.apache.org/job/HBase-0.92/ws/trunk/target/surefire/surefirebooter7650151062909717671.jar> <https://builds.apache.org/job/HBase-0.92/ws/trunk/target/surefire/surefire5176107961848429743tmp> <https://builds.apache.org/job/HBase-0.92/ws/trunk/target/surefire/surefire1105732862095361169tmp>
Running org.apache.hadoop.hbase.mapred.TestTableMapReduce
Tests run: 1, Failures: 0, Errors: 0, Skipped: 0, Time elapsed: 71.293 sec
Forking command line: /bin/sh -c cd <https://builds.apache.org/job/HBase-0.92/ws/trunk> && /home/jenkins/tools/java/jdk1.6.0_27-32/jre/bin/java -enableassertions -Xmx1400m -Djava.security.egd=file:/dev/./urandom -jar <https://builds.apache.org/job/HBase-0.92/ws/trunk/target/surefire/surefirebooter3559762272287251792.jar> <https://builds.apache.org/job/HBase-0.92/ws/trunk/target/surefire/surefire9086702803514502245tmp> <https://builds.apache.org/job/HBase-0.92/ws/trunk/target/surefire/surefire1189937689040415959tmp>
Running org.apache.hadoop.hbase.mapred.TestTableInputFormat
Tests run: 6, Failures: 0, Errors: 0, Skipped: 0, Time elapsed: 32.522 sec
Forking command line: /bin/sh -c cd <https://builds.apache.org/job/HBase-0.92/ws/trunk> && /home/jenkins/tools/java/jdk1.6.0_27-32/jre/bin/java -enableassertions -Xmx1400m -Djava.security.egd=file:/dev/./urandom -jar <https://builds.apache.org/job/HBase-0.92/ws/trunk/target/surefire/surefirebooter5594255740888541490.jar> <https://builds.apache.org/job/HBase-0.92/ws/trunk/target/surefire/surefire153006740180620921tmp> <https://builds.apache.org/job/HBase-0.92/ws/trunk/target/surefire/surefire7393718183898259784tmp>
Running org.apache.hadoop.hbase.TestDrainingServer
Tests run: 2, Failures: 0, Errors: 0, Skipped: 0, Time elapsed: 25.64 sec
Forking command line: /bin/sh -c cd <https://builds.apache.org/job/HBase-0.92/ws/trunk> && /home/jenkins/tools/java/jdk1.6.0_27-32/jre/bin/java -enableassertions -Xmx1400m -Djava.security.egd=file:/dev/./urandom -jar <https://builds.apache.org/job/HBase-0.92/ws/trunk/target/surefire/surefirebooter8620451031359809620.jar> <https://builds.apache.org/job/HBase-0.92/ws/trunk/target/surefire/surefire864598523234508912tmp> <https://builds.apache.org/job/HBase-0.92/ws/trunk/target/surefire/surefire4286557705226276485tmp>
Running org.apache.hadoop.hbase.TestFSTableDescriptorForceCreation
Tests run: 3, Failures: 0, Errors: 0, Skipped: 0, Time elapsed: 0.652 sec
Forking command line: /bin/sh -c cd <https://builds.apache.org/job/HBase-0.92/ws/trunk> && /home/jenkins/tools/java/jdk1.6.0_27-32/jre/bin/java -enableassertions -Xmx1400m -Djava.security.egd=file:/dev/./urandom -jar <https://builds.apache.org/job/HBase-0.92/ws/trunk/target/surefire/surefirebooter8489688305336866758.jar> <https://builds.apache.org/job/HBase-0.92/ws/trunk/target/surefire/surefire3223469504162181928tmp> <https://builds.apache.org/job/HBase-0.92/ws/trunk/target/surefire/surefire3552315830309068699tmp>
Running org.apache.hadoop.hbase.executor.TestExecutorService
Tests run: 1, Failures: 0, Errors: 0, Skipped: 0, Time elapsed: 2.441 sec
Forking command line: /bin/sh -c cd <https://builds.apache.org/job/HBase-0.92/ws/trunk> && /home/jenkins/tools/java/jdk1.6.0_27-32/jre/bin/java -enableassertions -Xmx1400m -Djava.security.egd=file:/dev/./urandom -jar <https://builds.apache.org/job/HBase-0.92/ws/trunk/target/surefire/surefirebooter6879657689857944037.jar> <https://builds.apache.org/job/HBase-0.92/ws/trunk/target/surefire/surefire7508746855266221090tmp> <https://builds.apache.org/job/HBase-0.92/ws/trunk/target/surefire/surefire915687913890327934tmp>
Running org.apache.hadoop.hbase.mapreduce.TestTimeRangeMapRed
Tests run: 1, Failures: 0, Errors: 0, Skipped: 0, Time elapsed: 46.631 sec
Forking command line: /bin/sh -c cd <https://builds.apache.org/job/HBase-0.92/ws/trunk> && /home/jenkins/tools/java/jdk1.6.0_27-32/jre/bin/java -enableassertions -Xmx1400m -Djava.security.egd=file:/dev/./urandom -jar <https://builds.apache.org/job/HBase-0.92/ws/trunk/target/surefire/surefirebooter6255933523620713284.jar> <https://builds.apache.org/job/HBase-0.92/ws/trunk/target/surefire/surefire4286541457206893044tmp> <https://builds.apache.org/job/HBase-0.92/ws/trunk/target/surefire/surefire3238123791963297010tmp>
Running org.apache.hadoop.hbase.mapreduce.TestHFileOutputFormat
Tests run: 8, Failures: 0, Errors: 0, Skipped: 0, Time elapsed: 159.773 sec
Forking command line: /bin/sh -c cd <https://builds.apache.org/job/HBase-0.92/ws/trunk> && /home/jenkins/tools/java/jdk1.6.0_27-32/jre/bin/java -enableassertions -Xmx1400m -Djava.security.egd=file:/dev/./urandom -jar <https://builds.apache.org/job/HBase-0.92/ws/trunk/target/surefire/surefirebooter7303836068797924650.jar> <https://builds.apache.org/job/HBase-0.92/ws/trunk/target/surefire/surefire3635031694224427687tmp> <https://builds.apache.org/job/HBase-0.92/ws/trunk/target/surefire/surefire5413960621065507948tmp>
Running org.apache.hadoop.hbase.mapreduce.TestImportTsv
Tests run: 8, Failures: 0, Errors: 0, Skipped: 0, Time elapsed: 91.023 sec
Forking command line: /bin/sh -c cd <https://builds.apache.org/job/HBase-0.92/ws/trunk> && /home/jenkins/tools/java/jdk1.6.0_27-32/jre/bin/java -enableassertions -Xmx1400m -Djava.security.egd=file:/dev/./urandom -jar <https://builds.apache.org/job/HBase-0.92/ws/trunk/target/surefire/surefirebooter1191283922426677943.jar> <https://builds.apache.org/job/HBase-0.92/ws/trunk/target/surefire/surefire5400740497751789928tmp> <https://builds.apache.org/job/HBase-0.92/ws/trunk/target/surefire/surefire6722424334969023278tmp>
Running org.apache.hadoop.hbase.mapreduce.TestTableInputFormatScan
Tests run: 11, Failures: 0, Errors: 0, Skipped: 0, Time elapsed: 468.594 sec
Forking command line: /bin/sh -c cd <https://builds.apache.org/job/HBase-0.92/ws/trunk> && /home/jenkins/tools/java/jdk1.6.0_27-32/jre/bin/java -enableassertions -Xmx1400m -Djava.security.egd=file:/dev/./urandom -jar <https://builds.apache.org/job/HBase-0.92/ws/trunk/target/surefire/surefirebooter8447119374225965767.jar> <https://builds.apache.org/job/HBase-0.92/ws/trunk/target/surefire/surefire1779124304735536973tmp> <https://builds.apache.org/job/HBase-0.92/ws/trunk/target/surefire/surefire1212925769091062465tmp>
Running org.apache.hadoop.hbase.mapreduce.TestLoadIncrementalHFilesSplitRecovery
Tests run: 4, Failures: 0, Errors: 0, Skipped: 0, Time elapsed: 53.89 sec
Forking command line: /bin/sh -c cd <https://builds.apache.org/job/HBase-0.92/ws/trunk> && /home/jenkins/tools/java/jdk1.6.0_27-32/jre/bin/java -enableassertions -Xmx1400m -Djava.security.egd=file:/dev/./urandom -jar <https://builds.apache.org/job/HBase-0.92/ws/trunk/target/surefire/surefirebooter3080136044063406860.jar> <https://builds.apache.org/job/HBase-0.92/ws/trunk/target/surefire/surefire3808179948171935225tmp> <https://builds.apache.org/job/HBase-0.92/ws/trunk/target/surefire/surefire8914380773010616810tmp>
Running org.apache.hadoop.hbase.mapreduce.TestTableSplit
Tests run: 1, Failures: 0, Errors: 0, Skipped: 0, Time elapsed: 0.136 sec
Forking command line: /bin/sh -c cd <https://builds.apache.org/job/HBase-0.92/ws/trunk> && /home/jenkins/tools/java/jdk1.6.0_27-32/jre/bin/java -enableassertions -Xmx1400m -Djava.security.egd=file:/dev/./urandom -jar <https://builds.apache.org/job/HBase-0.92/ws/trunk/target/surefire/surefirebooter2534326590112838866.jar> <https://builds.apache.org/job/HBase-0.92/ws/trunk/target/surefire/surefire441962784276854382tmp> <https://builds.apache.org/job/HBase-0.92/ws/trunk/target/surefire/surefire7760665843715387542tmp>
Running org.apache.hadoop.hbase.mapreduce.TestSimpleTotalOrderPartitioner
Tests run: 1, Failures: 0, Errors: 0, Skipped: 0, Time elapsed: 0.418 sec
Forking command line: /bin/sh -c cd <https://builds.apache.org/job/HBase-0.92/ws/trunk> && /home/jenkins/tools/java/jdk1.6.0_27-32/jre/bin/java -enableassertions -Xmx1400m -Djava.security.egd=file:/dev/./urandom -jar <https://builds.apache.org/job/HBase-0.92/ws/trunk/target/surefire/surefirebooter2222090806912206853.jar> <https://builds.apache.org/job/HBase-0.92/ws/trunk/target/surefire/surefire1692541339822818453tmp> <https://builds.apache.org/job/HBase-0.92/ws/trunk/target/surefire/surefire2485607400602864737tmp>
Running org.apache.hadoop.hbase.mapreduce.TestTableMapReduce
Tests run: 1, Failures: 0, Errors: 0, Skipped: 0, Time elapsed: 99.786 sec
Forking command line: /bin/sh -c cd <https://builds.apache.org/job/HBase-0.92/ws/trunk> && /home/jenkins/tools/java/jdk1.6.0_27-32/jre/bin/java -enableassertions -Xmx1400m -Djava.security.egd=file:/dev/./urandom -jar <https://builds.apache.org/job/HBase-0.92/ws/trunk/target/surefire/surefirebooter805206302817257612.jar> <https://builds.apache.org/job/HBase-0.92/ws/trunk/target/surefire/surefire4864783395398743493tmp> <https://builds.apache.org/job/HBase-0.92/ws/trunk/target/surefire/surefire375913134917131860tmp>
Running org.apache.hadoop.hbase.mapreduce.TestLoadIncrementalHFiles
Tests run: 6, Failures: 0, Errors: 0, Skipped: 0, Time elapsed: 46.245 sec
Forking command line: /bin/sh -c cd <https://builds.apache.org/job/HBase-0.92/ws/trunk> && /home/jenkins/tools/java/jdk1.6.0_27-32/jre/bin/java -enableassertions -Xmx1400m -Djava.security.egd=file:/dev/./urandom -jar <https://builds.apache.org/job/HBase-0.92/ws/trunk/target/surefire/surefirebooter434869338196819983.jar> <https://builds.apache.org/job/HBase-0.92/ws/trunk/target/surefire/surefire154348068492055156tmp> <https://builds.apache.org/job/HBase-0.92/ws/trunk/target/surefire/surefire2972715967400351317tmp>
Running org.apache.hadoop.hbase.TestHRegionLocation
Tests run: 3, Failures: 0, Errors: 0, Skipped: 0, Time elapsed: 0.142 sec
Results :
Tests run: 1100, Failures: 0, Errors: 0, Skipped: 8
[INFO] ------------------------------------------------------------------------
[INFO] BUILD FAILURE
[INFO] ------------------------------------------------------------------------
[INFO] Total time: 2:13:39.779s
[INFO] Finished at: Wed Apr 04 18:29:54 UTC 2012
[INFO] Final Memory: 53M/614M
[INFO] ------------------------------------------------------------------------
[ERROR] Failed to execute goal org.apache.maven.plugins:maven-surefire-plugin:2.10:test (default-test) on project hbase: Failure or timeout -> [Help 1]
org.apache.maven.lifecycle.LifecycleExecutionException: Failed to execute goal org.apache.maven.plugins:maven-surefire-plugin:2.10:test (default-test) on project hbase: Failure or timeout
at org.apache.maven.lifecycle.internal.MojoExecutor.execute(MojoExecutor.java:217)
at org.apache.maven.lifecycle.internal.MojoExecutor.execute(MojoExecutor.java:153)
at org.apache.maven.lifecycle.internal.MojoExecutor.execute(MojoExecutor.java:145)
at org.apache.maven.lifecycle.internal.LifecycleModuleBuilder.buildProject(LifecycleModuleBuilder.java:84)
at org.apache.maven.lifecycle.internal.LifecycleModuleBuilder.buildProject(LifecycleModuleBuilder.java:59)
at org.apache.maven.lifecycle.internal.LifecycleStarter.singleThreadedBuild(LifecycleStarter.java:183)
at org.apache.maven.lifecycle.internal.LifecycleStarter.execute(LifecycleStarter.java:161)
at org.apache.maven.DefaultMaven.doExecute(DefaultMaven.java:319)
at org.apache.maven.DefaultMaven.execute(DefaultMaven.java:156)
at org.apache.maven.cli.MavenCli.execute(MavenCli.java:537)
at org.apache.maven.cli.MavenCli.doMain(MavenCli.java:196)
at org.apache.maven.cli.MavenCli.main(MavenCli.java:141)
at sun.reflect.NativeMethodAccessorImpl.invoke0(Native Method)
at sun.reflect.NativeMethodAccessorImpl.invoke(NativeMethodAccessorImpl.java:39)
at sun.reflect.DelegatingMethodAccessorImpl.invoke(DelegatingMethodAccessorImpl.java:25)
at java.lang.reflect.Method.invoke(Method.java:597)
at org.codehaus.plexus.classworlds.launcher.Launcher.launchEnhanced(Launcher.java:290)
at org.codehaus.plexus.classworlds.launcher.Launcher.launch(Launcher.java:230)
at org.codehaus.plexus.classworlds.launcher.Launcher.mainWithExitCode(Launcher.java:409)
at org.codehaus.plexus.classworlds.launcher.Launcher.main(Launcher.java:352)
Caused by: org.apache.maven.plugin.MojoExecutionException: Failure or timeout
at org.apache.maven.plugin.surefire.SurefirePlugin.assertNoFailureOrTimeout(SurefirePlugin.java:633)
at org.apache.maven.plugin.surefire.SurefirePlugin.handleSummary(SurefirePlugin.java:614)
at org.apache.maven.plugin.surefire.AbstractSurefireMojo.executeAfterPreconditionsChecked(AbstractSurefireMojo.java:137)
at org.apache.maven.plugin.surefire.AbstractSurefireMojo.execute(AbstractSurefireMojo.java:98)
at org.apache.maven.plugin.DefaultBuildPluginManager.executeMojo(DefaultBuildPluginManager.java:101)
at org.apache.maven.lifecycle.internal.MojoExecutor.execute(MojoExecutor.java:209)
... 19 more
[ERROR]
[ERROR]
[ERROR] For more information about the errors and possible solutions, please read the following articles:
[ERROR] [Help 1] http://cwiki.apache.org/confluence/display/MAVEN/MojoExecutionException
Build step 'Invoke top-level Maven targets' marked build as failure
Archiving artifacts
Updating HBASE-5533
Recording test results
Jenkins build is back to normal : HBase-0.92 #359
Posted by Apache Jenkins Server <je...@builds.apache.org>.
See <https://builds.apache.org/job/HBase-0.92/359/changes>
Build failed in Jenkins: HBase-0.92 #358
Posted by Apache Jenkins Server <je...@builds.apache.org>.
See <https://builds.apache.org/job/HBase-0.92/358/changes>
Changes:
[stack] HBASE-5724 Row cache of KeyValue should be cleared in readFields() -- add missing import
------------------------------------------
[...truncated 7025 lines...]
Tests run: 7, Failures: 0, Errors: 0, Skipped: 0, Time elapsed: 17.695 sec
Forking command line: /bin/sh -c cd /x1/jenkins/jenkins-slave/workspace/HBase-0.92/trunk && /x1/jenkins/tools/java/jdk1.6.0_27-32/jre/bin/java -enableassertions -Xmx1400m -Djava.security.egd=file:/dev/./urandom -jar /x1/jenkins/jenkins-slave/workspace/HBase-0.92/trunk/target/surefire/surefirebooter6079203185497770038.jar /x1/jenkins/jenkins-slave/workspace/HBase-0.92/trunk/target/surefire/surefire8496473701993870266tmp /x1/jenkins/jenkins-slave/workspace/HBase-0.92/trunk/target/surefire/surefire4693773619452391611tmp
Running org.apache.hadoop.hbase.rest.TestStatusResource
Tests run: 2, Failures: 0, Errors: 0, Skipped: 0, Time elapsed: 16.921 sec
Forking command line: /bin/sh -c cd /x1/jenkins/jenkins-slave/workspace/HBase-0.92/trunk && /x1/jenkins/tools/java/jdk1.6.0_27-32/jre/bin/java -enableassertions -Xmx1400m -Djava.security.egd=file:/dev/./urandom -jar /x1/jenkins/jenkins-slave/workspace/HBase-0.92/trunk/target/surefire/surefirebooter4643171388810406131.jar /x1/jenkins/jenkins-slave/workspace/HBase-0.92/trunk/target/surefire/surefire1816738138646202623tmp /x1/jenkins/jenkins-slave/workspace/HBase-0.92/trunk/target/surefire/surefire7738797143958260892tmp
Running org.apache.hadoop.hbase.rest.TestScannersWithFilters
Tests run: 10, Failures: 0, Errors: 0, Skipped: 0, Time elapsed: 23.565 sec
Forking command line: /bin/sh -c cd /x1/jenkins/jenkins-slave/workspace/HBase-0.92/trunk && /x1/jenkins/tools/java/jdk1.6.0_27-32/jre/bin/java -enableassertions -Xmx1400m -Djava.security.egd=file:/dev/./urandom -jar /x1/jenkins/jenkins-slave/workspace/HBase-0.92/trunk/target/surefire/surefirebooter240125845137003589.jar /x1/jenkins/jenkins-slave/workspace/HBase-0.92/trunk/target/surefire/surefire2964613343569893771tmp /x1/jenkins/jenkins-slave/workspace/HBase-0.92/trunk/target/surefire/surefire2093097719019512170tmp
Running org.apache.hadoop.hbase.metrics.TestMetricsMBeanBase
Tests run: 2, Failures: 0, Errors: 0, Skipped: 0, Time elapsed: 1.107 sec
Forking command line: /bin/sh -c cd /x1/jenkins/jenkins-slave/workspace/HBase-0.92/trunk && /x1/jenkins/tools/java/jdk1.6.0_27-32/jre/bin/java -enableassertions -Xmx1400m -Djava.security.egd=file:/dev/./urandom -jar /x1/jenkins/jenkins-slave/workspace/HBase-0.92/trunk/target/surefire/surefirebooter8682916419783839443.jar /x1/jenkins/jenkins-slave/workspace/HBase-0.92/trunk/target/surefire/surefire387436070504031641tmp /x1/jenkins/jenkins-slave/workspace/HBase-0.92/trunk/target/surefire/surefire7346766108734208217tmp
Running org.apache.hadoop.hbase.metrics.TestExponentiallyDecayingSample
Tests run: 2, Failures: 0, Errors: 0, Skipped: 0, Time elapsed: 0.124 sec
Forking command line: /bin/sh -c cd /x1/jenkins/jenkins-slave/workspace/HBase-0.92/trunk && /x1/jenkins/tools/java/jdk1.6.0_27-32/jre/bin/java -enableassertions -Xmx1400m -Djava.security.egd=file:/dev/./urandom -jar /x1/jenkins/jenkins-slave/workspace/HBase-0.92/trunk/target/surefire/surefirebooter4333700731387121127.jar /x1/jenkins/jenkins-slave/workspace/HBase-0.92/trunk/target/surefire/surefire3376860097021486572tmp /x1/jenkins/jenkins-slave/workspace/HBase-0.92/trunk/target/surefire/surefire6872766011618884567tmp
Running org.apache.hadoop.hbase.metrics.TestExactCounterMetric
Tests run: 1, Failures: 0, Errors: 0, Skipped: 0, Time elapsed: 0.091 sec
Forking command line: /bin/sh -c cd /x1/jenkins/jenkins-slave/workspace/HBase-0.92/trunk && /x1/jenkins/tools/java/jdk1.6.0_27-32/jre/bin/java -enableassertions -Xmx1400m -Djava.security.egd=file:/dev/./urandom -jar /x1/jenkins/jenkins-slave/workspace/HBase-0.92/trunk/target/surefire/surefirebooter7162930899901056870.jar /x1/jenkins/jenkins-slave/workspace/HBase-0.92/trunk/target/surefire/surefire2424090313551047872tmp /x1/jenkins/jenkins-slave/workspace/HBase-0.92/trunk/target/surefire/surefire6087946856040830998tmp
Running org.apache.hadoop.hbase.metrics.TestMetricsHistogram
Tests run: 2, Failures: 0, Errors: 0, Skipped: 0, Time elapsed: 0.123 sec
Forking command line: /bin/sh -c cd /x1/jenkins/jenkins-slave/workspace/HBase-0.92/trunk && /x1/jenkins/tools/java/jdk1.6.0_27-32/jre/bin/java -enableassertions -Xmx1400m -Djava.security.egd=file:/dev/./urandom -jar /x1/jenkins/jenkins-slave/workspace/HBase-0.92/trunk/target/surefire/surefirebooter7310610085319458588.jar /x1/jenkins/jenkins-slave/workspace/HBase-0.92/trunk/target/surefire/surefire7950121419877636428tmp /x1/jenkins/jenkins-slave/workspace/HBase-0.92/trunk/target/surefire/surefire2939944901905880141tmp
Running org.apache.hadoop.hbase.io.hfile.TestHFileWriterV2
Tests run: 1, Failures: 0, Errors: 0, Skipped: 0, Time elapsed: 0.803 sec
Forking command line: /bin/sh -c cd /x1/jenkins/jenkins-slave/workspace/HBase-0.92/trunk && /x1/jenkins/tools/java/jdk1.6.0_27-32/jre/bin/java -enableassertions -Xmx1400m -Djava.security.egd=file:/dev/./urandom -jar /x1/jenkins/jenkins-slave/workspace/HBase-0.92/trunk/target/surefire/surefirebooter302423495463378537.jar /x1/jenkins/jenkins-slave/workspace/HBase-0.92/trunk/target/surefire/surefire1654856240422010406tmp /x1/jenkins/jenkins-slave/workspace/HBase-0.92/trunk/target/surefire/surefire3046992801357023641tmp
Running org.apache.hadoop.hbase.io.hfile.TestHFile
Tests run: 6, Failures: 0, Errors: 0, Skipped: 0, Time elapsed: 0.611 sec
Forking command line: /bin/sh -c cd /x1/jenkins/jenkins-slave/workspace/HBase-0.92/trunk && /x1/jenkins/tools/java/jdk1.6.0_27-32/jre/bin/java -enableassertions -Xmx1400m -Djava.security.egd=file:/dev/./urandom -jar /x1/jenkins/jenkins-slave/workspace/HBase-0.92/trunk/target/surefire/surefirebooter1853480881559824968.jar /x1/jenkins/jenkins-slave/workspace/HBase-0.92/trunk/target/surefire/surefire5185779220147317475tmp /x1/jenkins/jenkins-slave/workspace/HBase-0.92/trunk/target/surefire/surefire7323605794864168443tmp
Running org.apache.hadoop.hbase.io.hfile.TestHFileBlockIndex
Tests run: 10, Failures: 0, Errors: 0, Skipped: 0, Time elapsed: 6.709 sec
Forking command line: /bin/sh -c cd /x1/jenkins/jenkins-slave/workspace/HBase-0.92/trunk && /x1/jenkins/tools/java/jdk1.6.0_27-32/jre/bin/java -enableassertions -Xmx1400m -Djava.security.egd=file:/dev/./urandom -jar /x1/jenkins/jenkins-slave/workspace/HBase-0.92/trunk/target/surefire/surefirebooter4612272201671258176.jar /x1/jenkins/jenkins-slave/workspace/HBase-0.92/trunk/target/surefire/surefire6144146910852107545tmp /x1/jenkins/jenkins-slave/workspace/HBase-0.92/trunk/target/surefire/surefire2268792441661659816tmp
Running org.apache.hadoop.hbase.io.hfile.TestHFileSeek
Tests run: 1, Failures: 0, Errors: 0, Skipped: 0, Time elapsed: 4.018 sec
Forking command line: /bin/sh -c cd /x1/jenkins/jenkins-slave/workspace/HBase-0.92/trunk && /x1/jenkins/tools/java/jdk1.6.0_27-32/jre/bin/java -enableassertions -Xmx1400m -Djava.security.egd=file:/dev/./urandom -jar /x1/jenkins/jenkins-slave/workspace/HBase-0.92/trunk/target/surefire/surefirebooter485581770298878058.jar /x1/jenkins/jenkins-slave/workspace/HBase-0.92/trunk/target/surefire/surefire8130032717456953411tmp /x1/jenkins/jenkins-slave/workspace/HBase-0.92/trunk/target/surefire/surefire2090543845738604808tmp
Running org.apache.hadoop.hbase.io.hfile.TestLruBlockCache
Tests run: 7, Failures: 0, Errors: 0, Skipped: 0, Time elapsed: 0.319 sec
Forking command line: /bin/sh -c cd /x1/jenkins/jenkins-slave/workspace/HBase-0.92/trunk && /x1/jenkins/tools/java/jdk1.6.0_27-32/jre/bin/java -enableassertions -Xmx1400m -Djava.security.egd=file:/dev/./urandom -jar /x1/jenkins/jenkins-slave/workspace/HBase-0.92/trunk/target/surefire/surefirebooter6005827583339661696.jar /x1/jenkins/jenkins-slave/workspace/HBase-0.92/trunk/target/surefire/surefire3409655086004683182tmp /x1/jenkins/jenkins-slave/workspace/HBase-0.92/trunk/target/surefire/surefire8081468162398532172tmp
Running org.apache.hadoop.hbase.io.hfile.TestFixedFileTrailer
Tests run: 2, Failures: 0, Errors: 0, Skipped: 0, Time elapsed: 0.514 sec
Forking command line: /bin/sh -c cd /x1/jenkins/jenkins-slave/workspace/HBase-0.92/trunk && /x1/jenkins/tools/java/jdk1.6.0_27-32/jre/bin/java -enableassertions -Xmx1400m -Djava.security.egd=file:/dev/./urandom -jar /x1/jenkins/jenkins-slave/workspace/HBase-0.92/trunk/target/surefire/surefirebooter8469286969203548099.jar /x1/jenkins/jenkins-slave/workspace/HBase-0.92/trunk/target/surefire/surefire5092646072741312179tmp /x1/jenkins/jenkins-slave/workspace/HBase-0.92/trunk/target/surefire/surefire2479468629412249053tmp
Running org.apache.hadoop.hbase.io.hfile.TestCachedBlockQueue
Tests run: 2, Failures: 0, Errors: 0, Skipped: 0, Time elapsed: 0.097 sec
Forking command line: /bin/sh -c cd /x1/jenkins/jenkins-slave/workspace/HBase-0.92/trunk && /x1/jenkins/tools/java/jdk1.6.0_27-32/jre/bin/java -enableassertions -Xmx1400m -Djava.security.egd=file:/dev/./urandom -jar /x1/jenkins/jenkins-slave/workspace/HBase-0.92/trunk/target/surefire/surefirebooter6237616195795397671.jar /x1/jenkins/jenkins-slave/workspace/HBase-0.92/trunk/target/surefire/surefire4595558735842107156tmp /x1/jenkins/jenkins-slave/workspace/HBase-0.92/trunk/target/surefire/surefire9165816867526605108tmp
Running org.apache.hadoop.hbase.io.hfile.TestHFilePerformance
Tests run: 1, Failures: 0, Errors: 0, Skipped: 0, Time elapsed: 4.134 sec
Forking command line: /bin/sh -c cd /x1/jenkins/jenkins-slave/workspace/HBase-0.92/trunk && /x1/jenkins/tools/java/jdk1.6.0_27-32/jre/bin/java -enableassertions -Xmx1400m -Djava.security.egd=file:/dev/./urandom -jar /x1/jenkins/jenkins-slave/workspace/HBase-0.92/trunk/target/surefire/surefirebooter3554115925679187239.jar /x1/jenkins/jenkins-slave/workspace/HBase-0.92/trunk/target/surefire/surefire5438661640050452788tmp /x1/jenkins/jenkins-slave/workspace/HBase-0.92/trunk/target/surefire/surefire4894309832761978997tmp
Running org.apache.hadoop.hbase.io.hfile.TestCacheOnWrite
Tests run: 6, Failures: 0, Errors: 0, Skipped: 0, Time elapsed: 5.255 sec
Forking command line: /bin/sh -c cd /x1/jenkins/jenkins-slave/workspace/HBase-0.92/trunk && /x1/jenkins/tools/java/jdk1.6.0_27-32/jre/bin/java -enableassertions -Xmx1400m -Djava.security.egd=file:/dev/./urandom -jar /x1/jenkins/jenkins-slave/workspace/HBase-0.92/trunk/target/surefire/surefirebooter1346123924706548076.jar /x1/jenkins/jenkins-slave/workspace/HBase-0.92/trunk/target/surefire/surefire8091911209234241797tmp /x1/jenkins/jenkins-slave/workspace/HBase-0.92/trunk/target/surefire/surefire4348210146057948123tmp
Running org.apache.hadoop.hbase.io.hfile.TestReseekTo
Tests run: 1, Failures: 0, Errors: 0, Skipped: 0, Time elapsed: 0.609 sec
Forking command line: /bin/sh -c cd /x1/jenkins/jenkins-slave/workspace/HBase-0.92/trunk && /x1/jenkins/tools/java/jdk1.6.0_27-32/jre/bin/java -enableassertions -Xmx1400m -Djava.security.egd=file:/dev/./urandom -jar /x1/jenkins/jenkins-slave/workspace/HBase-0.92/trunk/target/surefire/surefirebooter4369222346115332050.jar /x1/jenkins/jenkins-slave/workspace/HBase-0.92/trunk/target/surefire/surefire2209531388676114021tmp /x1/jenkins/jenkins-slave/workspace/HBase-0.92/trunk/target/surefire/surefire4406297643724040745tmp
Running org.apache.hadoop.hbase.io.hfile.TestSeekTo
Tests run: 3, Failures: 0, Errors: 0, Skipped: 0, Time elapsed: 0.5 sec
Forking command line: /bin/sh -c cd /x1/jenkins/jenkins-slave/workspace/HBase-0.92/trunk && /x1/jenkins/tools/java/jdk1.6.0_27-32/jre/bin/java -enableassertions -Xmx1400m -Djava.security.egd=file:/dev/./urandom -jar /x1/jenkins/jenkins-slave/workspace/HBase-0.92/trunk/target/surefire/surefirebooter7504153942909605060.jar /x1/jenkins/jenkins-slave/workspace/HBase-0.92/trunk/target/surefire/surefire7127176445690904013tmp /x1/jenkins/jenkins-slave/workspace/HBase-0.92/trunk/target/surefire/surefire5419815638064659221tmp
Running org.apache.hadoop.hbase.io.hfile.TestBlockCacheColumnFamilySummary
Tests run: 4, Failures: 0, Errors: 0, Skipped: 0, Time elapsed: 0.049 sec
Forking command line: /bin/sh -c cd /x1/jenkins/jenkins-slave/workspace/HBase-0.92/trunk && /x1/jenkins/tools/java/jdk1.6.0_27-32/jre/bin/java -enableassertions -Xmx1400m -Djava.security.egd=file:/dev/./urandom -jar /x1/jenkins/jenkins-slave/workspace/HBase-0.92/trunk/target/surefire/surefirebooter1646110021778722701.jar /x1/jenkins/jenkins-slave/workspace/HBase-0.92/trunk/target/surefire/surefire5298699312182000469tmp /x1/jenkins/jenkins-slave/workspace/HBase-0.92/trunk/target/surefire/surefire1304393516092030496tmp
Running org.apache.hadoop.hbase.io.hfile.TestHFileBlock
Tests run: 7, Failures: 0, Errors: 0, Skipped: 0, Time elapsed: 23.83 sec
Forking command line: /bin/sh -c cd /x1/jenkins/jenkins-slave/workspace/HBase-0.92/trunk && /x1/jenkins/tools/java/jdk1.6.0_27-32/jre/bin/java -enableassertions -Xmx1400m -Djava.security.egd=file:/dev/./urandom -jar /x1/jenkins/jenkins-slave/workspace/HBase-0.92/trunk/target/surefire/surefirebooter4291548506621074258.jar /x1/jenkins/jenkins-slave/workspace/HBase-0.92/trunk/target/surefire/surefire7157757759650041897tmp /x1/jenkins/jenkins-slave/workspace/HBase-0.92/trunk/target/surefire/surefire1842504734988561262tmp
Running org.apache.hadoop.hbase.io.hfile.slab.TestSlabCache
Tests run: 7, Failures: 0, Errors: 0, Skipped: 0, Time elapsed: 12.111 sec
Forking command line: /bin/sh -c cd /x1/jenkins/jenkins-slave/workspace/HBase-0.92/trunk && /x1/jenkins/tools/java/jdk1.6.0_27-32/jre/bin/java -enableassertions -Xmx1400m -Djava.security.egd=file:/dev/./urandom -jar /x1/jenkins/jenkins-slave/workspace/HBase-0.92/trunk/target/surefire/surefirebooter989327787397993924.jar /x1/jenkins/jenkins-slave/workspace/HBase-0.92/trunk/target/surefire/surefire8803300649786790938tmp /x1/jenkins/jenkins-slave/workspace/HBase-0.92/trunk/target/surefire/surefire7766874685640823248tmp
Running org.apache.hadoop.hbase.io.hfile.slab.TestSingleSizeCache
Tests run: 5, Failures: 0, Errors: 0, Skipped: 0, Time elapsed: 17.644 sec
Forking command line: /bin/sh -c cd /x1/jenkins/jenkins-slave/workspace/HBase-0.92/trunk && /x1/jenkins/tools/java/jdk1.6.0_27-32/jre/bin/java -enableassertions -Xmx1400m -Djava.security.egd=file:/dev/./urandom -jar /x1/jenkins/jenkins-slave/workspace/HBase-0.92/trunk/target/surefire/surefirebooter4721796825703191069.jar /x1/jenkins/jenkins-slave/workspace/HBase-0.92/trunk/target/surefire/surefire8418671445367025514tmp /x1/jenkins/jenkins-slave/workspace/HBase-0.92/trunk/target/surefire/surefire4713435324788236755tmp
Running org.apache.hadoop.hbase.io.hfile.slab.TestSlab
Tests run: 1, Failures: 0, Errors: 0, Skipped: 0, Time elapsed: 0.11 sec
Forking command line: /bin/sh -c cd /x1/jenkins/jenkins-slave/workspace/HBase-0.92/trunk && /x1/jenkins/tools/java/jdk1.6.0_27-32/jre/bin/java -enableassertions -Xmx1400m -Djava.security.egd=file:/dev/./urandom -jar /x1/jenkins/jenkins-slave/workspace/HBase-0.92/trunk/target/surefire/surefirebooter6090369396466124201.jar /x1/jenkins/jenkins-slave/workspace/HBase-0.92/trunk/target/surefire/surefire2151936835382478tmp /x1/jenkins/jenkins-slave/workspace/HBase-0.92/trunk/target/surefire/surefire4770968204972502113tmp
Running org.apache.hadoop.hbase.io.hfile.TestHFileReaderV1
Tests run: 1, Failures: 0, Errors: 0, Skipped: 0, Time elapsed: 0.446 sec
Forking command line: /bin/sh -c cd /x1/jenkins/jenkins-slave/workspace/HBase-0.92/trunk && /x1/jenkins/tools/java/jdk1.6.0_27-32/jre/bin/java -enableassertions -Xmx1400m -Djava.security.egd=file:/dev/./urandom -jar /x1/jenkins/jenkins-slave/workspace/HBase-0.92/trunk/target/surefire/surefirebooter1521092303163318777.jar /x1/jenkins/jenkins-slave/workspace/HBase-0.92/trunk/target/surefire/surefire9139092210269077587tmp /x1/jenkins/jenkins-slave/workspace/HBase-0.92/trunk/target/surefire/surefire2023581791532992647tmp
Running org.apache.hadoop.hbase.io.TestHalfStoreFileReader
Tests run: 1, Failures: 0, Errors: 0, Skipped: 0, Time elapsed: 0.607 sec
Forking command line: /bin/sh -c cd /x1/jenkins/jenkins-slave/workspace/HBase-0.92/trunk && /x1/jenkins/tools/java/jdk1.6.0_27-32/jre/bin/java -enableassertions -Xmx1400m -Djava.security.egd=file:/dev/./urandom -jar /x1/jenkins/jenkins-slave/workspace/HBase-0.92/trunk/target/surefire/surefirebooter6524082243510787169.jar /x1/jenkins/jenkins-slave/workspace/HBase-0.92/trunk/target/surefire/surefire6182248440214310701tmp /x1/jenkins/jenkins-slave/workspace/HBase-0.92/trunk/target/surefire/surefire8588453136036609734tmp
Running org.apache.hadoop.hbase.io.TestHbaseObjectWritable
Tests run: 5, Failures: 0, Errors: 0, Skipped: 0, Time elapsed: 0.448 sec
Forking command line: /bin/sh -c cd /x1/jenkins/jenkins-slave/workspace/HBase-0.92/trunk && /x1/jenkins/tools/java/jdk1.6.0_27-32/jre/bin/java -enableassertions -Xmx1400m -Djava.security.egd=file:/dev/./urandom -jar /x1/jenkins/jenkins-slave/workspace/HBase-0.92/trunk/target/surefire/surefirebooter5115716314545538233.jar /x1/jenkins/jenkins-slave/workspace/HBase-0.92/trunk/target/surefire/surefire3838744279079554532tmp /x1/jenkins/jenkins-slave/workspace/HBase-0.92/trunk/target/surefire/surefire2691866017740272442tmp
Running org.apache.hadoop.hbase.io.TestImmutableBytesWritable
Tests run: 3, Failures: 0, Errors: 0, Skipped: 0, Time elapsed: 0.084 sec
Forking command line: /bin/sh -c cd /x1/jenkins/jenkins-slave/workspace/HBase-0.92/trunk && /x1/jenkins/tools/java/jdk1.6.0_27-32/jre/bin/java -enableassertions -Xmx1400m -Djava.security.egd=file:/dev/./urandom -jar /x1/jenkins/jenkins-slave/workspace/HBase-0.92/trunk/target/surefire/surefirebooter8194719216809660160.jar /x1/jenkins/jenkins-slave/workspace/HBase-0.92/trunk/target/surefire/surefire8626491736328976298tmp /x1/jenkins/jenkins-slave/workspace/HBase-0.92/trunk/target/surefire/surefire5188774495476010041tmp
Running org.apache.hadoop.hbase.io.TestHeapSize
Tests run: 2, Failures: 0, Errors: 0, Skipped: 0, Time elapsed: 0.132 sec
Forking command line: /bin/sh -c cd /x1/jenkins/jenkins-slave/workspace/HBase-0.92/trunk && /x1/jenkins/tools/java/jdk1.6.0_27-32/jre/bin/java -enableassertions -Xmx1400m -Djava.security.egd=file:/dev/./urandom -jar /x1/jenkins/jenkins-slave/workspace/HBase-0.92/trunk/target/surefire/surefirebooter8275400470058133412.jar /x1/jenkins/jenkins-slave/workspace/HBase-0.92/trunk/target/surefire/surefire6899491721558710105tmp /x1/jenkins/jenkins-slave/workspace/HBase-0.92/trunk/target/surefire/surefire2641424291720601576tmp
Running org.apache.hadoop.hbase.TestRegionRebalancing
Tests run: 1, Failures: 0, Errors: 0, Skipped: 0, Time elapsed: 46.215 sec
Forking command line: /bin/sh -c cd /x1/jenkins/jenkins-slave/workspace/HBase-0.92/trunk && /x1/jenkins/tools/java/jdk1.6.0_27-32/jre/bin/java -enableassertions -Xmx1400m -Djava.security.egd=file:/dev/./urandom -jar /x1/jenkins/jenkins-slave/workspace/HBase-0.92/trunk/target/surefire/surefirebooter4731348684074750623.jar /x1/jenkins/jenkins-slave/workspace/HBase-0.92/trunk/target/surefire/surefire4922711873697362964tmp /x1/jenkins/jenkins-slave/workspace/HBase-0.92/trunk/target/surefire/surefire4997874538732548494tmp
Running org.apache.hadoop.hbase.mapred.TestTableInputFormat
Tests run: 6, Failures: 0, Errors: 0, Skipped: 0, Time elapsed: 29.489 sec
Forking command line: /bin/sh -c cd /x1/jenkins/jenkins-slave/workspace/HBase-0.92/trunk && /x1/jenkins/tools/java/jdk1.6.0_27-32/jre/bin/java -enableassertions -Xmx1400m -Djava.security.egd=file:/dev/./urandom -jar /x1/jenkins/jenkins-slave/workspace/HBase-0.92/trunk/target/surefire/surefirebooter1263289246263079114.jar /x1/jenkins/jenkins-slave/workspace/HBase-0.92/trunk/target/surefire/surefire2594932803109385241tmp /x1/jenkins/jenkins-slave/workspace/HBase-0.92/trunk/target/surefire/surefire4373214034102343668tmp
Running org.apache.hadoop.hbase.mapred.TestTableMapReduce
Tests run: 1, Failures: 0, Errors: 0, Skipped: 0, Time elapsed: 65.654 sec
Forking command line: /bin/sh -c cd /x1/jenkins/jenkins-slave/workspace/HBase-0.92/trunk && /x1/jenkins/tools/java/jdk1.6.0_27-32/jre/bin/java -enableassertions -Xmx1400m -Djava.security.egd=file:/dev/./urandom -jar /x1/jenkins/jenkins-slave/workspace/HBase-0.92/trunk/target/surefire/surefirebooter9175385290665712783.jar /x1/jenkins/jenkins-slave/workspace/HBase-0.92/trunk/target/surefire/surefire1847778251992379338tmp /x1/jenkins/jenkins-slave/workspace/HBase-0.92/trunk/target/surefire/surefire6171450072670883041tmp
Running org.apache.hadoop.hbase.replication.TestReplicationZookeeper
Tests run: 1, Failures: 0, Errors: 0, Skipped: 0, Time elapsed: 0.492 sec
Forking command line: /bin/sh -c cd /x1/jenkins/jenkins-slave/workspace/HBase-0.92/trunk && /x1/jenkins/tools/java/jdk1.6.0_27-32/jre/bin/java -enableassertions -Xmx1400m -Djava.security.egd=file:/dev/./urandom -jar /x1/jenkins/jenkins-slave/workspace/HBase-0.92/trunk/target/surefire/surefirebooter2297307865662889375.jar /x1/jenkins/jenkins-slave/workspace/HBase-0.92/trunk/target/surefire/surefire6739780066003467899tmp /x1/jenkins/jenkins-slave/workspace/HBase-0.92/trunk/target/surefire/surefire3313645259408208408tmp
Running org.apache.hadoop.hbase.replication.regionserver.TestReplicationSink
Tests run: 5, Failures: 0, Errors: 0, Skipped: 0, Time elapsed: 22.43 sec
Forking command line: /bin/sh -c cd /x1/jenkins/jenkins-slave/workspace/HBase-0.92/trunk && /x1/jenkins/tools/java/jdk1.6.0_27-32/jre/bin/java -enableassertions -Xmx1400m -Djava.security.egd=file:/dev/./urandom -jar /x1/jenkins/jenkins-slave/workspace/HBase-0.92/trunk/target/surefire/surefirebooter8310141448952810630.jar /x1/jenkins/jenkins-slave/workspace/HBase-0.92/trunk/target/surefire/surefire7024655355694193619tmp /x1/jenkins/jenkins-slave/workspace/HBase-0.92/trunk/target/surefire/surefire460547607785537759tmp
Running org.apache.hadoop.hbase.replication.regionserver.TestReplicationSourceManager
Tests run: 1, Failures: 0, Errors: 0, Skipped: 0, Time elapsed: 0.906 sec
Forking command line: /bin/sh -c cd /x1/jenkins/jenkins-slave/workspace/HBase-0.92/trunk && /x1/jenkins/tools/java/jdk1.6.0_27-32/jre/bin/java -enableassertions -Xmx1400m -Djava.security.egd=file:/dev/./urandom -jar /x1/jenkins/jenkins-slave/workspace/HBase-0.92/trunk/target/surefire/surefirebooter876584777925265544.jar /x1/jenkins/jenkins-slave/workspace/HBase-0.92/trunk/target/surefire/surefire6387126992906669092tmp /x1/jenkins/jenkins-slave/workspace/HBase-0.92/trunk/target/surefire/surefire2340929086053049712tmp
Running org.apache.hadoop.hbase.replication.TestReplicationSource
Tests run: 1, Failures: 0, Errors: 0, Skipped: 0, Time elapsed: 2.229 sec
Forking command line: /bin/sh -c cd /x1/jenkins/jenkins-slave/workspace/HBase-0.92/trunk && /x1/jenkins/tools/java/jdk1.6.0_27-32/jre/bin/java -enableassertions -Xmx1400m -Djava.security.egd=file:/dev/./urandom -jar /x1/jenkins/jenkins-slave/workspace/HBase-0.92/trunk/target/surefire/surefirebooter8471630143596831643.jar /x1/jenkins/jenkins-slave/workspace/HBase-0.92/trunk/target/surefire/surefire445281736228009696tmp /x1/jenkins/jenkins-slave/workspace/HBase-0.92/trunk/target/surefire/surefire3068226214724260517tmp
Running org.apache.hadoop.hbase.replication.TestReplication
Tests run: 8, Failures: 0, Errors: 0, Skipped: 0, Time elapsed: 128.751 sec
Forking command line: /bin/sh -c cd /x1/jenkins/jenkins-slave/workspace/HBase-0.92/trunk && /x1/jenkins/tools/java/jdk1.6.0_27-32/jre/bin/java -enableassertions -Xmx1400m -Djava.security.egd=file:/dev/./urandom -jar /x1/jenkins/jenkins-slave/workspace/HBase-0.92/trunk/target/surefire/surefirebooter357340993965984200.jar /x1/jenkins/jenkins-slave/workspace/HBase-0.92/trunk/target/surefire/surefire3275951812897030647tmp /x1/jenkins/jenkins-slave/workspace/HBase-0.92/trunk/target/surefire/surefire8330454024926443319tmp
Running org.apache.hadoop.hbase.replication.TestReplicationPeer
Tests run: 1, Failures: 0, Errors: 0, Skipped: 0, Time elapsed: 25.51 sec
Forking command line: /bin/sh -c cd /x1/jenkins/jenkins-slave/workspace/HBase-0.92/trunk && /x1/jenkins/tools/java/jdk1.6.0_27-32/jre/bin/java -enableassertions -Xmx1400m -Djava.security.egd=file:/dev/./urandom -jar /x1/jenkins/jenkins-slave/workspace/HBase-0.92/trunk/target/surefire/surefirebooter7995114058502811564.jar /x1/jenkins/jenkins-slave/workspace/HBase-0.92/trunk/target/surefire/surefire7634025534466023410tmp /x1/jenkins/jenkins-slave/workspace/HBase-0.92/trunk/target/surefire/surefire112619928348028736tmp
Running org.apache.hadoop.hbase.replication.TestMultiSlaveReplication
Tests run: 1, Failures: 0, Errors: 0, Skipped: 0, Time elapsed: 57.719 sec
Forking command line: /bin/sh -c cd /x1/jenkins/jenkins-slave/workspace/HBase-0.92/trunk && /x1/jenkins/tools/java/jdk1.6.0_27-32/jre/bin/java -enableassertions -Xmx1400m -Djava.security.egd=file:/dev/./urandom -jar /x1/jenkins/jenkins-slave/workspace/HBase-0.92/trunk/target/surefire/surefirebooter4849466842956656379.jar /x1/jenkins/jenkins-slave/workspace/HBase-0.92/trunk/target/surefire/surefire5389850673666838946tmp /x1/jenkins/jenkins-slave/workspace/HBase-0.92/trunk/target/surefire/surefire3361561898924842248tmp
Running org.apache.hadoop.hbase.replication.TestMasterReplication
Tests run: 2, Failures: 0, Errors: 0, Skipped: 0, Time elapsed: 92.62 sec
Forking command line: /bin/sh -c cd /x1/jenkins/jenkins-slave/workspace/HBase-0.92/trunk && /x1/jenkins/tools/java/jdk1.6.0_27-32/jre/bin/java -enableassertions -Xmx1400m -Djava.security.egd=file:/dev/./urandom -jar /x1/jenkins/jenkins-slave/workspace/HBase-0.92/trunk/target/surefire/surefirebooter5922055205717527321.jar /x1/jenkins/jenkins-slave/workspace/HBase-0.92/trunk/target/surefire/surefire5846413262104504517tmp /x1/jenkins/jenkins-slave/workspace/HBase-0.92/trunk/target/surefire/surefire2799486794640609859tmp
Running org.apache.hadoop.hbase.util.TestHBaseFsckComparator
Tests run: 6, Failures: 0, Errors: 0, Skipped: 0, Time elapsed: 0.14 sec
Forking command line: /bin/sh -c cd /x1/jenkins/jenkins-slave/workspace/HBase-0.92/trunk && /x1/jenkins/tools/java/jdk1.6.0_27-32/jre/bin/java -enableassertions -Xmx1400m -Djava.security.egd=file:/dev/./urandom -jar /x1/jenkins/jenkins-slave/workspace/HBase-0.92/trunk/target/surefire/surefirebooter7618459431190392829.jar /x1/jenkins/jenkins-slave/workspace/HBase-0.92/trunk/target/surefire/surefire1188088604511317097tmp /x1/jenkins/jenkins-slave/workspace/HBase-0.92/trunk/target/surefire/surefire8908597574556683205tmp
Running org.apache.hadoop.hbase.util.TestMergeTool
Tests run: 1, Failures: 0, Errors: 0, Skipped: 0, Time elapsed: 336.027 sec
Forking command line: /bin/sh -c cd /x1/jenkins/jenkins-slave/workspace/HBase-0.92/trunk && /x1/jenkins/tools/java/jdk1.6.0_27-32/jre/bin/java -enableassertions -Xmx1400m -Djava.security.egd=file:/dev/./urandom -jar /x1/jenkins/jenkins-slave/workspace/HBase-0.92/trunk/target/surefire/surefirebooter5836008726072775831.jar /x1/jenkins/jenkins-slave/workspace/HBase-0.92/trunk/target/surefire/surefire1161738024714510319tmp /x1/jenkins/jenkins-slave/workspace/HBase-0.92/trunk/target/surefire/surefire9222518654606765277tmp
Running org.apache.hadoop.hbase.util.TestFSTableDescriptors
Tests run: 10, Failures: 0, Errors: 0, Skipped: 0, Time elapsed: 0.732 sec
Forking command line: /bin/sh -c cd /x1/jenkins/jenkins-slave/workspace/HBase-0.92/trunk && /x1/jenkins/tools/java/jdk1.6.0_27-32/jre/bin/java -enableassertions -Xmx1400m -Djava.security.egd=file:/dev/./urandom -jar /x1/jenkins/jenkins-slave/workspace/HBase-0.92/trunk/target/surefire/surefirebooter884749845391999194.jar /x1/jenkins/jenkins-slave/workspace/HBase-0.92/trunk/target/surefire/surefire3116629758444915274tmp /x1/jenkins/jenkins-slave/workspace/HBase-0.92/trunk/target/surefire/surefire5983772798099407809tmp
Running org.apache.hadoop.hbase.util.TestIdLock
Tests run: 1, Failures: 0, Errors: 0, Skipped: 0, Time elapsed: 15.209 sec
Forking command line: /bin/sh -c cd /x1/jenkins/jenkins-slave/workspace/HBase-0.92/trunk && /x1/jenkins/tools/java/jdk1.6.0_27-32/jre/bin/java -enableassertions -Xmx1400m -Djava.security.egd=file:/dev/./urandom -jar /x1/jenkins/jenkins-slave/workspace/HBase-0.92/trunk/target/surefire/surefirebooter1894257729466876077.jar /x1/jenkins/jenkins-slave/workspace/HBase-0.92/trunk/target/surefire/surefire5734868715056247640tmp /x1/jenkins/jenkins-slave/workspace/HBase-0.92/trunk/target/surefire/surefire9042077316343389720tmp
Running org.apache.hadoop.hbase.util.TestCompressionTest
Tests run: 1, Failures: 0, Errors: 0, Skipped: 0, Time elapsed: 0.293 sec
Forking command line: /bin/sh -c cd /x1/jenkins/jenkins-slave/workspace/HBase-0.92/trunk && /x1/jenkins/tools/java/jdk1.6.0_27-32/jre/bin/java -enableassertions -Xmx1400m -Djava.security.egd=file:/dev/./urandom -jar /x1/jenkins/jenkins-slave/workspace/HBase-0.92/trunk/target/surefire/surefirebooter5025014793650387867.jar /x1/jenkins/jenkins-slave/workspace/HBase-0.92/trunk/target/surefire/surefire6839371578859606720tmp /x1/jenkins/jenkins-slave/workspace/HBase-0.92/trunk/target/surefire/surefire4873809621231893420tmp
Running org.apache.hadoop.hbase.util.TestBytes
Tests run: 13, Failures: 0, Errors: 0, Skipped: 0, Time elapsed: 0.091 sec
Forking command line: /bin/sh -c cd /x1/jenkins/jenkins-slave/workspace/HBase-0.92/trunk && /x1/jenkins/tools/java/jdk1.6.0_27-32/jre/bin/java -enableassertions -Xmx1400m -Djava.security.egd=file:/dev/./urandom -jar /x1/jenkins/jenkins-slave/workspace/HBase-0.92/trunk/target/surefire/surefirebooter7720484098248433358.jar /x1/jenkins/jenkins-slave/workspace/HBase-0.92/trunk/target/surefire/surefire3286188537162356634tmp /x1/jenkins/jenkins-slave/workspace/HBase-0.92/trunk/target/surefire/surefire652253132188252178tmp
Running org.apache.hadoop.hbase.util.TestSortedCopyOnWriteSet
Tests run: 2, Failures: 0, Errors: 0, Skipped: 0, Time elapsed: 0.064 sec
Forking command line: /bin/sh -c cd /x1/jenkins/jenkins-slave/workspace/HBase-0.92/trunk && /x1/jenkins/tools/java/jdk1.6.0_27-32/jre/bin/java -enableassertions -Xmx1400m -Djava.security.egd=file:/dev/./urandom -jar /x1/jenkins/jenkins-slave/workspace/HBase-0.92/trunk/target/surefire/surefirebooter7753656494517718364.jar /x1/jenkins/jenkins-slave/workspace/HBase-0.92/trunk/target/surefire/surefire118216674434921796tmp /x1/jenkins/jenkins-slave/workspace/HBase-0.92/trunk/target/surefire/surefire8533700638645049661tmp
Running org.apache.hadoop.hbase.util.TestEnvironmentEdgeManager
Tests run: 2, Failures: 0, Errors: 0, Skipped: 0, Time elapsed: 0.165 sec
Forking command line: /bin/sh -c cd /x1/jenkins/jenkins-slave/workspace/HBase-0.92/trunk && /x1/jenkins/tools/java/jdk1.6.0_27-32/jre/bin/java -enableassertions -Xmx1400m -Djava.security.egd=file:/dev/./urandom -jar /x1/jenkins/jenkins-slave/workspace/HBase-0.92/trunk/target/surefire/surefirebooter1374963058613541771.jar /x1/jenkins/jenkins-slave/workspace/HBase-0.92/trunk/target/surefire/surefire288053890343101014tmp /x1/jenkins/jenkins-slave/workspace/HBase-0.92/trunk/target/surefire/surefire5758877519189930087tmp
Running org.apache.hadoop.hbase.util.TestKeying
Tests run: 1, Failures: 0, Errors: 0, Skipped: 0, Time elapsed: 0.027 sec
Forking command line: /bin/sh -c cd /x1/jenkins/jenkins-slave/workspace/HBase-0.92/trunk && /x1/jenkins/tools/java/jdk1.6.0_27-32/jre/bin/java -enableassertions -Xmx1400m -Djava.security.egd=file:/dev/./urandom -jar /x1/jenkins/jenkins-slave/workspace/HBase-0.92/trunk/target/surefire/surefirebooter648451934581931985.jar /x1/jenkins/jenkins-slave/workspace/HBase-0.92/trunk/target/surefire/surefire3295422552029684510tmp /x1/jenkins/jenkins-slave/workspace/HBase-0.92/trunk/target/surefire/surefire3946517357361584191tmp
Running org.apache.hadoop.hbase.util.TestByteBloomFilter
Tests run: 5, Failures: 0, Errors: 0, Skipped: 0, Time elapsed: 0.852 sec
Forking command line: /bin/sh -c cd /x1/jenkins/jenkins-slave/workspace/HBase-0.92/trunk && /x1/jenkins/tools/java/jdk1.6.0_27-32/jre/bin/java -enableassertions -Xmx1400m -Djava.security.egd=file:/dev/./urandom -jar /x1/jenkins/jenkins-slave/workspace/HBase-0.92/trunk/target/surefire/surefirebooter3224548475747129052.jar /x1/jenkins/jenkins-slave/workspace/HBase-0.92/trunk/target/surefire/surefire9217797209141523255tmp /x1/jenkins/jenkins-slave/workspace/HBase-0.92/trunk/target/surefire/surefire6799409718843894950tmp
Running org.apache.hadoop.hbase.util.TestRootPath
Tests run: 1, Failures: 0, Errors: 0, Skipped: 0, Time elapsed: 0.086 sec
Forking command line: /bin/sh -c cd /x1/jenkins/jenkins-slave/workspace/HBase-0.92/trunk && /x1/jenkins/tools/java/jdk1.6.0_27-32/jre/bin/java -enableassertions -Xmx1400m -Djava.security.egd=file:/dev/./urandom -jar /x1/jenkins/jenkins-slave/workspace/HBase-0.92/trunk/target/surefire/surefirebooter2006323514065029061.jar /x1/jenkins/jenkins-slave/workspace/HBase-0.92/trunk/target/surefire/surefire5701096275959273679tmp /x1/jenkins/jenkins-slave/workspace/HBase-0.92/trunk/target/surefire/surefire3269513009009786641tmp
Running org.apache.hadoop.hbase.util.TestMergeTable
Tests run: 1, Failures: 0, Errors: 0, Skipped: 0, Time elapsed: 30.317 sec
Forking command line: /bin/sh -c cd /x1/jenkins/jenkins-slave/workspace/HBase-0.92/trunk && /x1/jenkins/tools/java/jdk1.6.0_27-32/jre/bin/java -enableassertions -Xmx1400m -Djava.security.egd=file:/dev/./urandom -jar /x1/jenkins/jenkins-slave/workspace/HBase-0.92/trunk/target/surefire/surefirebooter1750978681421164976.jar /x1/jenkins/jenkins-slave/workspace/HBase-0.92/trunk/target/surefire/surefire5132208808620114049tmp /x1/jenkins/jenkins-slave/workspace/HBase-0.92/trunk/target/surefire/surefire5706677730618319653tmp
Running org.apache.hadoop.hbase.util.TestHBaseFsck
Tests run: 14, Failures: 0, Errors: 0, Skipped: 0, Time elapsed: 178.051 sec
Forking command line: /bin/sh -c cd /x1/jenkins/jenkins-slave/workspace/HBase-0.92/trunk && /x1/jenkins/tools/java/jdk1.6.0_27-32/jre/bin/java -enableassertions -Xmx1400m -Djava.security.egd=file:/dev/./urandom -jar /x1/jenkins/jenkins-slave/workspace/HBase-0.92/trunk/target/surefire/surefirebooter1658527674146964444.jar /x1/jenkins/jenkins-slave/workspace/HBase-0.92/trunk/target/surefire/surefire8833504886046024085tmp /x1/jenkins/jenkins-slave/workspace/HBase-0.92/trunk/target/surefire/surefire3608650236984105662tmp
Running org.apache.hadoop.hbase.util.TestFSUtils
Tests run: 2, Failures: 0, Errors: 0, Skipped: 0, Time elapsed: 19.117 sec
Forking command line: /bin/sh -c cd /x1/jenkins/jenkins-slave/workspace/HBase-0.92/trunk && /x1/jenkins/tools/java/jdk1.6.0_27-32/jre/bin/java -enableassertions -Xmx1400m -Djava.security.egd=file:/dev/./urandom -jar /x1/jenkins/jenkins-slave/workspace/HBase-0.92/trunk/target/surefire/surefirebooter3372640488343986995.jar /x1/jenkins/jenkins-slave/workspace/HBase-0.92/trunk/target/surefire/surefire74949997378371524tmp /x1/jenkins/jenkins-slave/workspace/HBase-0.92/trunk/target/surefire/surefire6593893317409824020tmp
Running org.apache.hadoop.hbase.util.TestPoolMap
Tests run: 9, Failures: 0, Errors: 0, Skipped: 0, Time elapsed: 0.035 sec
Forking command line: /bin/sh -c cd /x1/jenkins/jenkins-slave/workspace/HBase-0.92/trunk && /x1/jenkins/tools/java/jdk1.6.0_27-32/jre/bin/java -enableassertions -Xmx1400m -Djava.security.egd=file:/dev/./urandom -jar /x1/jenkins/jenkins-slave/workspace/HBase-0.92/trunk/target/surefire/surefirebooter7110542174110438055.jar /x1/jenkins/jenkins-slave/workspace/HBase-0.92/trunk/target/surefire/surefire2157218382508921553tmp /x1/jenkins/jenkins-slave/workspace/HBase-0.92/trunk/target/surefire/surefire4554480150289168521tmp
Running org.apache.hadoop.hbase.util.TestBase64
Tests run: 1, Failures: 0, Errors: 0, Skipped: 0, Time elapsed: 0.111 sec
Forking command line: /bin/sh -c cd /x1/jenkins/jenkins-slave/workspace/HBase-0.92/trunk && /x1/jenkins/tools/java/jdk1.6.0_27-32/jre/bin/java -enableassertions -Xmx1400m -Djava.security.egd=file:/dev/./urandom -jar /x1/jenkins/jenkins-slave/workspace/HBase-0.92/trunk/target/surefire/surefirebooter5246050686994896205.jar /x1/jenkins/jenkins-slave/workspace/HBase-0.92/trunk/target/surefire/surefire679747247375253839tmp /x1/jenkins/jenkins-slave/workspace/HBase-0.92/trunk/target/surefire/surefire529986861460916186tmp
Running org.apache.hadoop.hbase.util.hbck.TestOfflineMetaRebuildBase
Tests run: 1, Failures: 0, Errors: 0, Skipped: 0, Time elapsed: 34.463 sec
Forking command line: /bin/sh -c cd /x1/jenkins/jenkins-slave/workspace/HBase-0.92/trunk && /x1/jenkins/tools/java/jdk1.6.0_27-32/jre/bin/java -enableassertions -Xmx1400m -Djava.security.egd=file:/dev/./urandom -jar /x1/jenkins/jenkins-slave/workspace/HBase-0.92/trunk/target/surefire/surefirebooter1847789611253182090.jar /x1/jenkins/jenkins-slave/workspace/HBase-0.92/trunk/target/surefire/surefire2632395682654688970tmp /x1/jenkins/jenkins-slave/workspace/HBase-0.92/trunk/target/surefire/surefire9220137337984702492tmp
Running org.apache.hadoop.hbase.util.hbck.TestOfflineMetaRebuildOverlap
Tests run: 1, Failures: 0, Errors: 0, Skipped: 0, Time elapsed: 31.911 sec
Forking command line: /bin/sh -c cd /x1/jenkins/jenkins-slave/workspace/HBase-0.92/trunk && /x1/jenkins/tools/java/jdk1.6.0_27-32/jre/bin/java -enableassertions -Xmx1400m -Djava.security.egd=file:/dev/./urandom -jar /x1/jenkins/jenkins-slave/workspace/HBase-0.92/trunk/target/surefire/surefirebooter4169006794886446294.jar /x1/jenkins/jenkins-slave/workspace/HBase-0.92/trunk/target/surefire/surefire7616440716837285643tmp /x1/jenkins/jenkins-slave/workspace/HBase-0.92/trunk/target/surefire/surefire2342681332861965575tmp
Running org.apache.hadoop.hbase.util.hbck.TestOfflineMetaRebuildHole
Tests run: 1, Failures: 0, Errors: 0, Skipped: 0, Time elapsed: 34.025 sec
Forking command line: /bin/sh -c cd /x1/jenkins/jenkins-slave/workspace/HBase-0.92/trunk && /x1/jenkins/tools/java/jdk1.6.0_27-32/jre/bin/java -enableassertions -Xmx1400m -Djava.security.egd=file:/dev/./urandom -jar /x1/jenkins/jenkins-slave/workspace/HBase-0.92/trunk/target/surefire/surefirebooter1441589712973067038.jar /x1/jenkins/jenkins-slave/workspace/HBase-0.92/trunk/target/surefire/surefire3631180479540811663tmp /x1/jenkins/jenkins-slave/workspace/HBase-0.92/trunk/target/surefire/surefire3361507569614404806tmp
Running org.apache.hadoop.hbase.util.TestDefaultEnvironmentEdge
Tests run: 1, Failures: 0, Errors: 0, Skipped: 0, Time elapsed: 0.048 sec
Forking command line: /bin/sh -c cd /x1/jenkins/jenkins-slave/workspace/HBase-0.92/trunk && /x1/jenkins/tools/java/jdk1.6.0_27-32/jre/bin/java -enableassertions -Xmx1400m -Djava.security.egd=file:/dev/./urandom -jar /x1/jenkins/jenkins-slave/workspace/HBase-0.92/trunk/target/surefire/surefirebooter6823629930437553557.jar /x1/jenkins/jenkins-slave/workspace/HBase-0.92/trunk/target/surefire/surefire4694537557788808477tmp /x1/jenkins/jenkins-slave/workspace/HBase-0.92/trunk/target/surefire/surefire8129020608398622353tmp
Running org.apache.hadoop.hbase.util.TestIncrementingEnvironmentEdge
Tests run: 1, Failures: 0, Errors: 0, Skipped: 0, Time elapsed: 0.054 sec
Forking command line: /bin/sh -c cd /x1/jenkins/jenkins-slave/workspace/HBase-0.92/trunk && /x1/jenkins/tools/java/jdk1.6.0_27-32/jre/bin/java -enableassertions -Xmx1400m -Djava.security.egd=file:/dev/./urandom -jar /x1/jenkins/jenkins-slave/workspace/HBase-0.92/trunk/target/surefire/surefirebooter9090734958229518022.jar /x1/jenkins/jenkins-slave/workspace/HBase-0.92/trunk/target/surefire/surefire4273620352857708625tmp /x1/jenkins/jenkins-slave/workspace/HBase-0.92/trunk/target/surefire/surefire6420734573199321116tmp
Running org.apache.hadoop.hbase.util.TestRegionSplitCalculator
Tests run: 14, Failures: 0, Errors: 0, Skipped: 0, Time elapsed: 0.146 sec
Forking command line: /bin/sh -c cd /x1/jenkins/jenkins-slave/workspace/HBase-0.92/trunk && /x1/jenkins/tools/java/jdk1.6.0_27-32/jre/bin/java -enableassertions -Xmx1400m -Djava.security.egd=file:/dev/./urandom -jar /x1/jenkins/jenkins-slave/workspace/HBase-0.92/trunk/target/surefire/surefirebooter2909160060170904321.jar /x1/jenkins/jenkins-slave/workspace/HBase-0.92/trunk/target/surefire/surefire2353576404679425659tmp /x1/jenkins/jenkins-slave/workspace/HBase-0.92/trunk/target/surefire/surefire9025132735476245663tmp
Running org.apache.hadoop.hbase.TestHRegionLocation
Tests run: 3, Failures: 0, Errors: 0, Skipped: 0, Time elapsed: 0.109 sec
Forking command line: /bin/sh -c cd /x1/jenkins/jenkins-slave/workspace/HBase-0.92/trunk && /x1/jenkins/tools/java/jdk1.6.0_27-32/jre/bin/java -enableassertions -Xmx1400m -Djava.security.egd=file:/dev/./urandom -jar /x1/jenkins/jenkins-slave/workspace/HBase-0.92/trunk/target/surefire/surefirebooter2600335684135171200.jar /x1/jenkins/jenkins-slave/workspace/HBase-0.92/trunk/target/surefire/surefire6112186073905861567tmp /x1/jenkins/jenkins-slave/workspace/HBase-0.92/trunk/target/surefire/surefire320756027563794669tmp
Running org.apache.hadoop.hbase.migration.TestMigrationFrom090To092
Tests run: 1, Failures: 0, Errors: 0, Skipped: 0, Time elapsed: 0.224 sec
Forking command line: /bin/sh -c cd /x1/jenkins/jenkins-slave/workspace/HBase-0.92/trunk && /x1/jenkins/tools/java/jdk1.6.0_27-32/jre/bin/java -enableassertions -Xmx1400m -Djava.security.egd=file:/dev/./urandom -jar /x1/jenkins/jenkins-slave/workspace/HBase-0.92/trunk/target/surefire/surefirebooter6143374537842731579.jar /x1/jenkins/jenkins-slave/workspace/HBase-0.92/trunk/target/surefire/surefire7224285758570018621tmp /x1/jenkins/jenkins-slave/workspace/HBase-0.92/trunk/target/surefire/surefire551457744562877559tmp
Running org.apache.hadoop.hbase.TestCompare
Tests run: 1, Failures: 0, Errors: 0, Skipped: 0, Time elapsed: 0.18 sec
Forking command line: /bin/sh -c cd /x1/jenkins/jenkins-slave/workspace/HBase-0.92/trunk && /x1/jenkins/tools/java/jdk1.6.0_27-32/jre/bin/java -enableassertions -Xmx1400m -Djava.security.egd=file:/dev/./urandom -jar /x1/jenkins/jenkins-slave/workspace/HBase-0.92/trunk/target/surefire/surefirebooter4297431758194690224.jar /x1/jenkins/jenkins-slave/workspace/HBase-0.92/trunk/target/surefire/surefire8724694407007435859tmp /x1/jenkins/jenkins-slave/workspace/HBase-0.92/trunk/target/surefire/surefire1167050738528713808tmp
Running org.apache.hadoop.hbase.TestInfoServers
Tests run: 2, Failures: 0, Errors: 0, Skipped: 0, Time elapsed: 16.79 sec
Forking command line: /bin/sh -c cd /x1/jenkins/jenkins-slave/workspace/HBase-0.92/trunk && /x1/jenkins/tools/java/jdk1.6.0_27-32/jre/bin/java -enableassertions -Xmx1400m -Djava.security.egd=file:/dev/./urandom -jar /x1/jenkins/jenkins-slave/workspace/HBase-0.92/trunk/target/surefire/surefirebooter5551839401758224577.jar /x1/jenkins/jenkins-slave/workspace/HBase-0.92/trunk/target/surefire/surefire7959627252309853456tmp /x1/jenkins/jenkins-slave/workspace/HBase-0.92/trunk/target/surefire/surefire362673419329354887tmp
Running org.apache.hadoop.hbase.TestHServerAddress
Tests run: 6, Failures: 0, Errors: 0, Skipped: 0, Time elapsed: 0.063 sec
Forking command line: /bin/sh -c cd /x1/jenkins/jenkins-slave/workspace/HBase-0.92/trunk && /x1/jenkins/tools/java/jdk1.6.0_27-32/jre/bin/java -enableassertions -Xmx1400m -Djava.security.egd=file:/dev/./urandom -jar /x1/jenkins/jenkins-slave/workspace/HBase-0.92/trunk/target/surefire/surefirebooter4037009151250020249.jar /x1/jenkins/jenkins-slave/workspace/HBase-0.92/trunk/target/surefire/surefire7252612037247807762tmp /x1/jenkins/jenkins-slave/workspace/HBase-0.92/trunk/target/surefire/surefire8939348867060483561tmp
Running org.apache.hadoop.hbase.TestServerName
Tests run: 4, Failures: 0, Errors: 0, Skipped: 0, Time elapsed: 0.11 sec
Results :
Tests run: 1096, Failures: 0, Errors: 0, Skipped: 8
[INFO] ------------------------------------------------------------------------
[INFO] BUILD FAILURE
[INFO] ------------------------------------------------------------------------
[INFO] Total time: 2:21:45.608s
[INFO] Finished at: Fri Apr 06 04:38:42 UTC 2012
[INFO] Final Memory: 56M/801M
[INFO] ------------------------------------------------------------------------
[ERROR] Failed to execute goal org.apache.maven.plugins:maven-surefire-plugin:2.10:test (default-test) on project hbase: Failure or timeout -> [Help 1]
org.apache.maven.lifecycle.LifecycleExecutionException: Failed to execute goal org.apache.maven.plugins:maven-surefire-plugin:2.10:test (default-test) on project hbase: Failure or timeout
at org.apache.maven.lifecycle.internal.MojoExecutor.execute(MojoExecutor.java:217)
at org.apache.maven.lifecycle.internal.MojoExecutor.execute(MojoExecutor.java:153)
at org.apache.maven.lifecycle.internal.MojoExecutor.execute(MojoExecutor.java:145)
at org.apache.maven.lifecycle.internal.LifecycleModuleBuilder.buildProject(LifecycleModuleBuilder.java:84)
at org.apache.maven.lifecycle.internal.LifecycleModuleBuilder.buildProject(LifecycleModuleBuilder.java:59)
at org.apache.maven.lifecycle.internal.LifecycleStarter.singleThreadedBuild(LifecycleStarter.java:183)
at org.apache.maven.lifecycle.internal.LifecycleStarter.execute(LifecycleStarter.java:161)
at org.apache.maven.DefaultMaven.doExecute(DefaultMaven.java:319)
at org.apache.maven.DefaultMaven.execute(DefaultMaven.java:156)
at org.apache.maven.cli.MavenCli.execute(MavenCli.java:537)
at org.apache.maven.cli.MavenCli.doMain(MavenCli.java:196)
at org.apache.maven.cli.MavenCli.main(MavenCli.java:141)
at sun.reflect.NativeMethodAccessorImpl.invoke0(Native Method)
at sun.reflect.NativeMethodAccessorImpl.invoke(NativeMethodAccessorImpl.java:39)
at sun.reflect.DelegatingMethodAccessorImpl.invoke(DelegatingMethodAccessorImpl.java:25)
at java.lang.reflect.Method.invoke(Method.java:597)
at org.codehaus.plexus.classworlds.launcher.Launcher.launchEnhanced(Launcher.java:290)
at org.codehaus.plexus.classworlds.launcher.Launcher.launch(Launcher.java:230)
at org.codehaus.plexus.classworlds.launcher.Launcher.mainWithExitCode(Launcher.java:409)
at org.codehaus.plexus.classworlds.launcher.Launcher.main(Launcher.java:352)
Caused by: org.apache.maven.plugin.MojoExecutionException: Failure or timeout
at org.apache.maven.plugin.surefire.SurefirePlugin.assertNoFailureOrTimeout(SurefirePlugin.java:633)
at org.apache.maven.plugin.surefire.SurefirePlugin.handleSummary(SurefirePlugin.java:614)
at org.apache.maven.plugin.surefire.AbstractSurefireMojo.executeAfterPreconditionsChecked(AbstractSurefireMojo.java:137)
at org.apache.maven.plugin.surefire.AbstractSurefireMojo.execute(AbstractSurefireMojo.java:98)
at org.apache.maven.plugin.DefaultBuildPluginManager.executeMojo(DefaultBuildPluginManager.java:101)
at org.apache.maven.lifecycle.internal.MojoExecutor.execute(MojoExecutor.java:209)
... 19 more
[ERROR]
[ERROR]
[ERROR] For more information about the errors and possible solutions, please read the following articles:
[ERROR] [Help 1] http://cwiki.apache.org/confluence/display/MAVEN/MojoExecutionException
Build step 'Invoke top-level Maven targets' marked build as failure
Archiving artifacts
Updating HBASE-5724
Recording test results
Build failed in Jenkins: HBase-0.92 #357
Posted by Apache Jenkins Server <je...@builds.apache.org>.
See <https://builds.apache.org/job/HBase-0.92/357/changes>
Changes:
[stack] HBASE-5711 Tests are failing with incorrect data directory permissions -- REVERT
------------------------------------------
[...truncated 6119 lines...]
[DEBUG] properties used {java.vendor=Sun Microsystems Inc., commons-cli.version=1.2, jetty.jspapi.version=6.1.14, env.JENKINS_SERVER_COOKIE=7c50f1f72c06532d13df55278c5aeb60, sun.java.launcher=SUN_STANDARD, sun.management.compiler=HotSpot Tiered Compilers, commons-codec.version=1.4, os.name=Linux, sun.boot.class.path=/home/jenkins/tools/java/jdk1.6.0_27-32/jre/lib/resources.jar:/home/jenkins/tools/java/jdk1.6.0_27-32/jre/lib/rt.jar:/home/jenkins/tools/java/jdk1.6.0_27-32/jre/lib/sunrsasign.jar:/home/jenkins/tools/java/jdk1.6.0_27-32/jre/lib/jsse.jar:/home/jenkins/tools/java/jdk1.6.0_27-32/jre/lib/jce.jar:/home/jenkins/tools/java/jdk1.6.0_27-32/jre/lib/charsets.jar:/home/jenkins/tools/java/jdk1.6.0_27-32/jre/lib/modules/jdk.boot.jar:/home/jenkins/tools/java/jdk1.6.0_27-32/jre/classes, package.pid.dir=/var/run/hbase, env.PWD=<https://builds.apache.org/job/HBase-0.92/ws/trunk,> mockito-all.version=1.8.5, java.vm.specification.vendor=Sun Microsystems Inc., java.runtime.version=1.6.0_27-b07, myThreadCount=1, project.build.sourceEncoding=UTF-8, commons-httpclient.version=3.1, user.name=jenkins, env._=/usr/bin/java, env.USER=jenkins, env.SHELL=/bin/bash, myParallelMode=none, sourceReleaseAssemblyDescriptor=source-release, env.NLSPATH=/usr/dt/lib/nls/msg/%L/%N.cat, package.log.dir=/var/log/hbase, env.PATH=/home/hudson/tools/java/latest1.6/bin:/usr/local/bin:/usr/bin:/bin:/usr/bin/X11:/usr/games, user.language=en, sun.boot.library.path=/home/jenkins/tools/java/jdk1.6.0_27-32/jre/lib/i386, thrift.version=0.7.0, classworlds.conf=/home/hudson/tools/maven/latest3/bin/m2.conf, env.SSH_CONNECTION=140.211.11.8 59481 67.195.138.60 22, java.version=1.6.0_27, package.conf.dir=/etc/hbase, env.SSH_CLIENT=140.211.11.8 59481 22, commons-math.version=2.1, user.timezone=Etc/UTC, env.NODE_NAME=ubuntu4, organization.logo=http://www.apache.org/images/asf_logo_wide.gif, sun.arch.data.model=32, compileSource=1.6, java.endorsed.dirs=/home/jenkins/tools/java/jdk1.6.0_27-32/jre/lib/endorsed, commons-lang.version=2.5, sun.cpu.isalist=, sun.jnu.encoding=ANSI_X3.4-1968, file.encoding.pkg=sun.io, env.SHLVL=1, file.separator=/, env.SVN_REVISION=1310107, java.specification.name=Java Platform API Specification, java.class.version=50.0, user.country=US, env.BUILD_NUMBER=357, java.home=/home/jenkins/tools/java/jdk1.6.0_27-32/jre, java.vm.info=mixed mode, env.LOGNAME=jenkins, os.version=2.6.32-33-server, maven.test.redirectTestOutputToFile=true, env.HUDSON_COOKIE=9f060697-53fa-4ebb-99f1-22b772d668d7, hadoop.version=1.0.0, path.separator=:, java.vm.version=20.2-b06, package.version=0.91.0, package.prefix=/usr, env.JOB_NAME=HBase-0.92, env.JAVA_HOME=/home/hudson/tools/java/latest1.6, java.awt.printerjob=sun.print.PSPrinterJob, commons-configuration.version=1.6, integrationtest.include=**/IntegrationTest*.java, sun.io.unicode.encoding=UnicodeLittle, jaxb-api.version=2.1, unittest.include=**/Test*.java, env.HUDSON_URL=https://builds.apache.org/, env.BUILD_TAG=jenkins-HBase-0.92-357, user.home=/home/jenkins, jersey.version=1.4, env.JENKINS_HOME=/home/hudson/hudson, env.JOB_URL=https://builds.apache.org/job/HBase-0.92/, env.OLDPWD=/home/jenkins, protobuf.version=2.4.0a, myForkMode=always, guava.version=r09, java.specification.vendor=Sun Microsystems Inc., jruby.version=1.6.5, env.M2_HOME=/home/hudson/tools/maven/latest3, java.library.path=/home/jenkins/tools/java/jdk1.6.0_27-32/jre/lib/i386/server:/home/jenkins/tools/java/jdk1.6.0_27-32/jre/lib/i386:/home/jenkins/tools/java/jdk1.6.0_27-32/jre/../lib/i386:/usr/lib/jvm/java-6-openjdk/jre/lib/amd64/server:/usr/lib/jvm/java-6-openjdk/jre/lib/amd64:/usr/lib/jvm/java-6-openjdk/jre/../lib/amd64:/usr/java/packages/lib/i386:/lib:/usr/lib, java.vendor.url=http://java.sun.com/, distMgmtSnapshotsName=Apache Development Snapshot Repository, env.HUDSON_HOME=/home/hudson/hudson, env.HUDSON_SERVER_COOKIE=7c50f1f72c06532d13df55278c5aeb60, java.vm.vendor=Sun Microsystems Inc., test.exclude=, maven.home=/home/hudson/tools/maven/latest3, java.runtime.name=Java(TM) SE Runtime Environment, package.release=1, sun.java.command=org.codehaus.plexus.classworlds.launcher.Launcher -e -X clean -Dmaven.test.redirectTestOutputToFile=true site install assembly:single -Prelease, java.class.path=/home/hudson/tools/maven/latest3/boot/plexus-classworlds-2.4.jar, env.EXECUTOR_NUMBER=1, env.MAVEN_TERMINATE_CMD=on, jetty.version=6.1.26, build.platform=Linux-i386-32, test.exclude.pattern=**/.java, jasper.version=5.5.23, env.XFILESEARCHPATH=/usr/dt/app-defaults/%L/Dt, slf4j.version=1.5.8, java.vm.specification.name=Java Virtual Machine Specification, java.vm.specification.version=1.0, sun.cpu.endian=little, sun.os.patch.level=unknown, env.HOME=/home/jenkins, env.BUILD_URL=https://builds.apache.org/job/HBase-0.92/357/, java.io.tmpdir=/tmp, env.LD_LIBRARY_PATH=/home/jenkins/tools/java/jdk1.6.0_27-32/jre/lib/i386/server:/home/jenkins/tools/java/jdk1.6.0_27-32/jre/lib/i386:/home/jenkins/tools/java/jdk1.6.0_27-32/jre/../lib/i386:/usr/lib/jvm/java-6-openjdk/jre/lib/amd64/server:/usr/lib/jvm/java-6-openjdk/jre/lib/amd64:/usr/lib/jvm/java-6-openjdk/jre/../lib/amd64, java.vendor.url.bug=http://java.sun.com/cgi-bin/bugreport.cgi, distMgmtSnapshotsUrl=https://repository.apache.org/content/repositories/snapshots, env.MAVEN_OPTS=-Xmx3G, commons-logging.version=1.1.1, os.arch=i386, java.awt.graphicsenv=sun.awt.X11GraphicsEnvironment, java.ext.dirs=/home/jenkins/tools/java/jdk1.6.0_27-32/jre/lib/ext:/usr/java/packages/lib/ext, env.MAVEN_HOME=/home/hudson/tools/maven/latest3, user.dir=<https://builds.apache.org/job/HBase-0.92/ws/trunk,> env.BUILD_ID=2012-04-06_00-08-54, log4j.version=1.2.16, line.separator=
, env.JENKINS_URL=https://builds.apache.org/, java.vm.name=Java HotSpot(TM) Server VM, stax-api.version=1.0.1, env.SVN_URL=https://svn.apache.org/repos/asf/hbase/branches/0.92, hadoop-snappy.version=0.0.1-SNAPSHOT, jackson.version=1.5.5, file.encoding=ANSI_X3.4-1968, env.MAIL=/var/mail/jenkins, env.WORKSPACE=<https://builds.apache.org/job/HBase-0.92/ws/,> avro.version=1.5.3, final.name=hbase-0.92.2-SNAPSHOT, zookeeper.version=3.4.3, java.specification.version=1.6, junit.version=4.10, env.NODE_LABELS=Ubuntu hadoop10 ubuntu ubuntu4}
[INFO] Using 'UTF-8' encoding to copy filtered resources.
[DEBUG] resource with targetPath null
directory <https://builds.apache.org/job/HBase-0.92/ws/trunk/src/test/resources>
excludes [hbase-site.xml]
includes []
[INFO] Copying 4 resources
[DEBUG] file log4j.properties has a filtered file extension
[DEBUG] copy <https://builds.apache.org/job/HBase-0.92/ws/trunk/src/test/resources/log4j.properties> to <https://builds.apache.org/job/HBase-0.92/ws/trunk/target/test-classes/log4j.properties>
[DEBUG] file mapred-queues.xml has a filtered file extension
[DEBUG] copy <https://builds.apache.org/job/HBase-0.92/ws/trunk/src/test/resources/mapred-queues.xml> to <https://builds.apache.org/job/HBase-0.92/ws/trunk/target/test-classes/mapred-queues.xml>
[DEBUG] file PerformanceEvaluation_Counter.properties has a filtered file extension
[DEBUG] copy <https://builds.apache.org/job/HBase-0.92/ws/trunk/src/test/resources/org/apache/hadoop/hbase/PerformanceEvaluation_Counter.properties> to <https://builds.apache.org/job/HBase-0.92/ws/trunk/target/test-classes/org/apache/hadoop/hbase/PerformanceEvaluation_Counter.properties>
[DEBUG] file 8e8ab58dcf39412da19833fcd8f687ac has a filtered file extension
[DEBUG] copy <https://builds.apache.org/job/HBase-0.92/ws/trunk/src/test/resources/org/apache/hadoop/hbase/io/hfile/8e8ab58dcf39412da19833fcd8f687ac> to <https://builds.apache.org/job/HBase-0.92/ws/trunk/target/test-classes/org/apache/hadoop/hbase/io/hfile/8e8ab58dcf39412da19833fcd8f687ac>
[DEBUG] resource with targetPath null
directory <https://builds.apache.org/job/HBase-0.92/ws/trunk/target/maven-shared-archive-resources>
excludes []
includes []
[INFO] Copying 3 resources
[DEBUG] file NOTICE has a filtered file extension
[DEBUG] copy <https://builds.apache.org/job/HBase-0.92/ws/trunk/target/maven-shared-archive-resources/META-INF/NOTICE> to <https://builds.apache.org/job/HBase-0.92/ws/trunk/target/test-classes/META-INF/NOTICE>
[DEBUG] file DEPENDENCIES has a filtered file extension
[DEBUG] copy <https://builds.apache.org/job/HBase-0.92/ws/trunk/target/maven-shared-archive-resources/META-INF/DEPENDENCIES> to <https://builds.apache.org/job/HBase-0.92/ws/trunk/target/test-classes/META-INF/DEPENDENCIES>
[DEBUG] file LICENSE has a filtered file extension
[DEBUG] copy <https://builds.apache.org/job/HBase-0.92/ws/trunk/target/maven-shared-archive-resources/META-INF/LICENSE> to <https://builds.apache.org/job/HBase-0.92/ws/trunk/target/test-classes/META-INF/LICENSE>
[DEBUG] resource with targetPath null
directory <https://builds.apache.org/job/HBase-0.92/ws/trunk/src/test/resources>
excludes []
includes [hbase-site.xml]
[INFO] Copying 1 resource
[DEBUG] file hbase-site.xml has a filtered file extension
[DEBUG] copy <https://builds.apache.org/job/HBase-0.92/ws/trunk/src/test/resources/hbase-site.xml> to <https://builds.apache.org/job/HBase-0.92/ws/trunk/target/test-classes/hbase-site.xml>
[INFO]
[INFO] --- maven-compiler-plugin:2.0.2:testCompile (default-testCompile) @ hbase ---
[DEBUG] Configuring mojo org.apache.maven.plugins:maven-compiler-plugin:2.0.2:testCompile from plugin realm ClassRealm[plugin>org.apache.maven.plugins:maven-compiler-plugin:2.0.2, parent: sun.misc.Launcher$AppClassLoader@192d342]
[DEBUG] Configuring mojo 'org.apache.maven.plugins:maven-compiler-plugin:2.0.2:testCompile' with basic configurator -->
[DEBUG] (f) basedir = <https://builds.apache.org/job/HBase-0.92/ws/trunk>
[DEBUG] (f) buildDirectory = <https://builds.apache.org/job/HBase-0.92/ws/trunk/target>
[DEBUG] (f) classpathElements = [<https://builds.apache.org/job/HBase-0.92/ws/trunk/target/test-classes,> <https://builds.apache.org/job/HBase-0.92/ws/trunk/target/classes,> /home/jenkins/.m2/repository/com/google/guava/guava/r09/guava-r09.jar, /home/jenkins/.m2/repository/commons-cli/commons-cli/1.2/commons-cli-1.2.jar, /home/jenkins/.m2/repository/commons-configuration/commons-configuration/1.6/commons-configuration-1.6.jar, /home/jenkins/.m2/repository/commons-collections/commons-collections/3.2.1/commons-collections-3.2.1.jar, /home/jenkins/.m2/repository/commons-digester/commons-digester/1.8/commons-digester-1.8.jar, /home/jenkins/.m2/repository/commons-beanutils/commons-beanutils/1.7.0/commons-beanutils-1.7.0.jar, /home/jenkins/.m2/repository/commons-beanutils/commons-beanutils-core/1.8.0/commons-beanutils-core-1.8.0.jar, /home/jenkins/.m2/repository/com/github/stephenc/high-scale-lib/high-scale-lib/1.1.1/high-scale-lib-1.1.1.jar, /home/jenkins/.m2/repository/commons-codec/commons-codec/1.4/commons-codec-1.4.jar, /home/jenkins/.m2/repository/commons-httpclient/commons-httpclient/3.1/commons-httpclient-3.1.jar, /home/jenkins/.m2/repository/commons-lang/commons-lang/2.5/commons-lang-2.5.jar, /home/jenkins/.m2/repository/commons-logging/commons-logging/1.1.1/commons-logging-1.1.1.jar, /home/jenkins/.m2/repository/log4j/log4j/1.2.16/log4j-1.2.16.jar, /home/jenkins/.m2/repository/org/apache/avro/avro/1.5.3/avro-1.5.3.jar, /home/jenkins/.m2/repository/org/xerial/snappy/snappy-java/1.0.3.2/snappy-java-1.0.3.2.jar, /home/jenkins/.m2/repository/org/apache/avro/avro-ipc/1.5.3/avro-ipc-1.5.3.jar, /home/jenkins/.m2/repository/org/jboss/netty/netty/3.2.4.Final/netty-3.2.4.Final.jar, /home/jenkins/.m2/repository/org/apache/velocity/velocity/1.7/velocity-1.7.jar, /home/jenkins/.m2/repository/org/apache/zookeeper/zookeeper/3.4.3/zookeeper-3.4.3.jar, /home/jenkins/.m2/repository/org/apache/thrift/libthrift/0.7.0/libthrift-0.7.0.jar, /home/jenkins/.m2/repository/javax/servlet/servlet-api/2.5/servlet-api-2.5.jar, /home/jenkins/.m2/repository/org/apache/httpcomponents/httpclient/4.0.1/httpclient-4.0.1.jar, /home/jenkins/.m2/repository/org/apache/httpcomponents/httpcore/4.0.1/httpcore-4.0.1.jar, /home/jenkins/.m2/repository/org/jruby/jruby-complete/1.6.5/jruby-complete-1.6.5.jar, /home/jenkins/.m2/repository/org/mortbay/jetty/jetty/6.1.26/jetty-6.1.26.jar, /home/jenkins/.m2/repository/org/mortbay/jetty/jetty-util/6.1.26/jetty-util-6.1.26.jar, /home/jenkins/.m2/repository/org/mortbay/jetty/jsp-2.1/6.1.14/jsp-2.1-6.1.14.jar, /home/jenkins/.m2/repository/org/eclipse/jdt/core/3.1.1/core-3.1.1.jar, /home/jenkins/.m2/repository/org/mortbay/jetty/jsp-api-2.1/6.1.14/jsp-api-2.1-6.1.14.jar, /home/jenkins/.m2/repository/org/mortbay/jetty/servlet-api-2.5/6.1.14/servlet-api-2.5-6.1.14.jar, /home/jenkins/.m2/repository/org/codehaus/jackson/jackson-core-asl/1.5.5/jackson-core-asl-1.5.5.jar, /home/jenkins/.m2/repository/org/codehaus/jackson/jackson-mapper-asl/1.5.5/jackson-mapper-asl-1.5.5.jar, /home/jenkins/.m2/repository/org/codehaus/jackson/jackson-jaxrs/1.5.5/jackson-jaxrs-1.5.5.jar, /home/jenkins/.m2/repository/org/codehaus/jackson/jackson-xc/1.5.5/jackson-xc-1.5.5.jar, /home/jenkins/.m2/repository/org/slf4j/slf4j-api/1.5.8/slf4j-api-1.5.8.jar, /home/jenkins/.m2/repository/org/slf4j/slf4j-log4j12/1.5.8/slf4j-log4j12-1.5.8.jar, /home/jenkins/.m2/repository/tomcat/jasper-compiler/5.5.23/jasper-compiler-5.5.23.jar, /home/jenkins/.m2/repository/tomcat/jasper-runtime/5.5.23/jasper-runtime-5.5.23.jar, /home/jenkins/.m2/repository/commons-el/commons-el/1.0/commons-el-1.0.jar, /home/jenkins/.m2/repository/org/jamon/jamon-runtime/2.3.1/jamon-runtime-2.3.1.jar, /home/jenkins/.m2/repository/com/google/protobuf/protobuf-java/2.4.0a/protobuf-java-2.4.0a.jar, /home/jenkins/.m2/repository/com/sun/jersey/jersey-core/1.4/jersey-core-1.4.jar, /home/jenkins/.m2/repository/com/sun/jersey/jersey-json/1.4/jersey-json-1.4.jar, /home/jenkins/.m2/repository/org/codehaus/jettison/jettison/1.1/jettison-1.1.jar, /home/jenkins/.m2/repository/com/sun/xml/bind/jaxb-impl/2.1.12/jaxb-impl-2.1.12.jar, /home/jenkins/.m2/repository/com/sun/jersey/jersey-server/1.4/jersey-server-1.4.jar, /home/jenkins/.m2/repository/asm/asm/3.1/asm-3.1.jar, /home/jenkins/.m2/repository/javax/xml/bind/jaxb-api/2.1/jaxb-api-2.1.jar, /home/jenkins/.m2/repository/javax/activation/activation/1.1/activation-1.1.jar, /home/jenkins/.m2/repository/stax/stax-api/1.0.1/stax-api-1.0.1.jar, /home/jenkins/.m2/repository/junit/junit/4.10/junit-4.10.jar, /home/jenkins/.m2/repository/org/hamcrest/hamcrest-core/1.1/hamcrest-core-1.1.jar, /home/jenkins/.m2/repository/org/mockito/mockito-all/1.8.5/mockito-all-1.8.5.jar, /home/jenkins/.m2/repository/org/apache/commons/commons-math/2.1/commons-math-2.1.jar, /home/jenkins/.m2/repository/org/apache/hadoop/hadoop-core/1.0.0/hadoop-core-1.0.0.jar, /home/jenkins/.m2/repository/xmlenc/xmlenc/0.52/xmlenc-0.52.jar, /home/jenkins/.m2/repository/commons-net/commons-net/1.4.1/commons-net-1.4.1.jar, /home/jenkins/.m2/repository/org/apache/hadoop/hadoop-test/1.0.0/hadoop-test-1.0.0.jar, /home/jenkins/.m2/repository/org/apache/ftpserver/ftplet-api/1.0.0/ftplet-api-1.0.0.jar, /home/jenkins/.m2/repository/org/apache/mina/mina-core/2.0.0-M5/mina-core-2.0.0-M5.jar, /home/jenkins/.m2/repository/org/apache/ftpserver/ftpserver-core/1.0.0/ftpserver-core-1.0.0.jar, /home/jenkins/.m2/repository/org/apache/ftpserver/ftpserver-deprecated/1.0.0-M2/ftpserver-deprecated-1.0.0-M2.jar]
[DEBUG] (f) compileSourceRoots = [<https://builds.apache.org/job/HBase-0.92/ws/trunk/src/test/java]>
[DEBUG] (f) compilerId = javac
[DEBUG] (f) debug = true
[DEBUG] (f) encoding = UTF-8
[DEBUG] (f) failOnError = true
[DEBUG] (f) fork = false
[DEBUG] (f) optimize = false
[DEBUG] (f) outputDirectory = <https://builds.apache.org/job/HBase-0.92/ws/trunk/target/test-classes>
[DEBUG] (f) outputFileName = hbase-0.92.2-SNAPSHOT
[DEBUG] (f) showDeprecation = false
[DEBUG] (f) showWarnings = true
[DEBUG] (f) source = 1.6
[DEBUG] (f) staleMillis = 0
[DEBUG] (f) target = 1.6
[DEBUG] (f) verbose = false
[DEBUG] -- end configuration --
[DEBUG] Using compiler 'javac'.
[DEBUG] Source directories: [<https://builds.apache.org/job/HBase-0.92/ws/trunk/src/test/java]>
[DEBUG] Classpath: [<https://builds.apache.org/job/HBase-0.92/ws/trunk/target/test-classes>
<https://builds.apache.org/job/HBase-0.92/ws/trunk/target/classes>
/home/jenkins/.m2/repository/com/google/guava/guava/r09/guava-r09.jar
/home/jenkins/.m2/repository/commons-cli/commons-cli/1.2/commons-cli-1.2.jar
/home/jenkins/.m2/repository/commons-configuration/commons-configuration/1.6/commons-configuration-1.6.jar
/home/jenkins/.m2/repository/commons-collections/commons-collections/3.2.1/commons-collections-3.2.1.jar
/home/jenkins/.m2/repository/commons-digester/commons-digester/1.8/commons-digester-1.8.jar
/home/jenkins/.m2/repository/commons-beanutils/commons-beanutils/1.7.0/commons-beanutils-1.7.0.jar
/home/jenkins/.m2/repository/commons-beanutils/commons-beanutils-core/1.8.0/commons-beanutils-core-1.8.0.jar
/home/jenkins/.m2/repository/com/github/stephenc/high-scale-lib/high-scale-lib/1.1.1/high-scale-lib-1.1.1.jar
/home/jenkins/.m2/repository/commons-codec/commons-codec/1.4/commons-codec-1.4.jar
/home/jenkins/.m2/repository/commons-httpclient/commons-httpclient/3.1/commons-httpclient-3.1.jar
/home/jenkins/.m2/repository/commons-lang/commons-lang/2.5/commons-lang-2.5.jar
/home/jenkins/.m2/repository/commons-logging/commons-logging/1.1.1/commons-logging-1.1.1.jar
/home/jenkins/.m2/repository/log4j/log4j/1.2.16/log4j-1.2.16.jar
/home/jenkins/.m2/repository/org/apache/avro/avro/1.5.3/avro-1.5.3.jar
/home/jenkins/.m2/repository/org/xerial/snappy/snappy-java/1.0.3.2/snappy-java-1.0.3.2.jar
/home/jenkins/.m2/repository/org/apache/avro/avro-ipc/1.5.3/avro-ipc-1.5.3.jar
/home/jenkins/.m2/repository/org/jboss/netty/netty/3.2.4.Final/netty-3.2.4.Final.jar
/home/jenkins/.m2/repository/org/apache/velocity/velocity/1.7/velocity-1.7.jar
/home/jenkins/.m2/repository/org/apache/zookeeper/zookeeper/3.4.3/zookeeper-3.4.3.jar
/home/jenkins/.m2/repository/org/apache/thrift/libthrift/0.7.0/libthrift-0.7.0.jar
/home/jenkins/.m2/repository/javax/servlet/servlet-api/2.5/servlet-api-2.5.jar
/home/jenkins/.m2/repository/org/apache/httpcomponents/httpclient/4.0.1/httpclient-4.0.1.jar
/home/jenkins/.m2/repository/org/apache/httpcomponents/httpcore/4.0.1/httpcore-4.0.1.jar
/home/jenkins/.m2/repository/org/jruby/jruby-complete/1.6.5/jruby-complete-1.6.5.jar
/home/jenkins/.m2/repository/org/mortbay/jetty/jetty/6.1.26/jetty-6.1.26.jar
/home/jenkins/.m2/repository/org/mortbay/jetty/jetty-util/6.1.26/jetty-util-6.1.26.jar
/home/jenkins/.m2/repository/org/mortbay/jetty/jsp-2.1/6.1.14/jsp-2.1-6.1.14.jar
/home/jenkins/.m2/repository/org/eclipse/jdt/core/3.1.1/core-3.1.1.jar
/home/jenkins/.m2/repository/org/mortbay/jetty/jsp-api-2.1/6.1.14/jsp-api-2.1-6.1.14.jar
/home/jenkins/.m2/repository/org/mortbay/jetty/servlet-api-2.5/6.1.14/servlet-api-2.5-6.1.14.jar
/home/jenkins/.m2/repository/org/codehaus/jackson/jackson-core-asl/1.5.5/jackson-core-asl-1.5.5.jar
/home/jenkins/.m2/repository/org/codehaus/jackson/jackson-mapper-asl/1.5.5/jackson-mapper-asl-1.5.5.jar
/home/jenkins/.m2/repository/org/codehaus/jackson/jackson-jaxrs/1.5.5/jackson-jaxrs-1.5.5.jar
/home/jenkins/.m2/repository/org/codehaus/jackson/jackson-xc/1.5.5/jackson-xc-1.5.5.jar
/home/jenkins/.m2/repository/org/slf4j/slf4j-api/1.5.8/slf4j-api-1.5.8.jar
/home/jenkins/.m2/repository/org/slf4j/slf4j-log4j12/1.5.8/slf4j-log4j12-1.5.8.jar
/home/jenkins/.m2/repository/tomcat/jasper-compiler/5.5.23/jasper-compiler-5.5.23.jar
/home/jenkins/.m2/repository/tomcat/jasper-runtime/5.5.23/jasper-runtime-5.5.23.jar
/home/jenkins/.m2/repository/commons-el/commons-el/1.0/commons-el-1.0.jar
/home/jenkins/.m2/repository/org/jamon/jamon-runtime/2.3.1/jamon-runtime-2.3.1.jar
/home/jenkins/.m2/repository/com/google/protobuf/protobuf-java/2.4.0a/protobuf-java-2.4.0a.jar
/home/jenkins/.m2/repository/com/sun/jersey/jersey-core/1.4/jersey-core-1.4.jar
/home/jenkins/.m2/repository/com/sun/jersey/jersey-json/1.4/jersey-json-1.4.jar
/home/jenkins/.m2/repository/org/codehaus/jettison/jettison/1.1/jettison-1.1.jar
/home/jenkins/.m2/repository/com/sun/xml/bind/jaxb-impl/2.1.12/jaxb-impl-2.1.12.jar
/home/jenkins/.m2/repository/com/sun/jersey/jersey-server/1.4/jersey-server-1.4.jar
/home/jenkins/.m2/repository/asm/asm/3.1/asm-3.1.jar
/home/jenkins/.m2/repository/javax/xml/bind/jaxb-api/2.1/jaxb-api-2.1.jar
/home/jenkins/.m2/repository/javax/activation/activation/1.1/activation-1.1.jar
/home/jenkins/.m2/repository/stax/stax-api/1.0.1/stax-api-1.0.1.jar
/home/jenkins/.m2/repository/junit/junit/4.10/junit-4.10.jar
/home/jenkins/.m2/repository/org/hamcrest/hamcrest-core/1.1/hamcrest-core-1.1.jar
/home/jenkins/.m2/repository/org/mockito/mockito-all/1.8.5/mockito-all-1.8.5.jar
/home/jenkins/.m2/repository/org/apache/commons/commons-math/2.1/commons-math-2.1.jar
/home/jenkins/.m2/repository/org/apache/hadoop/hadoop-core/1.0.0/hadoop-core-1.0.0.jar
/home/jenkins/.m2/repository/xmlenc/xmlenc/0.52/xmlenc-0.52.jar
/home/jenkins/.m2/repository/commons-net/commons-net/1.4.1/commons-net-1.4.1.jar
/home/jenkins/.m2/repository/org/apache/hadoop/hadoop-test/1.0.0/hadoop-test-1.0.0.jar
/home/jenkins/.m2/repository/org/apache/ftpserver/ftplet-api/1.0.0/ftplet-api-1.0.0.jar
/home/jenkins/.m2/repository/org/apache/mina/mina-core/2.0.0-M5/mina-core-2.0.0-M5.jar
/home/jenkins/.m2/repository/org/apache/ftpserver/ftpserver-core/1.0.0/ftpserver-core-1.0.0.jar
/home/jenkins/.m2/repository/org/apache/ftpserver/ftpserver-deprecated/1.0.0-M2/ftpserver-deprecated-1.0.0-M2.jar]
[DEBUG] Output directory: <https://builds.apache.org/job/HBase-0.92/ws/trunk/target/test-classes>
[DEBUG] Classpath:
[DEBUG] <https://builds.apache.org/job/HBase-0.92/ws/trunk/target/test-classes>
[DEBUG] <https://builds.apache.org/job/HBase-0.92/ws/trunk/target/classes>
[DEBUG] /home/jenkins/.m2/repository/com/google/guava/guava/r09/guava-r09.jar
[DEBUG] /home/jenkins/.m2/repository/commons-cli/commons-cli/1.2/commons-cli-1.2.jar
[DEBUG] /home/jenkins/.m2/repository/commons-configuration/commons-configuration/1.6/commons-configuration-1.6.jar
[DEBUG] /home/jenkins/.m2/repository/commons-collections/commons-collections/3.2.1/commons-collections-3.2.1.jar
[DEBUG] /home/jenkins/.m2/repository/commons-digester/commons-digester/1.8/commons-digester-1.8.jar
[DEBUG] /home/jenkins/.m2/repository/commons-beanutils/commons-beanutils/1.7.0/commons-beanutils-1.7.0.jar
[DEBUG] /home/jenkins/.m2/repository/commons-beanutils/commons-beanutils-core/1.8.0/commons-beanutils-core-1.8.0.jar
[DEBUG] /home/jenkins/.m2/repository/com/github/stephenc/high-scale-lib/high-scale-lib/1.1.1/high-scale-lib-1.1.1.jar
[DEBUG] /home/jenkins/.m2/repository/commons-codec/commons-codec/1.4/commons-codec-1.4.jar
[DEBUG] /home/jenkins/.m2/repository/commons-httpclient/commons-httpclient/3.1/commons-httpclient-3.1.jar
[DEBUG] /home/jenkins/.m2/repository/commons-lang/commons-lang/2.5/commons-lang-2.5.jar
[DEBUG] /home/jenkins/.m2/repository/commons-logging/commons-logging/1.1.1/commons-logging-1.1.1.jar
[DEBUG] /home/jenkins/.m2/repository/log4j/log4j/1.2.16/log4j-1.2.16.jar
[DEBUG] /home/jenkins/.m2/repository/org/apache/avro/avro/1.5.3/avro-1.5.3.jar
[DEBUG] /home/jenkins/.m2/repository/org/xerial/snappy/snappy-java/1.0.3.2/snappy-java-1.0.3.2.jar
[DEBUG] /home/jenkins/.m2/repository/org/apache/avro/avro-ipc/1.5.3/avro-ipc-1.5.3.jar
[DEBUG] /home/jenkins/.m2/repository/org/jboss/netty/netty/3.2.4.Final/netty-3.2.4.Final.jar
[DEBUG] /home/jenkins/.m2/repository/org/apache/velocity/velocity/1.7/velocity-1.7.jar
[DEBUG] /home/jenkins/.m2/repository/org/apache/zookeeper/zookeeper/3.4.3/zookeeper-3.4.3.jar
[DEBUG] /home/jenkins/.m2/repository/org/apache/thrift/libthrift/0.7.0/libthrift-0.7.0.jar
[DEBUG] /home/jenkins/.m2/repository/javax/servlet/servlet-api/2.5/servlet-api-2.5.jar
[DEBUG] /home/jenkins/.m2/repository/org/apache/httpcomponents/httpclient/4.0.1/httpclient-4.0.1.jar
[DEBUG] /home/jenkins/.m2/repository/org/apache/httpcomponents/httpcore/4.0.1/httpcore-4.0.1.jar
[DEBUG] /home/jenkins/.m2/repository/org/jruby/jruby-complete/1.6.5/jruby-complete-1.6.5.jar
[DEBUG] /home/jenkins/.m2/repository/org/mortbay/jetty/jetty/6.1.26/jetty-6.1.26.jar
[DEBUG] /home/jenkins/.m2/repository/org/mortbay/jetty/jetty-util/6.1.26/jetty-util-6.1.26.jar
[DEBUG] /home/jenkins/.m2/repository/org/mortbay/jetty/jsp-2.1/6.1.14/jsp-2.1-6.1.14.jar
[DEBUG] /home/jenkins/.m2/repository/org/eclipse/jdt/core/3.1.1/core-3.1.1.jar
[DEBUG] /home/jenkins/.m2/repository/org/mortbay/jetty/jsp-api-2.1/6.1.14/jsp-api-2.1-6.1.14.jar
[DEBUG] /home/jenkins/.m2/repository/org/mortbay/jetty/servlet-api-2.5/6.1.14/servlet-api-2.5-6.1.14.jar
[DEBUG] /home/jenkins/.m2/repository/org/codehaus/jackson/jackson-core-asl/1.5.5/jackson-core-asl-1.5.5.jar
[DEBUG] /home/jenkins/.m2/repository/org/codehaus/jackson/jackson-mapper-asl/1.5.5/jackson-mapper-asl-1.5.5.jar
[DEBUG] /home/jenkins/.m2/repository/org/codehaus/jackson/jackson-jaxrs/1.5.5/jackson-jaxrs-1.5.5.jar
[DEBUG] /home/jenkins/.m2/repository/org/codehaus/jackson/jackson-xc/1.5.5/jackson-xc-1.5.5.jar
[DEBUG] /home/jenkins/.m2/repository/org/slf4j/slf4j-api/1.5.8/slf4j-api-1.5.8.jar
[DEBUG] /home/jenkins/.m2/repository/org/slf4j/slf4j-log4j12/1.5.8/slf4j-log4j12-1.5.8.jar
[DEBUG] /home/jenkins/.m2/repository/tomcat/jasper-compiler/5.5.23/jasper-compiler-5.5.23.jar
[DEBUG] /home/jenkins/.m2/repository/tomcat/jasper-runtime/5.5.23/jasper-runtime-5.5.23.jar
[DEBUG] /home/jenkins/.m2/repository/commons-el/commons-el/1.0/commons-el-1.0.jar
[DEBUG] /home/jenkins/.m2/repository/org/jamon/jamon-runtime/2.3.1/jamon-runtime-2.3.1.jar
[DEBUG] /home/jenkins/.m2/repository/com/google/protobuf/protobuf-java/2.4.0a/protobuf-java-2.4.0a.jar
[DEBUG] /home/jenkins/.m2/repository/com/sun/jersey/jersey-core/1.4/jersey-core-1.4.jar
[DEBUG] /home/jenkins/.m2/repository/com/sun/jersey/jersey-json/1.4/jersey-json-1.4.jar
[DEBUG] /home/jenkins/.m2/repository/org/codehaus/jettison/jettison/1.1/jettison-1.1.jar
[DEBUG] /home/jenkins/.m2/repository/com/sun/xml/bind/jaxb-impl/2.1.12/jaxb-impl-2.1.12.jar
[DEBUG] /home/jenkins/.m2/repository/com/sun/jersey/jersey-server/1.4/jersey-server-1.4.jar
[DEBUG] /home/jenkins/.m2/repository/asm/asm/3.1/asm-3.1.jar
[DEBUG] /home/jenkins/.m2/repository/javax/xml/bind/jaxb-api/2.1/jaxb-api-2.1.jar
[DEBUG] /home/jenkins/.m2/repository/javax/activation/activation/1.1/activation-1.1.jar
[DEBUG] /home/jenkins/.m2/repository/stax/stax-api/1.0.1/stax-api-1.0.1.jar
[DEBUG] /home/jenkins/.m2/repository/junit/junit/4.10/junit-4.10.jar
[DEBUG] /home/jenkins/.m2/repository/org/hamcrest/hamcrest-core/1.1/hamcrest-core-1.1.jar
[DEBUG] /home/jenkins/.m2/repository/org/mockito/mockito-all/1.8.5/mockito-all-1.8.5.jar
[DEBUG] /home/jenkins/.m2/repository/org/apache/commons/commons-math/2.1/commons-math-2.1.jar
[DEBUG] /home/jenkins/.m2/repository/org/apache/hadoop/hadoop-core/1.0.0/hadoop-core-1.0.0.jar
[DEBUG] /home/jenkins/.m2/repository/xmlenc/xmlenc/0.52/xmlenc-0.52.jar
[DEBUG] /home/jenkins/.m2/repository/commons-net/commons-net/1.4.1/commons-net-1.4.1.jar
[DEBUG] /home/jenkins/.m2/repository/org/apache/hadoop/hadoop-test/1.0.0/hadoop-test-1.0.0.jar
[DEBUG] /home/jenkins/.m2/repository/org/apache/ftpserver/ftplet-api/1.0.0/ftplet-api-1.0.0.jar
[DEBUG] /home/jenkins/.m2/repository/org/apache/mina/mina-core/2.0.0-M5/mina-core-2.0.0-M5.jar
[DEBUG] /home/jenkins/.m2/repository/org/apache/ftpserver/ftpserver-core/1.0.0/ftpserver-core-1.0.0.jar
[DEBUG] /home/jenkins/.m2/repository/org/apache/ftpserver/ftpserver-deprecated/1.0.0-M2/ftpserver-deprecated-1.0.0-M2.jar
[DEBUG] Source roots:
[DEBUG] <https://builds.apache.org/job/HBase-0.92/ws/trunk/src/test/java>
[INFO] Compiling 283 source files to <https://builds.apache.org/job/HBase-0.92/ws/trunk/target/test-classes>
[INFO] ------------------------------------------------------------------------
[INFO] BUILD FAILURE
[INFO] ------------------------------------------------------------------------
[INFO] Total time: 46.617s
[INFO] Finished at: Fri Apr 06 00:09:51 UTC 2012
[INFO] Final Memory: 52M/602M
[INFO] ------------------------------------------------------------------------
[ERROR] Failed to execute goal org.apache.maven.plugins:maven-compiler-plugin:2.0.2:testCompile (default-testCompile) on project hbase: Compilation failure
[ERROR] <https://builds.apache.org/job/HBase-0.92/ws/trunk/src/test/java/org/apache/hadoop/hbase/TestKeyValue.java>:[402,64] cannot find symbol
[ERROR] symbol : variable WritableUtils
[ERROR] location: class org.apache.hadoop.hbase.TestKeyValue
[ERROR] -> [Help 1]
org.apache.maven.lifecycle.LifecycleExecutionException: Failed to execute goal org.apache.maven.plugins:maven-compiler-plugin:2.0.2:testCompile (default-testCompile) on project hbase: Compilation failure
<https://builds.apache.org/job/HBase-0.92/ws/trunk/src/test/java/org/apache/hadoop/hbase/TestKeyValue.java>:[402,64] cannot find symbol
symbol : variable WritableUtils
location: class org.apache.hadoop.hbase.TestKeyValue
at org.apache.maven.lifecycle.internal.MojoExecutor.execute(MojoExecutor.java:213)
at org.apache.maven.lifecycle.internal.MojoExecutor.execute(MojoExecutor.java:153)
at org.apache.maven.lifecycle.internal.MojoExecutor.execute(MojoExecutor.java:145)
at org.apache.maven.lifecycle.internal.LifecycleModuleBuilder.buildProject(LifecycleModuleBuilder.java:84)
at org.apache.maven.lifecycle.internal.LifecycleModuleBuilder.buildProject(LifecycleModuleBuilder.java:59)
at org.apache.maven.lifecycle.internal.LifecycleStarter.singleThreadedBuild(LifecycleStarter.java:183)
at org.apache.maven.lifecycle.internal.LifecycleStarter.execute(LifecycleStarter.java:161)
at org.apache.maven.DefaultMaven.doExecute(DefaultMaven.java:319)
at org.apache.maven.DefaultMaven.execute(DefaultMaven.java:156)
at org.apache.maven.cli.MavenCli.execute(MavenCli.java:537)
at org.apache.maven.cli.MavenCli.doMain(MavenCli.java:196)
at org.apache.maven.cli.MavenCli.main(MavenCli.java:141)
at sun.reflect.NativeMethodAccessorImpl.invoke0(Native Method)
at sun.reflect.NativeMethodAccessorImpl.invoke(NativeMethodAccessorImpl.java:39)
at sun.reflect.DelegatingMethodAccessorImpl.invoke(DelegatingMethodAccessorImpl.java:25)
at java.lang.reflect.Method.invoke(Method.java:597)
at org.codehaus.plexus.classworlds.launcher.Launcher.launchEnhanced(Launcher.java:290)
at org.codehaus.plexus.classworlds.launcher.Launcher.launch(Launcher.java:230)
at org.codehaus.plexus.classworlds.launcher.Launcher.mainWithExitCode(Launcher.java:409)
at org.codehaus.plexus.classworlds.launcher.Launcher.main(Launcher.java:352)
Caused by: org.apache.maven.plugin.CompilationFailureException: Compilation failure
<https://builds.apache.org/job/HBase-0.92/ws/trunk/src/test/java/org/apache/hadoop/hbase/TestKeyValue.java>:[402,64] cannot find symbol
symbol : variable WritableUtils
location: class org.apache.hadoop.hbase.TestKeyValue
at org.apache.maven.plugin.AbstractCompilerMojo.execute(AbstractCompilerMojo.java:516)
at org.apache.maven.plugin.TestCompilerMojo.execute(TestCompilerMojo.java:102)
at org.apache.maven.plugin.DefaultBuildPluginManager.executeMojo(DefaultBuildPluginManager.java:101)
at org.apache.maven.lifecycle.internal.MojoExecutor.execute(MojoExecutor.java:209)
... 19 more
[ERROR]
[ERROR]
[ERROR] For more information about the errors and possible solutions, please read the following articles:
[ERROR] [Help 1] http://cwiki.apache.org/confluence/display/MAVEN/MojoFailureException
Build step 'Invoke top-level Maven targets' marked build as failure
Archiving artifacts
Updating HBASE-5711
Recording test results
Build failed in Jenkins: HBase-0.92 #356
Posted by Apache Jenkins Server <je...@builds.apache.org>.
See <https://builds.apache.org/job/HBase-0.92/356/changes>
Changes:
[stack] HBASE-5724 Row cache of KeyValue should be cleared in readFields()
[stack] HBASE-5711 Tests are failing with incorrect data directory permissions.
------------------------------------------
[...truncated 6083 lines...]
, env.JENKINS_URL=https://builds.apache.org/, java.vm.name=Java HotSpot(TM) Server VM, stax-api.version=1.0.1, env.SVN_URL=https://svn.apache.org/repos/asf/hbase/branches/0.92, hadoop-snappy.version=0.0.1-SNAPSHOT, jackson.version=1.5.5, file.encoding=ANSI_X3.4-1968, env.MAIL=/var/mail/jenkins, env.WORKSPACE=<https://builds.apache.org/job/HBase-0.92/ws/,> avro.version=1.5.3, final.name=hbase-0.92.2-SNAPSHOT, zookeeper.version=3.4.3, java.specification.version=1.6, junit.version=4.10, env.NODE_LABELS=Ubuntu ubuntu ubuntu1}
[INFO] Using 'UTF-8' encoding to copy filtered resources.
[DEBUG] resource with targetPath null
directory <https://builds.apache.org/job/HBase-0.92/ws/trunk/src/test/resources>
excludes [hbase-site.xml]
includes []
[INFO] Copying 4 resources
[DEBUG] file log4j.properties has a filtered file extension
[DEBUG] copy <https://builds.apache.org/job/HBase-0.92/ws/trunk/src/test/resources/log4j.properties> to <https://builds.apache.org/job/HBase-0.92/ws/trunk/target/test-classes/log4j.properties>
[DEBUG] file mapred-queues.xml has a filtered file extension
[DEBUG] copy <https://builds.apache.org/job/HBase-0.92/ws/trunk/src/test/resources/mapred-queues.xml> to <https://builds.apache.org/job/HBase-0.92/ws/trunk/target/test-classes/mapred-queues.xml>
[DEBUG] file PerformanceEvaluation_Counter.properties has a filtered file extension
[DEBUG] copy <https://builds.apache.org/job/HBase-0.92/ws/trunk/src/test/resources/org/apache/hadoop/hbase/PerformanceEvaluation_Counter.properties> to <https://builds.apache.org/job/HBase-0.92/ws/trunk/target/test-classes/org/apache/hadoop/hbase/PerformanceEvaluation_Counter.properties>
[DEBUG] file 8e8ab58dcf39412da19833fcd8f687ac has a filtered file extension
[DEBUG] copy <https://builds.apache.org/job/HBase-0.92/ws/trunk/src/test/resources/org/apache/hadoop/hbase/io/hfile/8e8ab58dcf39412da19833fcd8f687ac> to <https://builds.apache.org/job/HBase-0.92/ws/trunk/target/test-classes/org/apache/hadoop/hbase/io/hfile/8e8ab58dcf39412da19833fcd8f687ac>
[DEBUG] resource with targetPath null
directory <https://builds.apache.org/job/HBase-0.92/ws/trunk/target/maven-shared-archive-resources>
excludes []
includes []
[INFO] Copying 3 resources
[DEBUG] file LICENSE has a filtered file extension
[DEBUG] copy <https://builds.apache.org/job/HBase-0.92/ws/trunk/target/maven-shared-archive-resources/META-INF/LICENSE> to <https://builds.apache.org/job/HBase-0.92/ws/trunk/target/test-classes/META-INF/LICENSE>
[DEBUG] file NOTICE has a filtered file extension
[DEBUG] copy <https://builds.apache.org/job/HBase-0.92/ws/trunk/target/maven-shared-archive-resources/META-INF/NOTICE> to <https://builds.apache.org/job/HBase-0.92/ws/trunk/target/test-classes/META-INF/NOTICE>
[DEBUG] file DEPENDENCIES has a filtered file extension
[DEBUG] copy <https://builds.apache.org/job/HBase-0.92/ws/trunk/target/maven-shared-archive-resources/META-INF/DEPENDENCIES> to <https://builds.apache.org/job/HBase-0.92/ws/trunk/target/test-classes/META-INF/DEPENDENCIES>
[DEBUG] resource with targetPath null
directory <https://builds.apache.org/job/HBase-0.92/ws/trunk/src/test/resources>
excludes []
includes [hbase-site.xml]
[INFO] Copying 1 resource
[DEBUG] file hbase-site.xml has a filtered file extension
[DEBUG] copy <https://builds.apache.org/job/HBase-0.92/ws/trunk/src/test/resources/hbase-site.xml> to <https://builds.apache.org/job/HBase-0.92/ws/trunk/target/test-classes/hbase-site.xml>
[INFO]
[INFO] --- maven-compiler-plugin:2.0.2:testCompile (default-testCompile) @ hbase ---
[DEBUG] Configuring mojo org.apache.maven.plugins:maven-compiler-plugin:2.0.2:testCompile from plugin realm ClassRealm[plugin>org.apache.maven.plugins:maven-compiler-plugin:2.0.2, parent: sun.misc.Launcher$AppClassLoader@192d342]
[DEBUG] Configuring mojo 'org.apache.maven.plugins:maven-compiler-plugin:2.0.2:testCompile' with basic configurator -->
[DEBUG] (f) basedir = <https://builds.apache.org/job/HBase-0.92/ws/trunk>
[DEBUG] (f) buildDirectory = <https://builds.apache.org/job/HBase-0.92/ws/trunk/target>
[DEBUG] (f) classpathElements = [<https://builds.apache.org/job/HBase-0.92/ws/trunk/target/test-classes,> <https://builds.apache.org/job/HBase-0.92/ws/trunk/target/classes,> /home/jenkins/.m2/repository/com/google/guava/guava/r09/guava-r09.jar, /home/jenkins/.m2/repository/commons-cli/commons-cli/1.2/commons-cli-1.2.jar, /home/jenkins/.m2/repository/commons-configuration/commons-configuration/1.6/commons-configuration-1.6.jar, /home/jenkins/.m2/repository/commons-collections/commons-collections/3.2.1/commons-collections-3.2.1.jar, /home/jenkins/.m2/repository/commons-digester/commons-digester/1.8/commons-digester-1.8.jar, /home/jenkins/.m2/repository/commons-beanutils/commons-beanutils/1.7.0/commons-beanutils-1.7.0.jar, /home/jenkins/.m2/repository/commons-beanutils/commons-beanutils-core/1.8.0/commons-beanutils-core-1.8.0.jar, /home/jenkins/.m2/repository/com/github/stephenc/high-scale-lib/high-scale-lib/1.1.1/high-scale-lib-1.1.1.jar, /home/jenkins/.m2/repository/commons-codec/commons-codec/1.4/commons-codec-1.4.jar, /home/jenkins/.m2/repository/commons-httpclient/commons-httpclient/3.1/commons-httpclient-3.1.jar, /home/jenkins/.m2/repository/commons-lang/commons-lang/2.5/commons-lang-2.5.jar, /home/jenkins/.m2/repository/commons-logging/commons-logging/1.1.1/commons-logging-1.1.1.jar, /home/jenkins/.m2/repository/log4j/log4j/1.2.16/log4j-1.2.16.jar, /home/jenkins/.m2/repository/org/apache/avro/avro/1.5.3/avro-1.5.3.jar, /home/jenkins/.m2/repository/org/xerial/snappy/snappy-java/1.0.3.2/snappy-java-1.0.3.2.jar, /home/jenkins/.m2/repository/org/apache/avro/avro-ipc/1.5.3/avro-ipc-1.5.3.jar, /home/jenkins/.m2/repository/org/jboss/netty/netty/3.2.4.Final/netty-3.2.4.Final.jar, /home/jenkins/.m2/repository/org/apache/velocity/velocity/1.7/velocity-1.7.jar, /home/jenkins/.m2/repository/org/apache/zookeeper/zookeeper/3.4.3/zookeeper-3.4.3.jar, /home/jenkins/.m2/repository/org/apache/thrift/libthrift/0.7.0/libthrift-0.7.0.jar, /home/jenkins/.m2/repository/javax/servlet/servlet-api/2.5/servlet-api-2.5.jar, /home/jenkins/.m2/repository/org/apache/httpcomponents/httpclient/4.0.1/httpclient-4.0.1.jar, /home/jenkins/.m2/repository/org/apache/httpcomponents/httpcore/4.0.1/httpcore-4.0.1.jar, /home/jenkins/.m2/repository/org/jruby/jruby-complete/1.6.5/jruby-complete-1.6.5.jar, /home/jenkins/.m2/repository/org/mortbay/jetty/jetty/6.1.26/jetty-6.1.26.jar, /home/jenkins/.m2/repository/org/mortbay/jetty/jetty-util/6.1.26/jetty-util-6.1.26.jar, /home/jenkins/.m2/repository/org/mortbay/jetty/jsp-2.1/6.1.14/jsp-2.1-6.1.14.jar, /home/jenkins/.m2/repository/org/eclipse/jdt/core/3.1.1/core-3.1.1.jar, /home/jenkins/.m2/repository/org/mortbay/jetty/jsp-api-2.1/6.1.14/jsp-api-2.1-6.1.14.jar, /home/jenkins/.m2/repository/org/mortbay/jetty/servlet-api-2.5/6.1.14/servlet-api-2.5-6.1.14.jar, /home/jenkins/.m2/repository/org/codehaus/jackson/jackson-core-asl/1.5.5/jackson-core-asl-1.5.5.jar, /home/jenkins/.m2/repository/org/codehaus/jackson/jackson-mapper-asl/1.5.5/jackson-mapper-asl-1.5.5.jar, /home/jenkins/.m2/repository/org/codehaus/jackson/jackson-jaxrs/1.5.5/jackson-jaxrs-1.5.5.jar, /home/jenkins/.m2/repository/org/codehaus/jackson/jackson-xc/1.5.5/jackson-xc-1.5.5.jar, /home/jenkins/.m2/repository/org/slf4j/slf4j-api/1.5.8/slf4j-api-1.5.8.jar, /home/jenkins/.m2/repository/org/slf4j/slf4j-log4j12/1.5.8/slf4j-log4j12-1.5.8.jar, /home/jenkins/.m2/repository/tomcat/jasper-compiler/5.5.23/jasper-compiler-5.5.23.jar, /home/jenkins/.m2/repository/tomcat/jasper-runtime/5.5.23/jasper-runtime-5.5.23.jar, /home/jenkins/.m2/repository/commons-el/commons-el/1.0/commons-el-1.0.jar, /home/jenkins/.m2/repository/org/jamon/jamon-runtime/2.3.1/jamon-runtime-2.3.1.jar, /home/jenkins/.m2/repository/com/google/protobuf/protobuf-java/2.4.0a/protobuf-java-2.4.0a.jar, /home/jenkins/.m2/repository/com/sun/jersey/jersey-core/1.4/jersey-core-1.4.jar, /home/jenkins/.m2/repository/com/sun/jersey/jersey-json/1.4/jersey-json-1.4.jar, /home/jenkins/.m2/repository/org/codehaus/jettison/jettison/1.1/jettison-1.1.jar, /home/jenkins/.m2/repository/com/sun/xml/bind/jaxb-impl/2.1.12/jaxb-impl-2.1.12.jar, /home/jenkins/.m2/repository/com/sun/jersey/jersey-server/1.4/jersey-server-1.4.jar, /home/jenkins/.m2/repository/asm/asm/3.1/asm-3.1.jar, /home/jenkins/.m2/repository/javax/xml/bind/jaxb-api/2.1/jaxb-api-2.1.jar, /home/jenkins/.m2/repository/javax/activation/activation/1.1/activation-1.1.jar, /home/jenkins/.m2/repository/stax/stax-api/1.0.1/stax-api-1.0.1.jar, /home/jenkins/.m2/repository/junit/junit/4.10/junit-4.10.jar, /home/jenkins/.m2/repository/org/hamcrest/hamcrest-core/1.1/hamcrest-core-1.1.jar, /home/jenkins/.m2/repository/org/mockito/mockito-all/1.8.5/mockito-all-1.8.5.jar, /home/jenkins/.m2/repository/org/apache/commons/commons-math/2.1/commons-math-2.1.jar, /home/jenkins/.m2/repository/org/apache/hadoop/hadoop-core/1.0.0/hadoop-core-1.0.0.jar, /home/jenkins/.m2/repository/xmlenc/xmlenc/0.52/xmlenc-0.52.jar, /home/jenkins/.m2/repository/commons-net/commons-net/1.4.1/commons-net-1.4.1.jar, /home/jenkins/.m2/repository/org/apache/hadoop/hadoop-test/1.0.0/hadoop-test-1.0.0.jar, /home/jenkins/.m2/repository/org/apache/ftpserver/ftplet-api/1.0.0/ftplet-api-1.0.0.jar, /home/jenkins/.m2/repository/org/apache/mina/mina-core/2.0.0-M5/mina-core-2.0.0-M5.jar, /home/jenkins/.m2/repository/org/apache/ftpserver/ftpserver-core/1.0.0/ftpserver-core-1.0.0.jar, /home/jenkins/.m2/repository/org/apache/ftpserver/ftpserver-deprecated/1.0.0-M2/ftpserver-deprecated-1.0.0-M2.jar]
[DEBUG] (f) compileSourceRoots = [<https://builds.apache.org/job/HBase-0.92/ws/trunk/src/test/java]>
[DEBUG] (f) compilerId = javac
[DEBUG] (f) debug = true
[DEBUG] (f) encoding = UTF-8
[DEBUG] (f) failOnError = true
[DEBUG] (f) fork = false
[DEBUG] (f) optimize = false
[DEBUG] (f) outputDirectory = <https://builds.apache.org/job/HBase-0.92/ws/trunk/target/test-classes>
[DEBUG] (f) outputFileName = hbase-0.92.2-SNAPSHOT
[DEBUG] (f) showDeprecation = false
[DEBUG] (f) showWarnings = true
[DEBUG] (f) source = 1.6
[DEBUG] (f) staleMillis = 0
[DEBUG] (f) target = 1.6
[DEBUG] (f) verbose = false
[DEBUG] -- end configuration --
[DEBUG] Using compiler 'javac'.
[DEBUG] Source directories: [<https://builds.apache.org/job/HBase-0.92/ws/trunk/src/test/java]>
[DEBUG] Classpath: [<https://builds.apache.org/job/HBase-0.92/ws/trunk/target/test-classes>
<https://builds.apache.org/job/HBase-0.92/ws/trunk/target/classes>
/home/jenkins/.m2/repository/com/google/guava/guava/r09/guava-r09.jar
/home/jenkins/.m2/repository/commons-cli/commons-cli/1.2/commons-cli-1.2.jar
/home/jenkins/.m2/repository/commons-configuration/commons-configuration/1.6/commons-configuration-1.6.jar
/home/jenkins/.m2/repository/commons-collections/commons-collections/3.2.1/commons-collections-3.2.1.jar
/home/jenkins/.m2/repository/commons-digester/commons-digester/1.8/commons-digester-1.8.jar
/home/jenkins/.m2/repository/commons-beanutils/commons-beanutils/1.7.0/commons-beanutils-1.7.0.jar
/home/jenkins/.m2/repository/commons-beanutils/commons-beanutils-core/1.8.0/commons-beanutils-core-1.8.0.jar
/home/jenkins/.m2/repository/com/github/stephenc/high-scale-lib/high-scale-lib/1.1.1/high-scale-lib-1.1.1.jar
/home/jenkins/.m2/repository/commons-codec/commons-codec/1.4/commons-codec-1.4.jar
/home/jenkins/.m2/repository/commons-httpclient/commons-httpclient/3.1/commons-httpclient-3.1.jar
/home/jenkins/.m2/repository/commons-lang/commons-lang/2.5/commons-lang-2.5.jar
/home/jenkins/.m2/repository/commons-logging/commons-logging/1.1.1/commons-logging-1.1.1.jar
/home/jenkins/.m2/repository/log4j/log4j/1.2.16/log4j-1.2.16.jar
/home/jenkins/.m2/repository/org/apache/avro/avro/1.5.3/avro-1.5.3.jar
/home/jenkins/.m2/repository/org/xerial/snappy/snappy-java/1.0.3.2/snappy-java-1.0.3.2.jar
/home/jenkins/.m2/repository/org/apache/avro/avro-ipc/1.5.3/avro-ipc-1.5.3.jar
/home/jenkins/.m2/repository/org/jboss/netty/netty/3.2.4.Final/netty-3.2.4.Final.jar
/home/jenkins/.m2/repository/org/apache/velocity/velocity/1.7/velocity-1.7.jar
/home/jenkins/.m2/repository/org/apache/zookeeper/zookeeper/3.4.3/zookeeper-3.4.3.jar
/home/jenkins/.m2/repository/org/apache/thrift/libthrift/0.7.0/libthrift-0.7.0.jar
/home/jenkins/.m2/repository/javax/servlet/servlet-api/2.5/servlet-api-2.5.jar
/home/jenkins/.m2/repository/org/apache/httpcomponents/httpclient/4.0.1/httpclient-4.0.1.jar
/home/jenkins/.m2/repository/org/apache/httpcomponents/httpcore/4.0.1/httpcore-4.0.1.jar
/home/jenkins/.m2/repository/org/jruby/jruby-complete/1.6.5/jruby-complete-1.6.5.jar
/home/jenkins/.m2/repository/org/mortbay/jetty/jetty/6.1.26/jetty-6.1.26.jar
/home/jenkins/.m2/repository/org/mortbay/jetty/jetty-util/6.1.26/jetty-util-6.1.26.jar
/home/jenkins/.m2/repository/org/mortbay/jetty/jsp-2.1/6.1.14/jsp-2.1-6.1.14.jar
/home/jenkins/.m2/repository/org/eclipse/jdt/core/3.1.1/core-3.1.1.jar
/home/jenkins/.m2/repository/org/mortbay/jetty/jsp-api-2.1/6.1.14/jsp-api-2.1-6.1.14.jar
/home/jenkins/.m2/repository/org/mortbay/jetty/servlet-api-2.5/6.1.14/servlet-api-2.5-6.1.14.jar
/home/jenkins/.m2/repository/org/codehaus/jackson/jackson-core-asl/1.5.5/jackson-core-asl-1.5.5.jar
/home/jenkins/.m2/repository/org/codehaus/jackson/jackson-mapper-asl/1.5.5/jackson-mapper-asl-1.5.5.jar
/home/jenkins/.m2/repository/org/codehaus/jackson/jackson-jaxrs/1.5.5/jackson-jaxrs-1.5.5.jar
/home/jenkins/.m2/repository/org/codehaus/jackson/jackson-xc/1.5.5/jackson-xc-1.5.5.jar
/home/jenkins/.m2/repository/org/slf4j/slf4j-api/1.5.8/slf4j-api-1.5.8.jar
/home/jenkins/.m2/repository/org/slf4j/slf4j-log4j12/1.5.8/slf4j-log4j12-1.5.8.jar
/home/jenkins/.m2/repository/tomcat/jasper-compiler/5.5.23/jasper-compiler-5.5.23.jar
/home/jenkins/.m2/repository/tomcat/jasper-runtime/5.5.23/jasper-runtime-5.5.23.jar
/home/jenkins/.m2/repository/commons-el/commons-el/1.0/commons-el-1.0.jar
/home/jenkins/.m2/repository/org/jamon/jamon-runtime/2.3.1/jamon-runtime-2.3.1.jar
/home/jenkins/.m2/repository/com/google/protobuf/protobuf-java/2.4.0a/protobuf-java-2.4.0a.jar
/home/jenkins/.m2/repository/com/sun/jersey/jersey-core/1.4/jersey-core-1.4.jar
/home/jenkins/.m2/repository/com/sun/jersey/jersey-json/1.4/jersey-json-1.4.jar
/home/jenkins/.m2/repository/org/codehaus/jettison/jettison/1.1/jettison-1.1.jar
/home/jenkins/.m2/repository/com/sun/xml/bind/jaxb-impl/2.1.12/jaxb-impl-2.1.12.jar
/home/jenkins/.m2/repository/com/sun/jersey/jersey-server/1.4/jersey-server-1.4.jar
/home/jenkins/.m2/repository/asm/asm/3.1/asm-3.1.jar
/home/jenkins/.m2/repository/javax/xml/bind/jaxb-api/2.1/jaxb-api-2.1.jar
/home/jenkins/.m2/repository/javax/activation/activation/1.1/activation-1.1.jar
/home/jenkins/.m2/repository/stax/stax-api/1.0.1/stax-api-1.0.1.jar
/home/jenkins/.m2/repository/junit/junit/4.10/junit-4.10.jar
/home/jenkins/.m2/repository/org/hamcrest/hamcrest-core/1.1/hamcrest-core-1.1.jar
/home/jenkins/.m2/repository/org/mockito/mockito-all/1.8.5/mockito-all-1.8.5.jar
/home/jenkins/.m2/repository/org/apache/commons/commons-math/2.1/commons-math-2.1.jar
/home/jenkins/.m2/repository/org/apache/hadoop/hadoop-core/1.0.0/hadoop-core-1.0.0.jar
/home/jenkins/.m2/repository/xmlenc/xmlenc/0.52/xmlenc-0.52.jar
/home/jenkins/.m2/repository/commons-net/commons-net/1.4.1/commons-net-1.4.1.jar
/home/jenkins/.m2/repository/org/apache/hadoop/hadoop-test/1.0.0/hadoop-test-1.0.0.jar
/home/jenkins/.m2/repository/org/apache/ftpserver/ftplet-api/1.0.0/ftplet-api-1.0.0.jar
/home/jenkins/.m2/repository/org/apache/mina/mina-core/2.0.0-M5/mina-core-2.0.0-M5.jar
/home/jenkins/.m2/repository/org/apache/ftpserver/ftpserver-core/1.0.0/ftpserver-core-1.0.0.jar
/home/jenkins/.m2/repository/org/apache/ftpserver/ftpserver-deprecated/1.0.0-M2/ftpserver-deprecated-1.0.0-M2.jar]
[DEBUG] Output directory: <https://builds.apache.org/job/HBase-0.92/ws/trunk/target/test-classes>
[DEBUG] Classpath:
[DEBUG] <https://builds.apache.org/job/HBase-0.92/ws/trunk/target/test-classes>
[DEBUG] <https://builds.apache.org/job/HBase-0.92/ws/trunk/target/classes>
[DEBUG] /home/jenkins/.m2/repository/com/google/guava/guava/r09/guava-r09.jar
[DEBUG] /home/jenkins/.m2/repository/commons-cli/commons-cli/1.2/commons-cli-1.2.jar
[DEBUG] /home/jenkins/.m2/repository/commons-configuration/commons-configuration/1.6/commons-configuration-1.6.jar
[DEBUG] /home/jenkins/.m2/repository/commons-collections/commons-collections/3.2.1/commons-collections-3.2.1.jar
[DEBUG] /home/jenkins/.m2/repository/commons-digester/commons-digester/1.8/commons-digester-1.8.jar
[DEBUG] /home/jenkins/.m2/repository/commons-beanutils/commons-beanutils/1.7.0/commons-beanutils-1.7.0.jar
[DEBUG] /home/jenkins/.m2/repository/commons-beanutils/commons-beanutils-core/1.8.0/commons-beanutils-core-1.8.0.jar
[DEBUG] /home/jenkins/.m2/repository/com/github/stephenc/high-scale-lib/high-scale-lib/1.1.1/high-scale-lib-1.1.1.jar
[DEBUG] /home/jenkins/.m2/repository/commons-codec/commons-codec/1.4/commons-codec-1.4.jar
[DEBUG] /home/jenkins/.m2/repository/commons-httpclient/commons-httpclient/3.1/commons-httpclient-3.1.jar
[DEBUG] /home/jenkins/.m2/repository/commons-lang/commons-lang/2.5/commons-lang-2.5.jar
[DEBUG] /home/jenkins/.m2/repository/commons-logging/commons-logging/1.1.1/commons-logging-1.1.1.jar
[DEBUG] /home/jenkins/.m2/repository/log4j/log4j/1.2.16/log4j-1.2.16.jar
[DEBUG] /home/jenkins/.m2/repository/org/apache/avro/avro/1.5.3/avro-1.5.3.jar
[DEBUG] /home/jenkins/.m2/repository/org/xerial/snappy/snappy-java/1.0.3.2/snappy-java-1.0.3.2.jar
[DEBUG] /home/jenkins/.m2/repository/org/apache/avro/avro-ipc/1.5.3/avro-ipc-1.5.3.jar
[DEBUG] /home/jenkins/.m2/repository/org/jboss/netty/netty/3.2.4.Final/netty-3.2.4.Final.jar
[DEBUG] /home/jenkins/.m2/repository/org/apache/velocity/velocity/1.7/velocity-1.7.jar
[DEBUG] /home/jenkins/.m2/repository/org/apache/zookeeper/zookeeper/3.4.3/zookeeper-3.4.3.jar
[DEBUG] /home/jenkins/.m2/repository/org/apache/thrift/libthrift/0.7.0/libthrift-0.7.0.jar
[DEBUG] /home/jenkins/.m2/repository/javax/servlet/servlet-api/2.5/servlet-api-2.5.jar
[DEBUG] /home/jenkins/.m2/repository/org/apache/httpcomponents/httpclient/4.0.1/httpclient-4.0.1.jar
[DEBUG] /home/jenkins/.m2/repository/org/apache/httpcomponents/httpcore/4.0.1/httpcore-4.0.1.jar
[DEBUG] /home/jenkins/.m2/repository/org/jruby/jruby-complete/1.6.5/jruby-complete-1.6.5.jar
[DEBUG] /home/jenkins/.m2/repository/org/mortbay/jetty/jetty/6.1.26/jetty-6.1.26.jar
[DEBUG] /home/jenkins/.m2/repository/org/mortbay/jetty/jetty-util/6.1.26/jetty-util-6.1.26.jar
[DEBUG] /home/jenkins/.m2/repository/org/mortbay/jetty/jsp-2.1/6.1.14/jsp-2.1-6.1.14.jar
[DEBUG] /home/jenkins/.m2/repository/org/eclipse/jdt/core/3.1.1/core-3.1.1.jar
[DEBUG] /home/jenkins/.m2/repository/org/mortbay/jetty/jsp-api-2.1/6.1.14/jsp-api-2.1-6.1.14.jar
[DEBUG] /home/jenkins/.m2/repository/org/mortbay/jetty/servlet-api-2.5/6.1.14/servlet-api-2.5-6.1.14.jar
[DEBUG] /home/jenkins/.m2/repository/org/codehaus/jackson/jackson-core-asl/1.5.5/jackson-core-asl-1.5.5.jar
[DEBUG] /home/jenkins/.m2/repository/org/codehaus/jackson/jackson-mapper-asl/1.5.5/jackson-mapper-asl-1.5.5.jar
[DEBUG] /home/jenkins/.m2/repository/org/codehaus/jackson/jackson-jaxrs/1.5.5/jackson-jaxrs-1.5.5.jar
[DEBUG] /home/jenkins/.m2/repository/org/codehaus/jackson/jackson-xc/1.5.5/jackson-xc-1.5.5.jar
[DEBUG] /home/jenkins/.m2/repository/org/slf4j/slf4j-api/1.5.8/slf4j-api-1.5.8.jar
[DEBUG] /home/jenkins/.m2/repository/org/slf4j/slf4j-log4j12/1.5.8/slf4j-log4j12-1.5.8.jar
[DEBUG] /home/jenkins/.m2/repository/tomcat/jasper-compiler/5.5.23/jasper-compiler-5.5.23.jar
[DEBUG] /home/jenkins/.m2/repository/tomcat/jasper-runtime/5.5.23/jasper-runtime-5.5.23.jar
[DEBUG] /home/jenkins/.m2/repository/commons-el/commons-el/1.0/commons-el-1.0.jar
[DEBUG] /home/jenkins/.m2/repository/org/jamon/jamon-runtime/2.3.1/jamon-runtime-2.3.1.jar
[DEBUG] /home/jenkins/.m2/repository/com/google/protobuf/protobuf-java/2.4.0a/protobuf-java-2.4.0a.jar
[DEBUG] /home/jenkins/.m2/repository/com/sun/jersey/jersey-core/1.4/jersey-core-1.4.jar
[DEBUG] /home/jenkins/.m2/repository/com/sun/jersey/jersey-json/1.4/jersey-json-1.4.jar
[DEBUG] /home/jenkins/.m2/repository/org/codehaus/jettison/jettison/1.1/jettison-1.1.jar
[DEBUG] /home/jenkins/.m2/repository/com/sun/xml/bind/jaxb-impl/2.1.12/jaxb-impl-2.1.12.jar
[DEBUG] /home/jenkins/.m2/repository/com/sun/jersey/jersey-server/1.4/jersey-server-1.4.jar
[DEBUG] /home/jenkins/.m2/repository/asm/asm/3.1/asm-3.1.jar
[DEBUG] /home/jenkins/.m2/repository/javax/xml/bind/jaxb-api/2.1/jaxb-api-2.1.jar
[DEBUG] /home/jenkins/.m2/repository/javax/activation/activation/1.1/activation-1.1.jar
[DEBUG] /home/jenkins/.m2/repository/stax/stax-api/1.0.1/stax-api-1.0.1.jar
[DEBUG] /home/jenkins/.m2/repository/junit/junit/4.10/junit-4.10.jar
[DEBUG] /home/jenkins/.m2/repository/org/hamcrest/hamcrest-core/1.1/hamcrest-core-1.1.jar
[DEBUG] /home/jenkins/.m2/repository/org/mockito/mockito-all/1.8.5/mockito-all-1.8.5.jar
[DEBUG] /home/jenkins/.m2/repository/org/apache/commons/commons-math/2.1/commons-math-2.1.jar
[DEBUG] /home/jenkins/.m2/repository/org/apache/hadoop/hadoop-core/1.0.0/hadoop-core-1.0.0.jar
[DEBUG] /home/jenkins/.m2/repository/xmlenc/xmlenc/0.52/xmlenc-0.52.jar
[DEBUG] /home/jenkins/.m2/repository/commons-net/commons-net/1.4.1/commons-net-1.4.1.jar
[DEBUG] /home/jenkins/.m2/repository/org/apache/hadoop/hadoop-test/1.0.0/hadoop-test-1.0.0.jar
[DEBUG] /home/jenkins/.m2/repository/org/apache/ftpserver/ftplet-api/1.0.0/ftplet-api-1.0.0.jar
[DEBUG] /home/jenkins/.m2/repository/org/apache/mina/mina-core/2.0.0-M5/mina-core-2.0.0-M5.jar
[DEBUG] /home/jenkins/.m2/repository/org/apache/ftpserver/ftpserver-core/1.0.0/ftpserver-core-1.0.0.jar
[DEBUG] /home/jenkins/.m2/repository/org/apache/ftpserver/ftpserver-deprecated/1.0.0-M2/ftpserver-deprecated-1.0.0-M2.jar
[DEBUG] Source roots:
[DEBUG] <https://builds.apache.org/job/HBase-0.92/ws/trunk/src/test/java>
[INFO] Compiling 283 source files to <https://builds.apache.org/job/HBase-0.92/ws/trunk/target/test-classes>
[INFO] ------------------------------------------------------------------------
[INFO] BUILD FAILURE
[INFO] ------------------------------------------------------------------------
[INFO] Total time: 43.095s
[INFO] Finished at: Thu Apr 05 21:43:09 UTC 2012
[INFO] Final Memory: 46M/683M
[INFO] ------------------------------------------------------------------------
[ERROR] Failed to execute goal org.apache.maven.plugins:maven-compiler-plugin:2.0.2:testCompile (default-testCompile) on project hbase: Compilation failure
[ERROR] <https://builds.apache.org/job/HBase-0.92/ws/trunk/src/test/java/org/apache/hadoop/hbase/TestKeyValue.java>:[402,64] cannot find symbol
[ERROR] symbol : variable WritableUtils
[ERROR] location: class org.apache.hadoop.hbase.TestKeyValue
[ERROR] -> [Help 1]
org.apache.maven.lifecycle.LifecycleExecutionException: Failed to execute goal org.apache.maven.plugins:maven-compiler-plugin:2.0.2:testCompile (default-testCompile) on project hbase: Compilation failure
<https://builds.apache.org/job/HBase-0.92/ws/trunk/src/test/java/org/apache/hadoop/hbase/TestKeyValue.java>:[402,64] cannot find symbol
symbol : variable WritableUtils
location: class org.apache.hadoop.hbase.TestKeyValue
at org.apache.maven.lifecycle.internal.MojoExecutor.execute(MojoExecutor.java:213)
at org.apache.maven.lifecycle.internal.MojoExecutor.execute(MojoExecutor.java:153)
at org.apache.maven.lifecycle.internal.MojoExecutor.execute(MojoExecutor.java:145)
at org.apache.maven.lifecycle.internal.LifecycleModuleBuilder.buildProject(LifecycleModuleBuilder.java:84)
at org.apache.maven.lifecycle.internal.LifecycleModuleBuilder.buildProject(LifecycleModuleBuilder.java:59)
at org.apache.maven.lifecycle.internal.LifecycleStarter.singleThreadedBuild(LifecycleStarter.java:183)
at org.apache.maven.lifecycle.internal.LifecycleStarter.execute(LifecycleStarter.java:161)
at org.apache.maven.DefaultMaven.doExecute(DefaultMaven.java:319)
at org.apache.maven.DefaultMaven.execute(DefaultMaven.java:156)
at org.apache.maven.cli.MavenCli.execute(MavenCli.java:537)
at org.apache.maven.cli.MavenCli.doMain(MavenCli.java:196)
at org.apache.maven.cli.MavenCli.main(MavenCli.java:141)
at sun.reflect.NativeMethodAccessorImpl.invoke0(Native Method)
at sun.reflect.NativeMethodAccessorImpl.invoke(NativeMethodAccessorImpl.java:39)
at sun.reflect.DelegatingMethodAccessorImpl.invoke(DelegatingMethodAccessorImpl.java:25)
at java.lang.reflect.Method.invoke(Method.java:597)
at org.codehaus.plexus.classworlds.launcher.Launcher.launchEnhanced(Launcher.java:290)
at org.codehaus.plexus.classworlds.launcher.Launcher.launch(Launcher.java:230)
at org.codehaus.plexus.classworlds.launcher.Launcher.mainWithExitCode(Launcher.java:409)
at org.codehaus.plexus.classworlds.launcher.Launcher.main(Launcher.java:352)
Caused by: org.apache.maven.plugin.CompilationFailureException: Compilation failure
<https://builds.apache.org/job/HBase-0.92/ws/trunk/src/test/java/org/apache/hadoop/hbase/TestKeyValue.java>:[402,64] cannot find symbol
symbol : variable WritableUtils
location: class org.apache.hadoop.hbase.TestKeyValue
at org.apache.maven.plugin.AbstractCompilerMojo.execute(AbstractCompilerMojo.java:516)
at org.apache.maven.plugin.TestCompilerMojo.execute(TestCompilerMojo.java:102)
at org.apache.maven.plugin.DefaultBuildPluginManager.executeMojo(DefaultBuildPluginManager.java:101)
at org.apache.maven.lifecycle.internal.MojoExecutor.execute(MojoExecutor.java:209)
... 19 more
[ERROR]
[ERROR]
[ERROR] For more information about the errors and possible solutions, please read the following articles:
[ERROR] [Help 1] http://cwiki.apache.org/confluence/display/MAVEN/MojoFailureException
Build step 'Invoke top-level Maven targets' marked build as failure
Archiving artifacts
Updating HBASE-5711
Updating HBASE-5724
Recording test results
Build failed in Jenkins: HBase-0.92 #355
Posted by Apache Jenkins Server <je...@builds.apache.org>.
See <https://builds.apache.org/job/HBase-0.92/355/>
------------------------------------------
[...truncated 7017 lines...]
Forking command line: /bin/sh -c cd <https://builds.apache.org/job/HBase-0.92/ws/trunk> && /home/jenkins/tools/java/jdk1.6.0_27-32/jre/bin/java -enableassertions -Xmx1400m -Djava.security.egd=file:/dev/./urandom -jar <https://builds.apache.org/job/HBase-0.92/ws/trunk/target/surefire/surefirebooter317982838169749080.jar> <https://builds.apache.org/job/HBase-0.92/ws/trunk/target/surefire/surefire1478220348665020089tmp> <https://builds.apache.org/job/HBase-0.92/ws/trunk/target/surefire/surefire6053226463012048731tmp>
Running org.apache.hadoop.hbase.executor.TestExecutorService
Tests run: 1, Failures: 0, Errors: 0, Skipped: 0, Time elapsed: 2.442 sec
Forking command line: /bin/sh -c cd <https://builds.apache.org/job/HBase-0.92/ws/trunk> && /home/jenkins/tools/java/jdk1.6.0_27-32/jre/bin/java -enableassertions -Xmx1400m -Djava.security.egd=file:/dev/./urandom -jar <https://builds.apache.org/job/HBase-0.92/ws/trunk/target/surefire/surefirebooter3657538755298914237.jar> <https://builds.apache.org/job/HBase-0.92/ws/trunk/target/surefire/surefire580411205851829055tmp> <https://builds.apache.org/job/HBase-0.92/ws/trunk/target/surefire/surefire184308921012319217tmp>
Running org.apache.hadoop.hbase.rest.TestGzipFilter
Tests run: 3, Failures: 0, Errors: 0, Skipped: 0, Time elapsed: 20.291 sec
Forking command line: /bin/sh -c cd <https://builds.apache.org/job/HBase-0.92/ws/trunk> && /home/jenkins/tools/java/jdk1.6.0_27-32/jre/bin/java -enableassertions -Xmx1400m -Djava.security.egd=file:/dev/./urandom -jar <https://builds.apache.org/job/HBase-0.92/ws/trunk/target/surefire/surefirebooter133649274919913937.jar> <https://builds.apache.org/job/HBase-0.92/ws/trunk/target/surefire/surefire3810828195798462028tmp> <https://builds.apache.org/job/HBase-0.92/ws/trunk/target/surefire/surefire2340486495027337592tmp>
Running org.apache.hadoop.hbase.rest.TestMultiRowResource
Tests run: 3, Failures: 0, Errors: 0, Skipped: 0, Time elapsed: 19.409 sec
Forking command line: /bin/sh -c cd <https://builds.apache.org/job/HBase-0.92/ws/trunk> && /home/jenkins/tools/java/jdk1.6.0_27-32/jre/bin/java -enableassertions -Xmx1400m -Djava.security.egd=file:/dev/./urandom -jar <https://builds.apache.org/job/HBase-0.92/ws/trunk/target/surefire/surefirebooter4107905443694922392.jar> <https://builds.apache.org/job/HBase-0.92/ws/trunk/target/surefire/surefire6645597464140396673tmp> <https://builds.apache.org/job/HBase-0.92/ws/trunk/target/surefire/surefire3388237948658064631tmp>
Running org.apache.hadoop.hbase.rest.TestScannersWithFilters
Tests run: 10, Failures: 0, Errors: 0, Skipped: 0, Time elapsed: 22.651 sec
Forking command line: /bin/sh -c cd <https://builds.apache.org/job/HBase-0.92/ws/trunk> && /home/jenkins/tools/java/jdk1.6.0_27-32/jre/bin/java -enableassertions -Xmx1400m -Djava.security.egd=file:/dev/./urandom -jar <https://builds.apache.org/job/HBase-0.92/ws/trunk/target/surefire/surefirebooter2113167751931467717.jar> <https://builds.apache.org/job/HBase-0.92/ws/trunk/target/surefire/surefire4074069325946093057tmp> <https://builds.apache.org/job/HBase-0.92/ws/trunk/target/surefire/surefire2416666662756726605tmp>
Running org.apache.hadoop.hbase.rest.TestRowResource
Tests run: 11, Failures: 0, Errors: 0, Skipped: 0, Time elapsed: 21.979 sec
Forking command line: /bin/sh -c cd <https://builds.apache.org/job/HBase-0.92/ws/trunk> && /home/jenkins/tools/java/jdk1.6.0_27-32/jre/bin/java -enableassertions -Xmx1400m -Djava.security.egd=file:/dev/./urandom -jar <https://builds.apache.org/job/HBase-0.92/ws/trunk/target/surefire/surefirebooter5085498273777953516.jar> <https://builds.apache.org/job/HBase-0.92/ws/trunk/target/surefire/surefire7182933541379501856tmp> <https://builds.apache.org/job/HBase-0.92/ws/trunk/target/surefire/surefire4996499707781446198tmp>
Running org.apache.hadoop.hbase.rest.model.TestCellModel
Tests run: 3, Failures: 0, Errors: 0, Skipped: 0, Time elapsed: 0.375 sec
Forking command line: /bin/sh -c cd <https://builds.apache.org/job/HBase-0.92/ws/trunk> && /home/jenkins/tools/java/jdk1.6.0_27-32/jre/bin/java -enableassertions -Xmx1400m -Djava.security.egd=file:/dev/./urandom -jar <https://builds.apache.org/job/HBase-0.92/ws/trunk/target/surefire/surefirebooter2067846615898668805.jar> <https://builds.apache.org/job/HBase-0.92/ws/trunk/target/surefire/surefire4923308937242310963tmp> <https://builds.apache.org/job/HBase-0.92/ws/trunk/target/surefire/surefire8482047258795416520tmp>
Running org.apache.hadoop.hbase.rest.model.TestCellSetModel
Tests run: 3, Failures: 0, Errors: 0, Skipped: 0, Time elapsed: 0.415 sec
Forking command line: /bin/sh -c cd <https://builds.apache.org/job/HBase-0.92/ws/trunk> && /home/jenkins/tools/java/jdk1.6.0_27-32/jre/bin/java -enableassertions -Xmx1400m -Djava.security.egd=file:/dev/./urandom -jar <https://builds.apache.org/job/HBase-0.92/ws/trunk/target/surefire/surefirebooter4922521154521082686.jar> <https://builds.apache.org/job/HBase-0.92/ws/trunk/target/surefire/surefire2078341497665832903tmp> <https://builds.apache.org/job/HBase-0.92/ws/trunk/target/surefire/surefire1138874547781863563tmp>
Running org.apache.hadoop.hbase.rest.model.TestTableListModel
Tests run: 3, Failures: 0, Errors: 0, Skipped: 0, Time elapsed: 0.403 sec
Forking command line: /bin/sh -c cd <https://builds.apache.org/job/HBase-0.92/ws/trunk> && /home/jenkins/tools/java/jdk1.6.0_27-32/jre/bin/java -enableassertions -Xmx1400m -Djava.security.egd=file:/dev/./urandom -jar <https://builds.apache.org/job/HBase-0.92/ws/trunk/target/surefire/surefirebooter8961269434039288148.jar> <https://builds.apache.org/job/HBase-0.92/ws/trunk/target/surefire/surefire4565483534443773357tmp> <https://builds.apache.org/job/HBase-0.92/ws/trunk/target/surefire/surefire1626605840618903895tmp>
Running org.apache.hadoop.hbase.rest.model.TestVersionModel
Tests run: 3, Failures: 0, Errors: 0, Skipped: 0, Time elapsed: 0.381 sec
Forking command line: /bin/sh -c cd <https://builds.apache.org/job/HBase-0.92/ws/trunk> && /home/jenkins/tools/java/jdk1.6.0_27-32/jre/bin/java -enableassertions -Xmx1400m -Djava.security.egd=file:/dev/./urandom -jar <https://builds.apache.org/job/HBase-0.92/ws/trunk/target/surefire/surefirebooter5981458299075026664.jar> <https://builds.apache.org/job/HBase-0.92/ws/trunk/target/surefire/surefire4208231206252985782tmp> <https://builds.apache.org/job/HBase-0.92/ws/trunk/target/surefire/surefire6225151619153069569tmp>
Running org.apache.hadoop.hbase.rest.model.TestColumnSchemaModel
Tests run: 2, Failures: 0, Errors: 0, Skipped: 0, Time elapsed: 0.277 sec
Forking command line: /bin/sh -c cd <https://builds.apache.org/job/HBase-0.92/ws/trunk> && /home/jenkins/tools/java/jdk1.6.0_27-32/jre/bin/java -enableassertions -Xmx1400m -Djava.security.egd=file:/dev/./urandom -jar <https://builds.apache.org/job/HBase-0.92/ws/trunk/target/surefire/surefirebooter565021843180219380.jar> <https://builds.apache.org/job/HBase-0.92/ws/trunk/target/surefire/surefire2626642486346881929tmp> <https://builds.apache.org/job/HBase-0.92/ws/trunk/target/surefire/surefire993591541427529432tmp>
Running org.apache.hadoop.hbase.rest.model.TestTableInfoModel
Tests run: 3, Failures: 0, Errors: 0, Skipped: 0, Time elapsed: 0.409 sec
Forking command line: /bin/sh -c cd <https://builds.apache.org/job/HBase-0.92/ws/trunk> && /home/jenkins/tools/java/jdk1.6.0_27-32/jre/bin/java -enableassertions -Xmx1400m -Djava.security.egd=file:/dev/./urandom -jar <https://builds.apache.org/job/HBase-0.92/ws/trunk/target/surefire/surefirebooter591012912506365282.jar> <https://builds.apache.org/job/HBase-0.92/ws/trunk/target/surefire/surefire1568129698097454426tmp> <https://builds.apache.org/job/HBase-0.92/ws/trunk/target/surefire/surefire2335047159402066928tmp>
Running org.apache.hadoop.hbase.rest.model.TestRowModel
Tests run: 2, Failures: 0, Errors: 0, Skipped: 0, Time elapsed: 0.386 sec
Forking command line: /bin/sh -c cd <https://builds.apache.org/job/HBase-0.92/ws/trunk> && /home/jenkins/tools/java/jdk1.6.0_27-32/jre/bin/java -enableassertions -Xmx1400m -Djava.security.egd=file:/dev/./urandom -jar <https://builds.apache.org/job/HBase-0.92/ws/trunk/target/surefire/surefirebooter1017430353167631494.jar> <https://builds.apache.org/job/HBase-0.92/ws/trunk/target/surefire/surefire2549565955050416834tmp> <https://builds.apache.org/job/HBase-0.92/ws/trunk/target/surefire/surefire5142344622875778533tmp>
Running org.apache.hadoop.hbase.rest.model.TestTableSchemaModel
Tests run: 3, Failures: 0, Errors: 0, Skipped: 0, Time elapsed: 0.41 sec
Forking command line: /bin/sh -c cd <https://builds.apache.org/job/HBase-0.92/ws/trunk> && /home/jenkins/tools/java/jdk1.6.0_27-32/jre/bin/java -enableassertions -Xmx1400m -Djava.security.egd=file:/dev/./urandom -jar <https://builds.apache.org/job/HBase-0.92/ws/trunk/target/surefire/surefirebooter6861200472630920836.jar> <https://builds.apache.org/job/HBase-0.92/ws/trunk/target/surefire/surefire4405981953287012161tmp> <https://builds.apache.org/job/HBase-0.92/ws/trunk/target/surefire/surefire6441557213414429252tmp>
Running org.apache.hadoop.hbase.rest.model.TestStorageClusterVersionModel
Tests run: 2, Failures: 0, Errors: 0, Skipped: 0, Time elapsed: 0.276 sec
Forking command line: /bin/sh -c cd <https://builds.apache.org/job/HBase-0.92/ws/trunk> && /home/jenkins/tools/java/jdk1.6.0_27-32/jre/bin/java -enableassertions -Xmx1400m -Djava.security.egd=file:/dev/./urandom -jar <https://builds.apache.org/job/HBase-0.92/ws/trunk/target/surefire/surefirebooter4662395119914832762.jar> <https://builds.apache.org/job/HBase-0.92/ws/trunk/target/surefire/surefire5522616904527374426tmp> <https://builds.apache.org/job/HBase-0.92/ws/trunk/target/surefire/surefire6275312778083582383tmp>
Running org.apache.hadoop.hbase.rest.model.TestTableRegionModel
Tests run: 4, Failures: 0, Errors: 0, Skipped: 0, Time elapsed: 0.473 sec
Forking command line: /bin/sh -c cd <https://builds.apache.org/job/HBase-0.92/ws/trunk> && /home/jenkins/tools/java/jdk1.6.0_27-32/jre/bin/java -enableassertions -Xmx1400m -Djava.security.egd=file:/dev/./urandom -jar <https://builds.apache.org/job/HBase-0.92/ws/trunk/target/surefire/surefirebooter7062711217638813155.jar> <https://builds.apache.org/job/HBase-0.92/ws/trunk/target/surefire/surefire1430358802988877411tmp> <https://builds.apache.org/job/HBase-0.92/ws/trunk/target/surefire/surefire956789058752261305tmp>
Running org.apache.hadoop.hbase.rest.model.TestStorageClusterStatusModel
Tests run: 3, Failures: 0, Errors: 0, Skipped: 0, Time elapsed: 0.456 sec
Forking command line: /bin/sh -c cd <https://builds.apache.org/job/HBase-0.92/ws/trunk> && /home/jenkins/tools/java/jdk1.6.0_27-32/jre/bin/java -enableassertions -Xmx1400m -Djava.security.egd=file:/dev/./urandom -jar <https://builds.apache.org/job/HBase-0.92/ws/trunk/target/surefire/surefirebooter6570091880920596709.jar> <https://builds.apache.org/job/HBase-0.92/ws/trunk/target/surefire/surefire1873299232819681298tmp> <https://builds.apache.org/job/HBase-0.92/ws/trunk/target/surefire/surefire256999754225558282tmp>
Running org.apache.hadoop.hbase.rest.model.TestScannerModel
Tests run: 3, Failures: 0, Errors: 0, Skipped: 0, Time elapsed: 0.417 sec
Forking command line: /bin/sh -c cd <https://builds.apache.org/job/HBase-0.92/ws/trunk> && /home/jenkins/tools/java/jdk1.6.0_27-32/jre/bin/java -enableassertions -Xmx1400m -Djava.security.egd=file:/dev/./urandom -jar <https://builds.apache.org/job/HBase-0.92/ws/trunk/target/surefire/surefirebooter4893538196171995020.jar> <https://builds.apache.org/job/HBase-0.92/ws/trunk/target/surefire/surefire1760046327045560230tmp> <https://builds.apache.org/job/HBase-0.92/ws/trunk/target/surefire/surefire1476728400461600112tmp>
Running org.apache.hadoop.hbase.rest.client.TestRemoteAdmin
Tests run: 1, Failures: 0, Errors: 0, Skipped: 0, Time elapsed: 21.055 sec
Forking command line: /bin/sh -c cd <https://builds.apache.org/job/HBase-0.92/ws/trunk> && /home/jenkins/tools/java/jdk1.6.0_27-32/jre/bin/java -enableassertions -Xmx1400m -Djava.security.egd=file:/dev/./urandom -jar <https://builds.apache.org/job/HBase-0.92/ws/trunk/target/surefire/surefirebooter5634916479098923408.jar> <https://builds.apache.org/job/HBase-0.92/ws/trunk/target/surefire/surefire4328826356587537542tmp> <https://builds.apache.org/job/HBase-0.92/ws/trunk/target/surefire/surefire3965413224250095304tmp>
Running org.apache.hadoop.hbase.rest.client.TestRemoteTable
Tests run: 3, Failures: 0, Errors: 0, Skipped: 0, Time elapsed: 21.335 sec
Forking command line: /bin/sh -c cd <https://builds.apache.org/job/HBase-0.92/ws/trunk> && /home/jenkins/tools/java/jdk1.6.0_27-32/jre/bin/java -enableassertions -Xmx1400m -Djava.security.egd=file:/dev/./urandom -jar <https://builds.apache.org/job/HBase-0.92/ws/trunk/target/surefire/surefirebooter4459527857858256266.jar> <https://builds.apache.org/job/HBase-0.92/ws/trunk/target/surefire/surefire2518623819960057725tmp> <https://builds.apache.org/job/HBase-0.92/ws/trunk/target/surefire/surefire3874034587988797291tmp>
Running org.apache.hadoop.hbase.rest.TestVersionResource
Tests run: 7, Failures: 0, Errors: 0, Skipped: 0, Time elapsed: 16.98 sec
Forking command line: /bin/sh -c cd <https://builds.apache.org/job/HBase-0.92/ws/trunk> && /home/jenkins/tools/java/jdk1.6.0_27-32/jre/bin/java -enableassertions -Xmx1400m -Djava.security.egd=file:/dev/./urandom -jar <https://builds.apache.org/job/HBase-0.92/ws/trunk/target/surefire/surefirebooter8885791078134976407.jar> <https://builds.apache.org/job/HBase-0.92/ws/trunk/target/surefire/surefire8259022093666974914tmp> <https://builds.apache.org/job/HBase-0.92/ws/trunk/target/surefire/surefire5174860793342559576tmp>
Running org.apache.hadoop.hbase.rest.TestScannerResource
Tests run: 5, Failures: 0, Errors: 0, Skipped: 0, Time elapsed: 34.005 sec
Forking command line: /bin/sh -c cd <https://builds.apache.org/job/HBase-0.92/ws/trunk> && /home/jenkins/tools/java/jdk1.6.0_27-32/jre/bin/java -enableassertions -Xmx1400m -Djava.security.egd=file:/dev/./urandom -jar <https://builds.apache.org/job/HBase-0.92/ws/trunk/target/surefire/surefirebooter5513543145072280775.jar> <https://builds.apache.org/job/HBase-0.92/ws/trunk/target/surefire/surefire2032240571838873182tmp> <https://builds.apache.org/job/HBase-0.92/ws/trunk/target/surefire/surefire6314287867487047284tmp>
Running org.apache.hadoop.hbase.rest.TestTableResource
Tests run: 8, Failures: 0, Errors: 0, Skipped: 0, Time elapsed: 26.837 sec
Forking command line: /bin/sh -c cd <https://builds.apache.org/job/HBase-0.92/ws/trunk> && /home/jenkins/tools/java/jdk1.6.0_27-32/jre/bin/java -enableassertions -Xmx1400m -Djava.security.egd=file:/dev/./urandom -jar <https://builds.apache.org/job/HBase-0.92/ws/trunk/target/surefire/surefirebooter6578095575954883561.jar> <https://builds.apache.org/job/HBase-0.92/ws/trunk/target/surefire/surefire7897935142062184799tmp> <https://builds.apache.org/job/HBase-0.92/ws/trunk/target/surefire/surefire1628476291995554275tmp>
Running org.apache.hadoop.hbase.rest.TestStatusResource
Tests run: 2, Failures: 0, Errors: 0, Skipped: 0, Time elapsed: 17.886 sec
Forking command line: /bin/sh -c cd <https://builds.apache.org/job/HBase-0.92/ws/trunk> && /home/jenkins/tools/java/jdk1.6.0_27-32/jre/bin/java -enableassertions -Xmx1400m -Djava.security.egd=file:/dev/./urandom -jar <https://builds.apache.org/job/HBase-0.92/ws/trunk/target/surefire/surefirebooter4562994235968320305.jar> <https://builds.apache.org/job/HBase-0.92/ws/trunk/target/surefire/surefire6099141354281425792tmp> <https://builds.apache.org/job/HBase-0.92/ws/trunk/target/surefire/surefire646575134883862087tmp>
Running org.apache.hadoop.hbase.rest.TestSchemaResource
Tests run: 2, Failures: 0, Errors: 0, Skipped: 0, Time elapsed: 25.961 sec
Forking command line: /bin/sh -c cd <https://builds.apache.org/job/HBase-0.92/ws/trunk> && /home/jenkins/tools/java/jdk1.6.0_27-32/jre/bin/java -enableassertions -Xmx1400m -Djava.security.egd=file:/dev/./urandom -jar <https://builds.apache.org/job/HBase-0.92/ws/trunk/target/surefire/surefirebooter7814476148678668790.jar> <https://builds.apache.org/job/HBase-0.92/ws/trunk/target/surefire/surefire2307989066331086906tmp> <https://builds.apache.org/job/HBase-0.92/ws/trunk/target/surefire/surefire7075923131351494748tmp>
Running org.apache.hadoop.hbase.thrift.TestThriftServer
Tests run: 1, Failures: 0, Errors: 0, Skipped: 0, Time elapsed: 23.925 sec
Forking command line: /bin/sh -c cd <https://builds.apache.org/job/HBase-0.92/ws/trunk> && /home/jenkins/tools/java/jdk1.6.0_27-32/jre/bin/java -enableassertions -Xmx1400m -Djava.security.egd=file:/dev/./urandom -jar <https://builds.apache.org/job/HBase-0.92/ws/trunk/target/surefire/surefirebooter3889682677764874127.jar> <https://builds.apache.org/job/HBase-0.92/ws/trunk/target/surefire/surefire5963381260649379465tmp> <https://builds.apache.org/job/HBase-0.92/ws/trunk/target/surefire/surefire5891109067692664117tmp>
Running org.apache.hadoop.hbase.io.TestHeapSize
Tests run: 2, Failures: 0, Errors: 0, Skipped: 0, Time elapsed: 0.158 sec
Forking command line: /bin/sh -c cd <https://builds.apache.org/job/HBase-0.92/ws/trunk> && /home/jenkins/tools/java/jdk1.6.0_27-32/jre/bin/java -enableassertions -Xmx1400m -Djava.security.egd=file:/dev/./urandom -jar <https://builds.apache.org/job/HBase-0.92/ws/trunk/target/surefire/surefirebooter7099493072664801501.jar> <https://builds.apache.org/job/HBase-0.92/ws/trunk/target/surefire/surefire1289490553850775896tmp> <https://builds.apache.org/job/HBase-0.92/ws/trunk/target/surefire/surefire5012905793502528363tmp>
Running org.apache.hadoop.hbase.io.hfile.TestHFileSeek
Tests run: 1, Failures: 0, Errors: 0, Skipped: 0, Time elapsed: 5.678 sec
Forking command line: /bin/sh -c cd <https://builds.apache.org/job/HBase-0.92/ws/trunk> && /home/jenkins/tools/java/jdk1.6.0_27-32/jre/bin/java -enableassertions -Xmx1400m -Djava.security.egd=file:/dev/./urandom -jar <https://builds.apache.org/job/HBase-0.92/ws/trunk/target/surefire/surefirebooter7914220904011349510.jar> <https://builds.apache.org/job/HBase-0.92/ws/trunk/target/surefire/surefire5944332272512248495tmp> <https://builds.apache.org/job/HBase-0.92/ws/trunk/target/surefire/surefire9076492936792601699tmp>
Running org.apache.hadoop.hbase.io.hfile.slab.TestSlab
Tests run: 1, Failures: 0, Errors: 0, Skipped: 0, Time elapsed: 0.146 sec
Forking command line: /bin/sh -c cd <https://builds.apache.org/job/HBase-0.92/ws/trunk> && /home/jenkins/tools/java/jdk1.6.0_27-32/jre/bin/java -enableassertions -Xmx1400m -Djava.security.egd=file:/dev/./urandom -jar <https://builds.apache.org/job/HBase-0.92/ws/trunk/target/surefire/surefirebooter8825110577316009114.jar> <https://builds.apache.org/job/HBase-0.92/ws/trunk/target/surefire/surefire7758287212775317901tmp> <https://builds.apache.org/job/HBase-0.92/ws/trunk/target/surefire/surefire7554386146858261071tmp>
Running org.apache.hadoop.hbase.io.hfile.slab.TestSlabCache
Tests run: 7, Failures: 0, Errors: 0, Skipped: 0, Time elapsed: 19.529 sec
Forking command line: /bin/sh -c cd <https://builds.apache.org/job/HBase-0.92/ws/trunk> && /home/jenkins/tools/java/jdk1.6.0_27-32/jre/bin/java -enableassertions -Xmx1400m -Djava.security.egd=file:/dev/./urandom -jar <https://builds.apache.org/job/HBase-0.92/ws/trunk/target/surefire/surefirebooter1667542474927176723.jar> <https://builds.apache.org/job/HBase-0.92/ws/trunk/target/surefire/surefire4993161966775860527tmp> <https://builds.apache.org/job/HBase-0.92/ws/trunk/target/surefire/surefire4341500743755111195tmp>
Running org.apache.hadoop.hbase.io.hfile.slab.TestSingleSizeCache
Tests run: 5, Failures: 0, Errors: 0, Skipped: 0, Time elapsed: 24.293 sec
Forking command line: /bin/sh -c cd <https://builds.apache.org/job/HBase-0.92/ws/trunk> && /home/jenkins/tools/java/jdk1.6.0_27-32/jre/bin/java -enableassertions -Xmx1400m -Djava.security.egd=file:/dev/./urandom -jar <https://builds.apache.org/job/HBase-0.92/ws/trunk/target/surefire/surefirebooter2546828144641155210.jar> <https://builds.apache.org/job/HBase-0.92/ws/trunk/target/surefire/surefire6207906514958731348tmp> <https://builds.apache.org/job/HBase-0.92/ws/trunk/target/surefire/surefire8928034673994029581tmp>
Running org.apache.hadoop.hbase.io.hfile.TestCachedBlockQueue
Tests run: 2, Failures: 0, Errors: 0, Skipped: 0, Time elapsed: 0.105 sec
Forking command line: /bin/sh -c cd <https://builds.apache.org/job/HBase-0.92/ws/trunk> && /home/jenkins/tools/java/jdk1.6.0_27-32/jre/bin/java -enableassertions -Xmx1400m -Djava.security.egd=file:/dev/./urandom -jar <https://builds.apache.org/job/HBase-0.92/ws/trunk/target/surefire/surefirebooter8014248332211833284.jar> <https://builds.apache.org/job/HBase-0.92/ws/trunk/target/surefire/surefire7541755411374103127tmp> <https://builds.apache.org/job/HBase-0.92/ws/trunk/target/surefire/surefire3699354092552753763tmp>
Running org.apache.hadoop.hbase.io.hfile.TestHFileBlockIndex
Tests run: 10, Failures: 0, Errors: 0, Skipped: 0, Time elapsed: 10 sec
Forking command line: /bin/sh -c cd <https://builds.apache.org/job/HBase-0.92/ws/trunk> && /home/jenkins/tools/java/jdk1.6.0_27-32/jre/bin/java -enableassertions -Xmx1400m -Djava.security.egd=file:/dev/./urandom -jar <https://builds.apache.org/job/HBase-0.92/ws/trunk/target/surefire/surefirebooter1303654702018803098.jar> <https://builds.apache.org/job/HBase-0.92/ws/trunk/target/surefire/surefire11397566727120332tmp> <https://builds.apache.org/job/HBase-0.92/ws/trunk/target/surefire/surefire1495119715900806800tmp>
Running org.apache.hadoop.hbase.io.hfile.TestLruBlockCache
Tests run: 7, Failures: 0, Errors: 0, Skipped: 0, Time elapsed: 0.346 sec
Forking command line: /bin/sh -c cd <https://builds.apache.org/job/HBase-0.92/ws/trunk> && /home/jenkins/tools/java/jdk1.6.0_27-32/jre/bin/java -enableassertions -Xmx1400m -Djava.security.egd=file:/dev/./urandom -jar <https://builds.apache.org/job/HBase-0.92/ws/trunk/target/surefire/surefirebooter4881571899443368776.jar> <https://builds.apache.org/job/HBase-0.92/ws/trunk/target/surefire/surefire2242261994566840090tmp> <https://builds.apache.org/job/HBase-0.92/ws/trunk/target/surefire/surefire4777991241779622342tmp>
Running org.apache.hadoop.hbase.io.hfile.TestHFilePerformance
Tests run: 1, Failures: 0, Errors: 0, Skipped: 0, Time elapsed: 6.116 sec
Forking command line: /bin/sh -c cd <https://builds.apache.org/job/HBase-0.92/ws/trunk> && /home/jenkins/tools/java/jdk1.6.0_27-32/jre/bin/java -enableassertions -Xmx1400m -Djava.security.egd=file:/dev/./urandom -jar <https://builds.apache.org/job/HBase-0.92/ws/trunk/target/surefire/surefirebooter6917521215598069281.jar> <https://builds.apache.org/job/HBase-0.92/ws/trunk/target/surefire/surefire6509029979708563508tmp> <https://builds.apache.org/job/HBase-0.92/ws/trunk/target/surefire/surefire6165987773218917279tmp>
Running org.apache.hadoop.hbase.io.hfile.TestFixedFileTrailer
Tests run: 2, Failures: 0, Errors: 0, Skipped: 0, Time elapsed: 0.695 sec
Forking command line: /bin/sh -c cd <https://builds.apache.org/job/HBase-0.92/ws/trunk> && /home/jenkins/tools/java/jdk1.6.0_27-32/jre/bin/java -enableassertions -Xmx1400m -Djava.security.egd=file:/dev/./urandom -jar <https://builds.apache.org/job/HBase-0.92/ws/trunk/target/surefire/surefirebooter2392717211338296674.jar> <https://builds.apache.org/job/HBase-0.92/ws/trunk/target/surefire/surefire4496964551219646058tmp> <https://builds.apache.org/job/HBase-0.92/ws/trunk/target/surefire/surefire108285635643364194tmp>
Running org.apache.hadoop.hbase.io.hfile.TestHFileWriterV2
Tests run: 1, Failures: 0, Errors: 0, Skipped: 0, Time elapsed: 1.073 sec
Forking command line: /bin/sh -c cd <https://builds.apache.org/job/HBase-0.92/ws/trunk> && /home/jenkins/tools/java/jdk1.6.0_27-32/jre/bin/java -enableassertions -Xmx1400m -Djava.security.egd=file:/dev/./urandom -jar <https://builds.apache.org/job/HBase-0.92/ws/trunk/target/surefire/surefirebooter697403685473040673.jar> <https://builds.apache.org/job/HBase-0.92/ws/trunk/target/surefire/surefire1953900563817112531tmp> <https://builds.apache.org/job/HBase-0.92/ws/trunk/target/surefire/surefire8290581325037453351tmp>
Running org.apache.hadoop.hbase.io.hfile.TestBlockCacheColumnFamilySummary
Tests run: 4, Failures: 0, Errors: 0, Skipped: 0, Time elapsed: 0.057 sec
Forking command line: /bin/sh -c cd <https://builds.apache.org/job/HBase-0.92/ws/trunk> && /home/jenkins/tools/java/jdk1.6.0_27-32/jre/bin/java -enableassertions -Xmx1400m -Djava.security.egd=file:/dev/./urandom -jar <https://builds.apache.org/job/HBase-0.92/ws/trunk/target/surefire/surefirebooter5638115867286057010.jar> <https://builds.apache.org/job/HBase-0.92/ws/trunk/target/surefire/surefire7994215762347304860tmp> <https://builds.apache.org/job/HBase-0.92/ws/trunk/target/surefire/surefire2440519683012558105tmp>
Running org.apache.hadoop.hbase.io.hfile.TestHFileReaderV1
Tests run: 1, Failures: 0, Errors: 0, Skipped: 0, Time elapsed: 0.572 sec
Forking command line: /bin/sh -c cd <https://builds.apache.org/job/HBase-0.92/ws/trunk> && /home/jenkins/tools/java/jdk1.6.0_27-32/jre/bin/java -enableassertions -Xmx1400m -Djava.security.egd=file:/dev/./urandom -jar <https://builds.apache.org/job/HBase-0.92/ws/trunk/target/surefire/surefirebooter1122166216336982223.jar> <https://builds.apache.org/job/HBase-0.92/ws/trunk/target/surefire/surefire5054431679083272119tmp> <https://builds.apache.org/job/HBase-0.92/ws/trunk/target/surefire/surefire6925830532247561291tmp>
Running org.apache.hadoop.hbase.io.hfile.TestHFile
Tests run: 6, Failures: 0, Errors: 0, Skipped: 0, Time elapsed: 0.855 sec
Forking command line: /bin/sh -c cd <https://builds.apache.org/job/HBase-0.92/ws/trunk> && /home/jenkins/tools/java/jdk1.6.0_27-32/jre/bin/java -enableassertions -Xmx1400m -Djava.security.egd=file:/dev/./urandom -jar <https://builds.apache.org/job/HBase-0.92/ws/trunk/target/surefire/surefirebooter8496689715039418945.jar> <https://builds.apache.org/job/HBase-0.92/ws/trunk/target/surefire/surefire237558460201491706tmp> <https://builds.apache.org/job/HBase-0.92/ws/trunk/target/surefire/surefire4588934734756691686tmp>
Running org.apache.hadoop.hbase.io.hfile.TestReseekTo
Tests run: 1, Failures: 0, Errors: 0, Skipped: 0, Time elapsed: 0.768 sec
Forking command line: /bin/sh -c cd <https://builds.apache.org/job/HBase-0.92/ws/trunk> && /home/jenkins/tools/java/jdk1.6.0_27-32/jre/bin/java -enableassertions -Xmx1400m -Djava.security.egd=file:/dev/./urandom -jar <https://builds.apache.org/job/HBase-0.92/ws/trunk/target/surefire/surefirebooter3942963972046690726.jar> <https://builds.apache.org/job/HBase-0.92/ws/trunk/target/surefire/surefire928504079573898824tmp> <https://builds.apache.org/job/HBase-0.92/ws/trunk/target/surefire/surefire5264365568021131353tmp>
Running org.apache.hadoop.hbase.io.hfile.TestHFileBlock
Tests run: 7, Failures: 0, Errors: 0, Skipped: 0, Time elapsed: 25.287 sec
Forking command line: /bin/sh -c cd <https://builds.apache.org/job/HBase-0.92/ws/trunk> && /home/jenkins/tools/java/jdk1.6.0_27-32/jre/bin/java -enableassertions -Xmx1400m -Djava.security.egd=file:/dev/./urandom -jar <https://builds.apache.org/job/HBase-0.92/ws/trunk/target/surefire/surefirebooter7136529431034806257.jar> <https://builds.apache.org/job/HBase-0.92/ws/trunk/target/surefire/surefire6481716138479519881tmp> <https://builds.apache.org/job/HBase-0.92/ws/trunk/target/surefire/surefire4750626580643791302tmp>
Running org.apache.hadoop.hbase.io.hfile.TestSeekTo
Tests run: 3, Failures: 0, Errors: 0, Skipped: 0, Time elapsed: 0.647 sec
Forking command line: /bin/sh -c cd <https://builds.apache.org/job/HBase-0.92/ws/trunk> && /home/jenkins/tools/java/jdk1.6.0_27-32/jre/bin/java -enableassertions -Xmx1400m -Djava.security.egd=file:/dev/./urandom -jar <https://builds.apache.org/job/HBase-0.92/ws/trunk/target/surefire/surefirebooter2769902199416877316.jar> <https://builds.apache.org/job/HBase-0.92/ws/trunk/target/surefire/surefire1449987158384058302tmp> <https://builds.apache.org/job/HBase-0.92/ws/trunk/target/surefire/surefire7631214277855395005tmp>
Running org.apache.hadoop.hbase.io.hfile.TestCacheOnWrite
Tests run: 6, Failures: 0, Errors: 0, Skipped: 0, Time elapsed: 7.381 sec
Forking command line: /bin/sh -c cd <https://builds.apache.org/job/HBase-0.92/ws/trunk> && /home/jenkins/tools/java/jdk1.6.0_27-32/jre/bin/java -enableassertions -Xmx1400m -Djava.security.egd=file:/dev/./urandom -jar <https://builds.apache.org/job/HBase-0.92/ws/trunk/target/surefire/surefirebooter7836919141982380556.jar> <https://builds.apache.org/job/HBase-0.92/ws/trunk/target/surefire/surefire1055515709423761137tmp> <https://builds.apache.org/job/HBase-0.92/ws/trunk/target/surefire/surefire4399253321660640128tmp>
Running org.apache.hadoop.hbase.io.TestHbaseObjectWritable
Tests run: 5, Failures: 0, Errors: 0, Skipped: 0, Time elapsed: 0.506 sec
Forking command line: /bin/sh -c cd <https://builds.apache.org/job/HBase-0.92/ws/trunk> && /home/jenkins/tools/java/jdk1.6.0_27-32/jre/bin/java -enableassertions -Xmx1400m -Djava.security.egd=file:/dev/./urandom -jar <https://builds.apache.org/job/HBase-0.92/ws/trunk/target/surefire/surefirebooter7418963519023631887.jar> <https://builds.apache.org/job/HBase-0.92/ws/trunk/target/surefire/surefire1050152160641652965tmp> <https://builds.apache.org/job/HBase-0.92/ws/trunk/target/surefire/surefire3294736772655375430tmp>
Running org.apache.hadoop.hbase.io.TestImmutableBytesWritable
Tests run: 3, Failures: 0, Errors: 0, Skipped: 0, Time elapsed: 0.111 sec
Forking command line: /bin/sh -c cd <https://builds.apache.org/job/HBase-0.92/ws/trunk> && /home/jenkins/tools/java/jdk1.6.0_27-32/jre/bin/java -enableassertions -Xmx1400m -Djava.security.egd=file:/dev/./urandom -jar <https://builds.apache.org/job/HBase-0.92/ws/trunk/target/surefire/surefirebooter662666592115541029.jar> <https://builds.apache.org/job/HBase-0.92/ws/trunk/target/surefire/surefire3298680052829973805tmp> <https://builds.apache.org/job/HBase-0.92/ws/trunk/target/surefire/surefire9160706480426504089tmp>
Running org.apache.hadoop.hbase.io.TestHalfStoreFileReader
Tests run: 1, Failures: 0, Errors: 0, Skipped: 0, Time elapsed: 0.8 sec
Forking command line: /bin/sh -c cd <https://builds.apache.org/job/HBase-0.92/ws/trunk> && /home/jenkins/tools/java/jdk1.6.0_27-32/jre/bin/java -enableassertions -Xmx1400m -Djava.security.egd=file:/dev/./urandom -jar <https://builds.apache.org/job/HBase-0.92/ws/trunk/target/surefire/surefirebooter3451399376395594008.jar> <https://builds.apache.org/job/HBase-0.92/ws/trunk/target/surefire/surefire4010997604685058014tmp> <https://builds.apache.org/job/HBase-0.92/ws/trunk/target/surefire/surefire6487955245516209718tmp>
Running org.apache.hadoop.hbase.migration.TestMigrationFrom090To092
Tests run: 1, Failures: 0, Errors: 0, Skipped: 0, Time elapsed: 0.272 sec
Forking command line: /bin/sh -c cd <https://builds.apache.org/job/HBase-0.92/ws/trunk> && /home/jenkins/tools/java/jdk1.6.0_27-32/jre/bin/java -enableassertions -Xmx1400m -Djava.security.egd=file:/dev/./urandom -jar <https://builds.apache.org/job/HBase-0.92/ws/trunk/target/surefire/surefirebooter2381651976147483896.jar> <https://builds.apache.org/job/HBase-0.92/ws/trunk/target/surefire/surefire6409410243731621337tmp> <https://builds.apache.org/job/HBase-0.92/ws/trunk/target/surefire/surefire121825624251057598tmp>
Running org.apache.hadoop.hbase.TestFSTableDescriptorForceCreation
Tests run: 3, Failures: 0, Errors: 0, Skipped: 0, Time elapsed: 0.695 sec
Forking command line: /bin/sh -c cd <https://builds.apache.org/job/HBase-0.92/ws/trunk> && /home/jenkins/tools/java/jdk1.6.0_27-32/jre/bin/java -enableassertions -Xmx1400m -Djava.security.egd=file:/dev/./urandom -jar <https://builds.apache.org/job/HBase-0.92/ws/trunk/target/surefire/surefirebooter8168923767512790578.jar> <https://builds.apache.org/job/HBase-0.92/ws/trunk/target/surefire/surefire2035781968386132133tmp> <https://builds.apache.org/job/HBase-0.92/ws/trunk/target/surefire/surefire527699944252181467tmp>
Running org.apache.hadoop.hbase.avro.TestAvroUtil
Tests run: 1, Failures: 0, Errors: 0, Skipped: 0, Time elapsed: 0.637 sec
Forking command line: /bin/sh -c cd <https://builds.apache.org/job/HBase-0.92/ws/trunk> && /home/jenkins/tools/java/jdk1.6.0_27-32/jre/bin/java -enableassertions -Xmx1400m -Djava.security.egd=file:/dev/./urandom -jar <https://builds.apache.org/job/HBase-0.92/ws/trunk/target/surefire/surefirebooter2036232266290745988.jar> <https://builds.apache.org/job/HBase-0.92/ws/trunk/target/surefire/surefire1485132716044771978tmp> <https://builds.apache.org/job/HBase-0.92/ws/trunk/target/surefire/surefire1550509119497323321tmp>
Running org.apache.hadoop.hbase.avro.TestAvroServer
Tests run: 3, Failures: 0, Errors: 0, Skipped: 0, Time elapsed: 32.265 sec
Forking command line: /bin/sh -c cd <https://builds.apache.org/job/HBase-0.92/ws/trunk> && /home/jenkins/tools/java/jdk1.6.0_27-32/jre/bin/java -enableassertions -Xmx1400m -Djava.security.egd=file:/dev/./urandom -jar <https://builds.apache.org/job/HBase-0.92/ws/trunk/target/surefire/surefirebooter5802245055594361260.jar> <https://builds.apache.org/job/HBase-0.92/ws/trunk/target/surefire/surefire1332223834748298941tmp> <https://builds.apache.org/job/HBase-0.92/ws/trunk/target/surefire/surefire2592522353067369888tmp>
Running org.apache.hadoop.hbase.TestKeyValue
Tests run: 12, Failures: 0, Errors: 0, Skipped: 0, Time elapsed: 0.131 sec
Forking command line: /bin/sh -c cd <https://builds.apache.org/job/HBase-0.92/ws/trunk> && /home/jenkins/tools/java/jdk1.6.0_27-32/jre/bin/java -enableassertions -Xmx1400m -Djava.security.egd=file:/dev/./urandom -jar <https://builds.apache.org/job/HBase-0.92/ws/trunk/target/surefire/surefirebooter1256719764329586784.jar> <https://builds.apache.org/job/HBase-0.92/ws/trunk/target/surefire/surefire8152389810670805050tmp> <https://builds.apache.org/job/HBase-0.92/ws/trunk/target/surefire/surefire7213199192654157038tmp>
Running org.apache.hadoop.hbase.replication.TestMultiSlaveReplication
Tests run: 1, Failures: 0, Errors: 0, Skipped: 0, Time elapsed: 59.451 sec
Forking command line: /bin/sh -c cd <https://builds.apache.org/job/HBase-0.92/ws/trunk> && /home/jenkins/tools/java/jdk1.6.0_27-32/jre/bin/java -enableassertions -Xmx1400m -Djava.security.egd=file:/dev/./urandom -jar <https://builds.apache.org/job/HBase-0.92/ws/trunk/target/surefire/surefirebooter8031889369505260714.jar> <https://builds.apache.org/job/HBase-0.92/ws/trunk/target/surefire/surefire7003150049127797559tmp> <https://builds.apache.org/job/HBase-0.92/ws/trunk/target/surefire/surefire4478515959104629093tmp>
Running org.apache.hadoop.hbase.replication.regionserver.TestReplicationSourceManager
Tests run: 1, Failures: 0, Errors: 0, Skipped: 0, Time elapsed: 1.028 sec
Forking command line: /bin/sh -c cd <https://builds.apache.org/job/HBase-0.92/ws/trunk> && /home/jenkins/tools/java/jdk1.6.0_27-32/jre/bin/java -enableassertions -Xmx1400m -Djava.security.egd=file:/dev/./urandom -jar <https://builds.apache.org/job/HBase-0.92/ws/trunk/target/surefire/surefirebooter2415531110632199385.jar> <https://builds.apache.org/job/HBase-0.92/ws/trunk/target/surefire/surefire1838441812426419464tmp> <https://builds.apache.org/job/HBase-0.92/ws/trunk/target/surefire/surefire7687397673564897538tmp>
Running org.apache.hadoop.hbase.replication.regionserver.TestReplicationSink
Tests run: 5, Failures: 0, Errors: 0, Skipped: 0, Time elapsed: 22.136 sec
Forking command line: /bin/sh -c cd <https://builds.apache.org/job/HBase-0.92/ws/trunk> && /home/jenkins/tools/java/jdk1.6.0_27-32/jre/bin/java -enableassertions -Xmx1400m -Djava.security.egd=file:/dev/./urandom -jar <https://builds.apache.org/job/HBase-0.92/ws/trunk/target/surefire/surefirebooter2525801970397237697.jar> <https://builds.apache.org/job/HBase-0.92/ws/trunk/target/surefire/surefire7505943592008217540tmp> <https://builds.apache.org/job/HBase-0.92/ws/trunk/target/surefire/surefire658988055846095936tmp>
Running org.apache.hadoop.hbase.replication.TestMasterReplication
Tests run: 2, Failures: 0, Errors: 0, Skipped: 0, Time elapsed: 99.767 sec
Forking command line: /bin/sh -c cd <https://builds.apache.org/job/HBase-0.92/ws/trunk> && /home/jenkins/tools/java/jdk1.6.0_27-32/jre/bin/java -enableassertions -Xmx1400m -Djava.security.egd=file:/dev/./urandom -jar <https://builds.apache.org/job/HBase-0.92/ws/trunk/target/surefire/surefirebooter3180461292905905308.jar> <https://builds.apache.org/job/HBase-0.92/ws/trunk/target/surefire/surefire4339362851746267635tmp> <https://builds.apache.org/job/HBase-0.92/ws/trunk/target/surefire/surefire5490946369140592502tmp>
Running org.apache.hadoop.hbase.replication.TestReplicationSource
Tests run: 1, Failures: 0, Errors: 0, Skipped: 0, Time elapsed: 2.56 sec
Forking command line: /bin/sh -c cd <https://builds.apache.org/job/HBase-0.92/ws/trunk> && /home/jenkins/tools/java/jdk1.6.0_27-32/jre/bin/java -enableassertions -Xmx1400m -Djava.security.egd=file:/dev/./urandom -jar <https://builds.apache.org/job/HBase-0.92/ws/trunk/target/surefire/surefirebooter3097567760538944357.jar> <https://builds.apache.org/job/HBase-0.92/ws/trunk/target/surefire/surefire2965676511303993941tmp> <https://builds.apache.org/job/HBase-0.92/ws/trunk/target/surefire/surefire3208934527045263655tmp>
Running org.apache.hadoop.hbase.replication.TestReplicationPeer
Tests run: 1, Failures: 0, Errors: 0, Skipped: 0, Time elapsed: 25.745 sec
Forking command line: /bin/sh -c cd <https://builds.apache.org/job/HBase-0.92/ws/trunk> && /home/jenkins/tools/java/jdk1.6.0_27-32/jre/bin/java -enableassertions -Xmx1400m -Djava.security.egd=file:/dev/./urandom -jar <https://builds.apache.org/job/HBase-0.92/ws/trunk/target/surefire/surefirebooter973383790466687783.jar> <https://builds.apache.org/job/HBase-0.92/ws/trunk/target/surefire/surefire4171245163657442254tmp> <https://builds.apache.org/job/HBase-0.92/ws/trunk/target/surefire/surefire5534154567587765002tmp>
Running org.apache.hadoop.hbase.replication.TestReplicationZookeeper
Tests run: 1, Failures: 0, Errors: 0, Skipped: 0, Time elapsed: 0.696 sec
Forking command line: /bin/sh -c cd <https://builds.apache.org/job/HBase-0.92/ws/trunk> && /home/jenkins/tools/java/jdk1.6.0_27-32/jre/bin/java -enableassertions -Xmx1400m -Djava.security.egd=file:/dev/./urandom -jar <https://builds.apache.org/job/HBase-0.92/ws/trunk/target/surefire/surefirebooter26975441951337215.jar> <https://builds.apache.org/job/HBase-0.92/ws/trunk/target/surefire/surefire947499202726957490tmp> <https://builds.apache.org/job/HBase-0.92/ws/trunk/target/surefire/surefire3545996851429566554tmp>
Running org.apache.hadoop.hbase.replication.TestReplication
Tests run: 8, Failures: 0, Errors: 0, Skipped: 0, Time elapsed: 121.29 sec
Forking command line: /bin/sh -c cd <https://builds.apache.org/job/HBase-0.92/ws/trunk> && /home/jenkins/tools/java/jdk1.6.0_27-32/jre/bin/java -enableassertions -Xmx1400m -Djava.security.egd=file:/dev/./urandom -jar <https://builds.apache.org/job/HBase-0.92/ws/trunk/target/surefire/surefirebooter2069963474718012380.jar> <https://builds.apache.org/job/HBase-0.92/ws/trunk/target/surefire/surefire6650221564360176570tmp> <https://builds.apache.org/job/HBase-0.92/ws/trunk/target/surefire/surefire3806288676724994927tmp>
Running org.apache.hadoop.hbase.ipc.TestDelayedRpc
Tests run: 4, Failures: 0, Errors: 0, Skipped: 0, Time elapsed: 2.618 sec
Forking command line: /bin/sh -c cd <https://builds.apache.org/job/HBase-0.92/ws/trunk> && /home/jenkins/tools/java/jdk1.6.0_27-32/jre/bin/java -enableassertions -Xmx1400m -Djava.security.egd=file:/dev/./urandom -jar <https://builds.apache.org/job/HBase-0.92/ws/trunk/target/surefire/surefirebooter8040610955179965010.jar> <https://builds.apache.org/job/HBase-0.92/ws/trunk/target/surefire/surefire2192862809612492516tmp> <https://builds.apache.org/job/HBase-0.92/ws/trunk/target/surefire/surefire2519912735664841983tmp>
Running org.apache.hadoop.hbase.TestCompare
Tests run: 1, Failures: 0, Errors: 0, Skipped: 0, Time elapsed: 0.236 sec
Forking command line: /bin/sh -c cd <https://builds.apache.org/job/HBase-0.92/ws/trunk> && /home/jenkins/tools/java/jdk1.6.0_27-32/jre/bin/java -enableassertions -Xmx1400m -Djava.security.egd=file:/dev/./urandom -jar <https://builds.apache.org/job/HBase-0.92/ws/trunk/target/surefire/surefirebooter2293768049602549856.jar> <https://builds.apache.org/job/HBase-0.92/ws/trunk/target/surefire/surefire3605041321063558539tmp> <https://builds.apache.org/job/HBase-0.92/ws/trunk/target/surefire/surefire2531312481567559852tmp>
Running org.apache.hadoop.hbase.TestZooKeeper
Tests run: 7, Failures: 0, Errors: 0, Skipped: 0, Time elapsed: 85.809 sec
Forking command line: /bin/sh -c cd <https://builds.apache.org/job/HBase-0.92/ws/trunk> && /home/jenkins/tools/java/jdk1.6.0_27-32/jre/bin/java -enableassertions -Xmx1400m -Djava.security.egd=file:/dev/./urandom -jar <https://builds.apache.org/job/HBase-0.92/ws/trunk/target/surefire/surefirebooter4707820419633308793.jar> <https://builds.apache.org/job/HBase-0.92/ws/trunk/target/surefire/surefire1722861192026747483tmp> <https://builds.apache.org/job/HBase-0.92/ws/trunk/target/surefire/surefire6818265855291444806tmp>
Running org.apache.hadoop.hbase.TestHBaseTestingUtility
Tests run: 7, Failures: 0, Errors: 0, Skipped: 0, Time elapsed: 101.695 sec
Results :
Tests in error:
testHundredsOfTable(org.apache.hadoop.hbase.client.TestAdmin): Call to janus.apache.org/67.195.138.60:38681 failed on socket timeout exception: java.net.SocketTimeoutException: 1500 millis timeout while waiting for channel to be ready for read. ch : java.nio.channels.SocketChannel[connected local=/67.195.138.60:53765 remote=janus.apache.org/67.195.138.60:38681]
Tests run: 1104, Failures: 0, Errors: 1, Skipped: 8
[INFO] ------------------------------------------------------------------------
[INFO] BUILD FAILURE
[INFO] ------------------------------------------------------------------------
[INFO] Total time: 2:00:13.013s
[INFO] Finished at: Thu Apr 05 19:59:48 UTC 2012
[INFO] Final Memory: 38M/1002M
[INFO] ------------------------------------------------------------------------
[ERROR] Failed to execute goal org.apache.maven.plugins:maven-surefire-plugin:2.10:test (default-test) on project hbase: There are test failures.
[ERROR]
[ERROR] Please refer to <https://builds.apache.org/job/HBase-0.92/ws/trunk/target/surefire-reports> for the individual test results.
[ERROR] -> [Help 1]
org.apache.maven.lifecycle.LifecycleExecutionException: Failed to execute goal org.apache.maven.plugins:maven-surefire-plugin:2.10:test (default-test) on project hbase: There are test failures.
Please refer to <https://builds.apache.org/job/HBase-0.92/ws/trunk/target/surefire-reports> for the individual test results.
at org.apache.maven.lifecycle.internal.MojoExecutor.execute(MojoExecutor.java:213)
at org.apache.maven.lifecycle.internal.MojoExecutor.execute(MojoExecutor.java:153)
at org.apache.maven.lifecycle.internal.MojoExecutor.execute(MojoExecutor.java:145)
at org.apache.maven.lifecycle.internal.LifecycleModuleBuilder.buildProject(LifecycleModuleBuilder.java:84)
at org.apache.maven.lifecycle.internal.LifecycleModuleBuilder.buildProject(LifecycleModuleBuilder.java:59)
at org.apache.maven.lifecycle.internal.LifecycleStarter.singleThreadedBuild(LifecycleStarter.java:183)
at org.apache.maven.lifecycle.internal.LifecycleStarter.execute(LifecycleStarter.java:161)
at org.apache.maven.DefaultMaven.doExecute(DefaultMaven.java:319)
at org.apache.maven.DefaultMaven.execute(DefaultMaven.java:156)
at org.apache.maven.cli.MavenCli.execute(MavenCli.java:537)
at org.apache.maven.cli.MavenCli.doMain(MavenCli.java:196)
at org.apache.maven.cli.MavenCli.main(MavenCli.java:141)
at sun.reflect.NativeMethodAccessorImpl.invoke0(Native Method)
at sun.reflect.NativeMethodAccessorImpl.invoke(NativeMethodAccessorImpl.java:39)
at sun.reflect.DelegatingMethodAccessorImpl.invoke(DelegatingMethodAccessorImpl.java:25)
at java.lang.reflect.Method.invoke(Method.java:597)
at org.codehaus.plexus.classworlds.launcher.Launcher.launchEnhanced(Launcher.java:290)
at org.codehaus.plexus.classworlds.launcher.Launcher.launch(Launcher.java:230)
at org.codehaus.plexus.classworlds.launcher.Launcher.mainWithExitCode(Launcher.java:409)
at org.codehaus.plexus.classworlds.launcher.Launcher.main(Launcher.java:352)
Caused by: org.apache.maven.plugin.MojoFailureException: There are test failures.
Please refer to <https://builds.apache.org/job/HBase-0.92/ws/trunk/target/surefire-reports> for the individual test results.
at org.apache.maven.plugin.surefire.SurefireHelper.reportExecution(SurefireHelper.java:87)
at org.apache.maven.plugin.surefire.SurefirePlugin.writeSummary(SurefirePlugin.java:641)
at org.apache.maven.plugin.surefire.SurefirePlugin.handleSummary(SurefirePlugin.java:615)
at org.apache.maven.plugin.surefire.AbstractSurefireMojo.executeAfterPreconditionsChecked(AbstractSurefireMojo.java:137)
at org.apache.maven.plugin.surefire.AbstractSurefireMojo.execute(AbstractSurefireMojo.java:98)
at org.apache.maven.plugin.DefaultBuildPluginManager.executeMojo(DefaultBuildPluginManager.java:101)
at org.apache.maven.lifecycle.internal.MojoExecutor.execute(MojoExecutor.java:209)
... 19 more
[ERROR]
[ERROR]
[ERROR] For more information about the errors and possible solutions, please read the following articles:
[ERROR] [Help 1] http://cwiki.apache.org/confluence/display/MAVEN/MojoFailureException
Build step 'Invoke top-level Maven targets' marked build as failure
Archiving artifacts
Recording test results
Build failed in Jenkins: HBase-0.92 #354
Posted by Apache Jenkins Server <je...@builds.apache.org>.
See <https://builds.apache.org/job/HBase-0.92/354/>
------------------------------------------
Started by user stack
Building remotely on ubuntu4 in workspace <https://builds.apache.org/job/HBase-0.92/ws/>
hudson.util.IOException2: remote file operation failed: <https://builds.apache.org/job/HBase-0.92/ws/> at hudson.remoting.Channel@7b7252c4:ubuntu4
at hudson.FilePath.act(FilePath.java:828)
at hudson.FilePath.act(FilePath.java:814)
at hudson.scm.SubversionSCM.checkout(SubversionSCM.java:743)
at hudson.scm.SubversionSCM.checkout(SubversionSCM.java:685)
at hudson.model.AbstractProject.checkout(AbstractProject.java:1212)
at hudson.model.AbstractBuild$AbstractRunner.checkout(AbstractBuild.java:579)
at hudson.model.AbstractBuild$AbstractRunner.run(AbstractBuild.java:468)
at hudson.model.Run.run(Run.java:1413)
at hudson.model.FreeStyleBuild.run(FreeStyleBuild.java:46)
at hudson.model.ResourceController.execute(ResourceController.java:88)
at hudson.model.Executor.run(Executor.java:238)
Caused by: java.io.IOException: Remote call on ubuntu4 failed
at hudson.remoting.Channel.call(Channel.java:655)
at hudson.FilePath.act(FilePath.java:821)
... 10 more
Caused by: java.lang.LinkageError: loader (instance of hudson/remoting/RemoteClassLoader): attempted duplicate class definition for name: "hudson/model/Descriptor"
at java.lang.ClassLoader.defineClass1(Native Method)
at java.lang.ClassLoader.defineClass(ClassLoader.java:634)
at java.lang.ClassLoader.defineClass(ClassLoader.java:480)
at hudson.remoting.RemoteClassLoader.loadClassFile(RemoteClassLoader.java:152)
at hudson.remoting.RemoteClassLoader.findClass(RemoteClassLoader.java:131)
at java.lang.ClassLoader.loadClass(ClassLoader.java:321)
at java.lang.ClassLoader.loadClass(ClassLoader.java:266)
at java.lang.Class.getDeclaredFields0(Native Method)
at java.lang.Class.privateGetDeclaredFields(Class.java:2308)
at java.lang.Class.getDeclaredField(Class.java:1897)
at java.io.ObjectStreamClass.getDeclaredSUID(ObjectStreamClass.java:1627)
at java.io.ObjectStreamClass.access$700(ObjectStreamClass.java:69)
at java.io.ObjectStreamClass$2.run(ObjectStreamClass.java:442)
at java.security.AccessController.doPrivileged(Native Method)
at java.io.ObjectStreamClass.<init>(ObjectStreamClass.java:430)
at java.io.ObjectStreamClass.lookup(ObjectStreamClass.java:327)
at java.io.ObjectStreamClass.initNonProxy(ObjectStreamClass.java:564)
at java.io.ObjectInputStream.readNonProxyDesc(ObjectInputStream.java:1600)
at java.io.ObjectInputStream.readClassDesc(ObjectInputStream.java:1513)
at java.io.ObjectInputStream.readNonProxyDesc(ObjectInputStream.java:1600)
at java.io.ObjectInputStream.readClassDesc(ObjectInputStream.java:1513)
at java.io.ObjectInputStream.readOrdinaryObject(ObjectInputStream.java:1749)
at java.io.ObjectInputStream.readObject0(ObjectInputStream.java:1346)
at java.io.ObjectInputStream.defaultReadFields(ObjectInputStream.java:1963)
at java.io.ObjectInputStream.readSerialData(ObjectInputStream.java:1887)
at java.io.ObjectInputStream.readOrdinaryObject(ObjectInputStream.java:1770)
at java.io.ObjectInputStream.readObject0(ObjectInputStream.java:1346)
at java.io.ObjectInputStream.defaultReadFields(ObjectInputStream.java:1963)
at java.io.ObjectInputStream.readSerialData(ObjectInputStream.java:1887)
at java.io.ObjectInputStream.readOrdinaryObject(ObjectInputStream.java:1770)
at java.io.ObjectInputStream.readObject0(ObjectInputStream.java:1346)
at java.io.ObjectInputStream.defaultReadFields(ObjectInputStream.java:1963)
at java.io.ObjectInputStream.readSerialData(ObjectInputStream.java:1887)
at java.io.ObjectInputStream.readOrdinaryObject(ObjectInputStream.java:1770)
at java.io.ObjectInputStream.readObject0(ObjectInputStream.java:1346)
at java.io.ObjectInputStream.readObject(ObjectInputStream.java:368)
at hudson.remoting.UserRequest.deserialize(UserRequest.java:182)
at hudson.remoting.UserRequest.perform(UserRequest.java:98)
at hudson.remoting.UserRequest.perform(UserRequest.java:48)
at hudson.remoting.Request$2.run(Request.java:287)
at hudson.remoting.InterceptingExecutorService$1.call(InterceptingExecutorService.java:72)
at java.util.concurrent.FutureTask$Sync.innerRun(FutureTask.java:334)
at java.util.concurrent.FutureTask.run(FutureTask.java:166)
at java.util.concurrent.ThreadPoolExecutor.runWorker(ThreadPoolExecutor.java:1110)
at java.util.concurrent.ThreadPoolExecutor$Worker.run(ThreadPoolExecutor.java:603)
at java.lang.Thread.run(Thread.java:636)
Retrying after 10 seconds
hudson.util.IOException2: remote file operation failed: <https://builds.apache.org/job/HBase-0.92/ws/> at hudson.remoting.Channel@7b7252c4:ubuntu4
at hudson.FilePath.act(FilePath.java:828)
at hudson.FilePath.act(FilePath.java:814)
at hudson.scm.SubversionSCM.checkout(SubversionSCM.java:743)
at hudson.scm.SubversionSCM.checkout(SubversionSCM.java:685)
at hudson.model.AbstractProject.checkout(AbstractProject.java:1212)
at hudson.model.AbstractBuild$AbstractRunner.checkout(AbstractBuild.java:579)
at hudson.model.AbstractBuild$AbstractRunner.run(AbstractBuild.java:468)
at hudson.model.Run.run(Run.java:1413)
at hudson.model.FreeStyleBuild.run(FreeStyleBuild.java:46)
at hudson.model.ResourceController.execute(ResourceController.java:88)
at hudson.model.Executor.run(Executor.java:238)
Caused by: java.io.IOException: Remote call on ubuntu4 failed
at hudson.remoting.Channel.call(Channel.java:655)
at hudson.FilePath.act(FilePath.java:821)
... 10 more
Caused by: java.lang.LinkageError: loader (instance of hudson/remoting/RemoteClassLoader): attempted duplicate class definition for name: "hudson/model/Descriptor"
at java.lang.ClassLoader.defineClass1(Native Method)
at java.lang.ClassLoader.defineClass(ClassLoader.java:634)
at java.lang.ClassLoader.defineClass(ClassLoader.java:480)
at hudson.remoting.RemoteClassLoader.loadClassFile(RemoteClassLoader.java:152)
at hudson.remoting.RemoteClassLoader.findClass(RemoteClassLoader.java:131)
at java.lang.ClassLoader.loadClass(ClassLoader.java:321)
at java.lang.ClassLoader.loadClass(ClassLoader.java:266)
at java.lang.Class.getDeclaredFields0(Native Method)
at java.lang.Class.privateGetDeclaredFields(Class.java:2308)
at java.lang.Class.getDeclaredField(Class.java:1897)
at java.io.ObjectStreamClass.getDeclaredSUID(ObjectStreamClass.java:1627)
at java.io.ObjectStreamClass.access$700(ObjectStreamClass.java:69)
at java.io.ObjectStreamClass$2.run(ObjectStreamClass.java:442)
at java.security.AccessController.doPrivileged(Native Method)
at java.io.ObjectStreamClass.<init>(ObjectStreamClass.java:430)
at java.io.ObjectStreamClass.lookup(ObjectStreamClass.java:327)
at java.io.ObjectStreamClass.initNonProxy(ObjectStreamClass.java:564)
at java.io.ObjectInputStream.readNonProxyDesc(ObjectInputStream.java:1600)
at java.io.ObjectInputStream.readClassDesc(ObjectInputStream.java:1513)
at java.io.ObjectInputStream.readNonProxyDesc(ObjectInputStream.java:1600)
at java.io.ObjectInputStream.readClassDesc(ObjectInputStream.java:1513)
at java.io.ObjectInputStream.readOrdinaryObject(ObjectInputStream.java:1749)
at java.io.ObjectInputStream.readObject0(ObjectInputStream.java:1346)
at java.io.ObjectInputStream.defaultReadFields(ObjectInputStream.java:1963)
at java.io.ObjectInputStream.readSerialData(ObjectInputStream.java:1887)
at java.io.ObjectInputStream.readOrdinaryObject(ObjectInputStream.java:1770)
at java.io.ObjectInputStream.readObject0(ObjectInputStream.java:1346)
at java.io.ObjectInputStream.defaultReadFields(ObjectInputStream.java:1963)
at java.io.ObjectInputStream.readSerialData(ObjectInputStream.java:1887)
at java.io.ObjectInputStream.readOrdinaryObject(ObjectInputStream.java:1770)
at java.io.ObjectInputStream.readObject0(ObjectInputStream.java:1346)
at java.io.ObjectInputStream.defaultReadFields(ObjectInputStream.java:1963)
at java.io.ObjectInputStream.readSerialData(ObjectInputStream.java:1887)
at java.io.ObjectInputStream.readOrdinaryObject(ObjectInputStream.java:1770)
at java.io.ObjectInputStream.readObject0(ObjectInputStream.java:1346)
at java.io.ObjectInputStream.readObject(ObjectInputStream.java:368)
at hudson.remoting.UserRequest.deserialize(UserRequest.java:182)
at hudson.remoting.UserRequest.perform(UserRequest.java:98)
at hudson.remoting.UserRequest.perform(UserRequest.java:48)
at hudson.remoting.Request$2.run(Request.java:287)
at hudson.remoting.InterceptingExecutorService$1.call(InterceptingExecutorService.java:72)
at java.util.concurrent.FutureTask$Sync.innerRun(FutureTask.java:334)
at java.util.concurrent.FutureTask.run(FutureTask.java:166)
at java.util.concurrent.ThreadPoolExecutor.runWorker(ThreadPoolExecutor.java:1110)
at java.util.concurrent.ThreadPoolExecutor$Worker.run(ThreadPoolExecutor.java:603)
at java.lang.Thread.run(Thread.java:636)
Retrying after 10 seconds
hudson.util.IOException2: remote file operation failed: <https://builds.apache.org/job/HBase-0.92/ws/> at hudson.remoting.Channel@7b7252c4:ubuntu4
at hudson.FilePath.act(FilePath.java:828)
at hudson.FilePath.act(FilePath.java:814)
at hudson.scm.SubversionSCM.checkout(SubversionSCM.java:743)
at hudson.scm.SubversionSCM.checkout(SubversionSCM.java:685)
at hudson.model.AbstractProject.checkout(AbstractProject.java:1212)
at hudson.model.AbstractBuild$AbstractRunner.checkout(AbstractBuild.java:579)
at hudson.model.AbstractBuild$AbstractRunner.run(AbstractBuild.java:468)
at hudson.model.Run.run(Run.java:1413)
at hudson.model.FreeStyleBuild.run(FreeStyleBuild.java:46)
at hudson.model.ResourceController.execute(ResourceController.java:88)
at hudson.model.Executor.run(Executor.java:238)
Caused by: java.io.IOException: Remote call on ubuntu4 failed
at hudson.remoting.Channel.call(Channel.java:655)
at hudson.FilePath.act(FilePath.java:821)
... 10 more
Caused by: java.lang.LinkageError: loader (instance of hudson/remoting/RemoteClassLoader): attempted duplicate class definition for name: "hudson/model/Descriptor"
at java.lang.ClassLoader.defineClass1(Native Method)
at java.lang.ClassLoader.defineClass(ClassLoader.java:634)
at java.lang.ClassLoader.defineClass(ClassLoader.java:480)
at hudson.remoting.RemoteClassLoader.loadClassFile(RemoteClassLoader.java:152)
at hudson.remoting.RemoteClassLoader.findClass(RemoteClassLoader.java:131)
at java.lang.ClassLoader.loadClass(ClassLoader.java:321)
at java.lang.ClassLoader.loadClass(ClassLoader.java:266)
at java.lang.Class.getDeclaredFields0(Native Method)
at java.lang.Class.privateGetDeclaredFields(Class.java:2308)
at java.lang.Class.getDeclaredField(Class.java:1897)
at java.io.ObjectStreamClass.getDeclaredSUID(ObjectStreamClass.java:1627)
at java.io.ObjectStreamClass.access$700(ObjectStreamClass.java:69)
at java.io.ObjectStreamClass$2.run(ObjectStreamClass.java:442)
at java.security.AccessController.doPrivileged(Native Method)
at java.io.ObjectStreamClass.<init>(ObjectStreamClass.java:430)
at java.io.ObjectStreamClass.lookup(ObjectStreamClass.java:327)
at java.io.ObjectStreamClass.initNonProxy(ObjectStreamClass.java:564)
at java.io.ObjectInputStream.readNonProxyDesc(ObjectInputStream.java:1600)
at java.io.ObjectInputStream.readClassDesc(ObjectInputStream.java:1513)
at java.io.ObjectInputStream.readNonProxyDesc(ObjectInputStream.java:1600)
at java.io.ObjectInputStream.readClassDesc(ObjectInputStream.java:1513)
at java.io.ObjectInputStream.readOrdinaryObject(ObjectInputStream.java:1749)
at java.io.ObjectInputStream.readObject0(ObjectInputStream.java:1346)
at java.io.ObjectInputStream.defaultReadFields(ObjectInputStream.java:1963)
at java.io.ObjectInputStream.readSerialData(ObjectInputStream.java:1887)
at java.io.ObjectInputStream.readOrdinaryObject(ObjectInputStream.java:1770)
at java.io.ObjectInputStream.readObject0(ObjectInputStream.java:1346)
at java.io.ObjectInputStream.defaultReadFields(ObjectInputStream.java:1963)
at java.io.ObjectInputStream.readSerialData(ObjectInputStream.java:1887)
at java.io.ObjectInputStream.readOrdinaryObject(ObjectInputStream.java:1770)
at java.io.ObjectInputStream.readObject0(ObjectInputStream.java:1346)
at java.io.ObjectInputStream.defaultReadFields(ObjectInputStream.java:1963)
at java.io.ObjectInputStream.readSerialData(ObjectInputStream.java:1887)
at java.io.ObjectInputStream.readOrdinaryObject(ObjectInputStream.java:1770)
at java.io.ObjectInputStream.readObject0(ObjectInputStream.java:1346)
at java.io.ObjectInputStream.readObject(ObjectInputStream.java:368)
at hudson.remoting.UserRequest.deserialize(UserRequest.java:182)
at hudson.remoting.UserRequest.perform(UserRequest.java:98)
at hudson.remoting.UserRequest.perform(UserRequest.java:48)
at hudson.remoting.Request$2.run(Request.java:287)
at hudson.remoting.InterceptingExecutorService$1.call(InterceptingExecutorService.java:72)
at java.util.concurrent.FutureTask$Sync.innerRun(FutureTask.java:334)
at java.util.concurrent.FutureTask.run(FutureTask.java:166)
at java.util.concurrent.ThreadPoolExecutor.runWorker(ThreadPoolExecutor.java:1110)
at java.util.concurrent.ThreadPoolExecutor$Worker.run(ThreadPoolExecutor.java:603)
at java.lang.Thread.run(Thread.java:636)
Archiving artifacts
Recording test results