You are viewing a plain text version of this content. The canonical link for it is here.
Posted to issues@bookkeeper.apache.org by Apache Jenkins Server <je...@builds.apache.org> on 2018/10/03 13:03:15 UTC

Build failed in Jenkins: bookkeeper_release_branch_47_java9 #176

See <https://builds.apache.org/job/bookkeeper_release_branch_47_java9/176/display/redirect>

------------------------------------------
[...truncated 504.52 KB...]
2018-10-03T12:59:45.297 [INFO] Downloaded: https://repo.maven.apache.org/maven2/org/apache/directory/api/api-ldap-extras-trigger/1.0.0-M20/api-ldap-extras-trigger-1.0.0-M20.jar (49 kB at 93 kB/s)
2018-10-03T12:59:45.297 [INFO] Downloading: https://repo.maven.apache.org/maven2/org/apache/directory/server/apacheds-core-shared/2.0.0-M15/apacheds-core-shared-2.0.0-M15.jar
2018-10-03T12:59:45.304 [INFO] Downloaded: https://repo.maven.apache.org/maven2/org/apache/directory/server/apacheds-protocol-shared/2.0.0-M15/apacheds-protocol-shared-2.0.0-M15.jar (32 kB at 61 kB/s)
2018-10-03T12:59:45.304 [INFO] Downloading: https://repo.maven.apache.org/maven2/org/apache/directory/server/apacheds-ldif-partition/2.0.0-M15/apacheds-ldif-partition-2.0.0-M15.jar
2018-10-03T12:59:45.315 [INFO] Downloaded: https://repo.maven.apache.org/maven2/org/apache/directory/server/apacheds-core-shared/2.0.0-M15/apacheds-core-shared-2.0.0-M15.jar (38 kB at 70 kB/s)
2018-10-03T12:59:45.315 [INFO] Downloading: https://repo.maven.apache.org/maven2/org/apache/directory/server/apacheds-xdbm-partition/2.0.0-M15/apacheds-xdbm-partition-2.0.0-M15.jar
2018-10-03T12:59:45.318 [INFO] Downloaded: https://repo.maven.apache.org/maven2/org/apache/directory/server/apacheds-protocol-kerberos/2.0.0-M15/apacheds-protocol-kerberos-2.0.0-M15.jar (85 kB at 156 kB/s)
2018-10-03T12:59:45.318 [INFO] Downloading: https://repo.maven.apache.org/maven2/org/apache/directory/server/apacheds-mavibot-partition/2.0.0-M15/apacheds-mavibot-partition-2.0.0-M15.jar
2018-10-03T12:59:45.320 [INFO] Downloaded: https://repo.maven.apache.org/maven2/org/apache/directory/server/apacheds-ldif-partition/2.0.0-M15/apacheds-ldif-partition-2.0.0-M15.jar (29 kB at 54 kB/s)
2018-10-03T12:59:45.320 [INFO] Downloading: https://repo.maven.apache.org/maven2/org/apache/directory/mavibot/mavibot/1.0.0-M1/mavibot-1.0.0-M1.jar
2018-10-03T12:59:45.338 [INFO] Downloaded: https://repo.maven.apache.org/maven2/org/apache/directory/server/apacheds-mavibot-partition/2.0.0-M15/apacheds-mavibot-partition-2.0.0-M15.jar (48 kB at 86 kB/s)
2018-10-03T12:59:45.338 [INFO] Downloading: https://repo.maven.apache.org/maven2/org/apache/directory/server/apacheds-core-avl/2.0.0-M15/apacheds-core-avl-2.0.0-M15.jar
2018-10-03T12:59:45.349 [INFO] Downloaded: https://repo.maven.apache.org/maven2/org/apache/directory/mavibot/mavibot/1.0.0-M1/mavibot-1.0.0-M1.jar (149 kB at 260 kB/s)
2018-10-03T12:59:45.349 [INFO] Downloading: https://repo.maven.apache.org/maven2/org/apache/directory/api/api-all/1.0.0-M20/api-all-1.0.0-M20.jar
2018-10-03T12:59:45.355 [INFO] Downloaded: https://repo.maven.apache.org/maven2/org/apache/directory/server/apacheds-xdbm-partition/2.0.0-M15/apacheds-xdbm-partition-2.0.0-M15.jar (177 kB at 306 kB/s)
2018-10-03T12:59:45.355 [INFO] Downloading: https://repo.maven.apache.org/maven2/commons-pool/commons-pool/1.6/commons-pool-1.6.jar
2018-10-03T12:59:45.356 [INFO] Downloaded: https://repo.maven.apache.org/maven2/org/apache/directory/server/apacheds-core-avl/2.0.0-M15/apacheds-core-avl-2.0.0-M15.jar (61 kB at 105 kB/s)
2018-10-03T12:59:45.356 [INFO] Downloading: https://repo.maven.apache.org/maven2/org/apache/directory/server/apacheds-jdbm-partition/2.0.0-M15/apacheds-jdbm-partition-2.0.0-M15.jar
2018-10-03T12:59:45.365 [INFO] Downloaded: https://repo.maven.apache.org/maven2/org/apache/directory/server/apacheds-kerberos-codec/2.0.0-M15/apacheds-kerberos-codec-2.0.0-M15.jar (691 kB at 1.2 MB/s)
2018-10-03T12:59:45.365 [INFO] Downloading: https://repo.maven.apache.org/maven2/org/apache/directory/jdbm/apacheds-jdbm1/2.0.0-M2/apacheds-jdbm1-2.0.0-M2.jar
2018-10-03T12:59:45.375 [INFO] Downloaded: https://repo.maven.apache.org/maven2/org/apache/directory/server/apacheds-jdbm-partition/2.0.0-M15/apacheds-jdbm-partition-2.0.0-M15.jar (72 kB at 121 kB/s)
2018-10-03T12:59:45.375 [INFO] Downloading: https://repo.maven.apache.org/maven2/org/apache/directory/server/apacheds-protocol-ldap/2.0.0-M15/apacheds-protocol-ldap-2.0.0-M15.jar
2018-10-03T12:59:45.384 [INFO] Downloaded: https://repo.maven.apache.org/maven2/commons-pool/commons-pool/1.6/commons-pool-1.6.jar (111 kB at 183 kB/s)
2018-10-03T12:59:45.384 [INFO] Downloading: https://repo.maven.apache.org/maven2/org/apache/directory/api/api-asn1-ber/1.0.0-M20/api-asn1-ber-1.0.0-M20.jar
2018-10-03T12:59:45.387 [INFO] Downloaded: https://repo.maven.apache.org/maven2/org/apache/directory/jdbm/apacheds-jdbm1/2.0.0-M2/apacheds-jdbm1-2.0.0-M2.jar (105 kB at 172 kB/s)
2018-10-03T12:59:45.387 [INFO] Downloading: https://repo.maven.apache.org/maven2/org/apache/directory/api/api-ldap-extras-codec-api/1.0.0-M20/api-ldap-extras-codec-api-1.0.0-M20.jar
2018-10-03T12:59:45.402 [INFO] Downloaded: https://repo.maven.apache.org/maven2/org/apache/directory/api/api-asn1-ber/1.0.0-M20/api-asn1-ber-1.0.0-M20.jar (42 kB at 67 kB/s)
2018-10-03T12:59:45.402 [INFO] Downloading: https://repo.maven.apache.org/maven2/org/apache/directory/api/api-ldap-extras-codec/1.0.0-M20/api-ldap-extras-codec-1.0.0-M20.jar
2018-10-03T12:59:45.406 [INFO] Downloaded: https://repo.maven.apache.org/maven2/org/apache/directory/api/api-ldap-extras-codec-api/1.0.0-M20/api-ldap-extras-codec-api-1.0.0-M20.jar (55 kB at 87 kB/s)
2018-10-03T12:59:45.406 [INFO] Downloading: https://repo.maven.apache.org/maven2/org/apache/directory/api/api-ldap-extras-sp/1.0.0-M20/api-ldap-extras-sp-1.0.0-M20.jar
2018-10-03T12:59:45.410 [INFO] Downloaded: https://repo.maven.apache.org/maven2/org/apache/directory/server/apacheds-protocol-ldap/2.0.0-M15/apacheds-protocol-ldap-2.0.0-M15.jar (228 kB at 361 kB/s)
2018-10-03T12:59:45.410 [INFO] Downloading: https://repo.maven.apache.org/maven2/bouncycastle/bcprov-jdk15/140/bcprov-jdk15-140.jar
2018-10-03T12:59:45.418 [INFO] Downloaded: https://repo.maven.apache.org/maven2/org/apache/directory/api/api-ldap-extras-sp/1.0.0-M20/api-ldap-extras-sp-1.0.0-M20.jar (13 kB at 20 kB/s)
2018-10-03T12:59:45.418 [INFO] Downloading: https://repo.maven.apache.org/maven2/org/apache/zookeeper/zookeeper/3.4.13/zookeeper-3.4.13-tests.jar
2018-10-03T12:59:45.437 [INFO] Downloaded: https://repo.maven.apache.org/maven2/org/apache/directory/api/api-ldap-extras-codec/1.0.0-M20/api-ldap-extras-codec-1.0.0-M20.jar (208 kB at 315 kB/s)
2018-10-03T12:59:45.501 [INFO] Downloaded: https://repo.maven.apache.org/maven2/org/apache/zookeeper/zookeeper/3.4.13/zookeeper-3.4.13-tests.jar (727 kB at 1.0 MB/s)
2018-10-03T12:59:45.579 [INFO] Downloaded: https://repo.maven.apache.org/maven2/bouncycastle/bcprov-jdk15/140/bcprov-jdk15-140.jar (1.6 MB at 2.0 MB/s)
2018-10-03T12:59:45.645 [INFO] Downloaded: https://repo.maven.apache.org/maven2/org/apache/directory/api/api-all/1.0.0-M20/api-all-1.0.0-M20.jar (2.8 MB at 3.2 MB/s)
2018-10-03T12:59:46.285 [INFO] Downloaded: https://repo.maven.apache.org/maven2/org/rocksdb/rocksdbjni/5.13.1/rocksdbjni-5.13.1.jar (14 MB at 9.1 MB/s)
2018-10-03T12:59:46.317 [INFO] 
2018-10-03T12:59:46.317 [INFO] --- maven-clean-plugin:3.0.0:clean (default-clean) @ bookkeeper-server ---
2018-10-03T12:59:46.514 [INFO] 
2018-10-03T12:59:46.514 [INFO] --- apache-rat-plugin:0.12:check (default-cli) @ bookkeeper-server ---
2018-10-03T12:59:46.726 [INFO] Enabled default license matchers.
2018-10-03T12:59:46.729 [INFO] Will parse SCM ignores for exclusions...
2018-10-03T12:59:46.730 [INFO] Finished adding exclusions from SCM ignore files.
2018-10-03T12:59:46.730 [INFO] 61 implicit excludes (use -debug for more details).
2018-10-03T12:59:46.730 [INFO] Exclude: **/target/**/*
2018-10-03T12:59:46.730 [INFO] Exclude: **/.classpath
2018-10-03T12:59:46.730 [INFO] Exclude: **/.gitignore
2018-10-03T12:59:46.730 [INFO] Exclude: **/.project
2018-10-03T12:59:46.730 [INFO] Exclude: **/.checkstyle
2018-10-03T12:59:46.730 [INFO] Exclude: **/.settings/*
2018-10-03T12:59:46.730 [INFO] Exclude: src/test/resources/server-key.pem
2018-10-03T12:59:46.730 [INFO] Exclude: src/test/resources/server-key.p12
2018-10-03T12:59:46.730 [INFO] Exclude: src/test/resources/server-key.jks
2018-10-03T12:59:46.730 [INFO] Exclude: src/test/resources/server-cert.pem
2018-10-03T12:59:46.730 [INFO] Exclude: src/test/resources/client-key.pem
2018-10-03T12:59:46.731 [INFO] Exclude: src/test/resources/client-key.p12
2018-10-03T12:59:46.731 [INFO] Exclude: src/test/resources/client-key.jks
2018-10-03T12:59:46.731 [INFO] Exclude: src/test/resources/client-cert.pem
2018-10-03T12:59:46.731 [INFO] Exclude: src/test/resources/keyStoreClientPassword.txt
2018-10-03T12:59:46.731 [INFO] Exclude: src/test/resources/keyStoreServerPassword.txt
2018-10-03T12:59:46.756 [INFO] 637 resources included (use -debug for more details)
2018-10-03T12:59:47.134 [INFO] Rat check: Summary over all files. Unapproved: 0, unknown: 0, generated: 0, approved: 637 licenses.
2018-10-03T12:59:47.293 [INFO] 
2018-10-03T12:59:47.293 [INFO] --- maven-checkstyle-plugin:3.0.0:check (checkstyle) @ bookkeeper-server ---
2018-10-03T13:00:14.626 [INFO] Starting audit...
[ERROR] <https://builds.apache.org/job/bookkeeper_release_branch_47_java9/ws/bookkeeper-server/src/main/java/org/apache/bookkeeper/client/PendingReadOp.java>:537: Line is longer than 120 characters (found 125). [LineLength]
[ERROR] <https://builds.apache.org/job/bookkeeper_release_branch_47_java9/ws/bookkeeper-server/src/main/java/org/apache/bookkeeper/client/ReadLastConfirmedAndEntryOp.java>:498: Line is longer than 120 characters (found 128). [LineLength]
Audit done.
2018-10-03T13:00:14.626 [INFO] There are 2 errors reported by Checkstyle 6.19 with bookkeeper/checkstyle.xml ruleset.
2018-10-03T13:00:14.665 [ERROR] src/main/java/org/apache/bookkeeper/client/PendingReadOp.java:[537] (sizes) LineLength: Line is longer than 120 characters (found 125).
2018-10-03T13:00:14.666 [ERROR] src/main/java/org/apache/bookkeeper/client/ReadLastConfirmedAndEntryOp.java:[498] (sizes) LineLength: Line is longer than 120 characters (found 128).
[JENKINS] Archiving disabled
[JENKINS] Archiving disabled
[JENKINS] Archiving disabled
[JENKINS] Archiving disabled
[JENKINS] Archiving disabled
[JENKINS] Archiving disabled
[JENKINS] Archiving disabled
[JENKINS] Archiving disabled
[JENKINS] Archiving disabled
[JENKINS] Archiving disabled
[JENKINS] Archiving disabled
[JENKINS] Archiving disabled
[JENKINS] Archiving disabled
[JENKINS] Archiving disabled
[JENKINS] Archiving disabled
[JENKINS] Archiving disabled
[JENKINS] Archiving disabled
[JENKINS] Archiving disabled
[JENKINS] Archiving disabled
[JENKINS] Archiving disabled
[JENKINS] Archiving disabled
[JENKINS] Archiving disabled
[JENKINS] Archiving disabled
[JENKINS] Archiving disabled
[JENKINS] Archiving disabled
[JENKINS] Archiving disabled
[JENKINS] Archiving disabled
[JENKINS] Archiving disabled
[JENKINS] Archiving disabled
[JENKINS] Archiving disabled
[JENKINS] Archiving disabled
[JENKINS] Archiving disabled
[JENKINS] Archiving disabled
[JENKINS] Archiving disabled
[JENKINS] Archiving disabled
[JENKINS] Archiving disabled
[JENKINS] Archiving disabled
[JENKINS] Archiving disabled
[JENKINS] Archiving disabled
[JENKINS] Archiving disabled
[JENKINS] Archiving disabled
[JENKINS] Archiving disabled
[JENKINS] Archiving disabled
[JENKINS] Archiving disabled
[JENKINS] Archiving disabled
[JENKINS] Archiving disabled
[JENKINS] Archiving disabled
[JENKINS] Archiving disabled
[JENKINS] Archiving disabled
[JENKINS] Archiving disabled
[JENKINS] Archiving disabled
[JENKINS] Archiving disabled
[JENKINS] Archiving disabled
[JENKINS] Archiving disabled
[JENKINS] Archiving disabled
[JENKINS] Archiving disabled
[JENKINS] Archiving disabled
[JENKINS] Archiving disabled
[JENKINS] Archiving disabled
[JENKINS] Archiving disabled
[JENKINS] Archiving disabled
[JENKINS] Archiving disabled
[JENKINS] Archiving disabled
[JENKINS] Archiving disabled
[JENKINS] Archiving disabled
[JENKINS] Archiving disabled
[JENKINS] Archiving disabled
[JENKINS] Archiving disabled
[JENKINS] Archiving disabled
[JENKINS] Archiving disabled
[JENKINS] Archiving disabled
[JENKINS] Archiving disabled
[JENKINS] Archiving disabled
[JENKINS] Archiving disabled
[JENKINS] Archiving disabled
[JENKINS] Archiving disabled
[JENKINS] Archiving disabled
2018-10-03T13:01:03.249 [INFO] ------------------------------------------------------------------------
2018-10-03T13:01:03.249 [INFO] Reactor Summary:
2018-10-03T13:01:03.249 [INFO] 
2018-10-03T13:01:03.250 [INFO] Apache BookKeeper :: Parent ........................ SUCCESS [ 15.349 s]
2018-10-03T13:01:03.250 [INFO] Apache BookKeeper :: Build Tools ................... SUCCESS [  7.110 s]
2018-10-03T13:01:03.250 [INFO] Apache BookKeeper :: Circe Checksum Library ........ SUCCESS [01:47 min]
2018-10-03T13:01:03.250 [INFO] Apache BookKeeper :: Stats API ..................... SUCCESS [ 17.364 s]
2018-10-03T13:01:03.250 [INFO] Apache BookKeeper :: Common ........................ SUCCESS [ 40.232 s]
2018-10-03T13:01:03.251 [INFO] Apache BookKeeper :: Protocols ..................... SUCCESS [ 27.040 s]
2018-10-03T13:01:03.251 [INFO] Apache BookKeeper :: Http :: Http Server ........... SUCCESS [ 12.309 s]
2018-10-03T13:01:03.251 [INFO] Apache BookKeeper :: Server ........................ FAILURE [ 32.794 s]
2018-10-03T13:01:03.251 [INFO] Apache BookKeeper :: Tools ......................... SKIPPED
2018-10-03T13:01:03.251 [INFO] Apache BookKeeper :: Benchmark ..................... SKIPPED
2018-10-03T13:01:03.251 [INFO] Apache BookKeeper :: Stats Providers :: Twitter Finagle Stats SKIPPED
2018-10-03T13:01:03.251 [INFO] Apache BookKeeper :: Stats Providers :: Twitter Science Stats SKIPPED
2018-10-03T13:01:03.251 [INFO] Apache BookKeeper :: Stats Providers :: Twitter Ostrich Stats SKIPPED
2018-10-03T13:01:03.251 [INFO] Apache BookKeeper :: Stats Providers :: Codahale Metrics SKIPPED
2018-10-03T13:01:03.251 [INFO] Apache BookKeeper :: Stats Providers :: Prometheus . SKIPPED
2018-10-03T13:01:03.251 [INFO] Apache BookKeeper :: Stats Providers ............... SKIPPED
2018-10-03T13:01:03.251 [INFO] Apache BookKeeper :: Bookkeeper Http :: Twitter Http Server SKIPPED
2018-10-03T13:01:03.251 [INFO] Apache BookKeeper :: Bookkeeper Http :: Vertx Http Server SKIPPED
2018-10-03T13:01:03.251 [INFO] Apache BookKeeper :: Http .......................... SKIPPED
2018-10-03T13:01:03.251 [INFO] Apache BookKeeper :: Shaded :: Parent .............. SKIPPED
2018-10-03T13:01:03.251 [INFO] Apache BookKeeper :: Shaded :: bookkeeper-server-shaded SKIPPED
2018-10-03T13:01:03.252 [INFO] Apache BookKeeper :: Shaded :: bookkeeper-server-tests-shaded SKIPPED
2018-10-03T13:01:03.252 [INFO] Apache BookKeeper :: DistributedLog :: Parent ...... SKIPPED
2018-10-03T13:01:03.252 [INFO] Apache BookKeeper :: DistributedLog :: Common ...... SKIPPED
2018-10-03T13:01:03.252 [INFO] Apache BookKeeper :: DistributedLog :: Protocol .... SKIPPED
2018-10-03T13:01:03.252 [INFO] Apache BookKeeper :: DistributedLog :: Core Library  SKIPPED
2018-10-03T13:01:03.252 [INFO] Apache BookKeeper :: Shaded :: distributedlog-core-shaded SKIPPED
2018-10-03T13:01:03.252 [INFO] Apache BookKeeper :: Tests ......................... SKIPPED
2018-10-03T13:01:03.252 [INFO] Apache BookKeeper :: Tests :: Test Shaded Jars ..... SKIPPED
2018-10-03T13:01:03.252 [INFO] Apache BookKeeper :: Tests :: bookkeeper-server-shaded test SKIPPED
2018-10-03T13:01:03.252 [INFO] Apache BookKeeper :: Tests :: bookkeeper-server-tests-shaded test SKIPPED
2018-10-03T13:01:03.252 [INFO] Apache BookKeeper :: Tests :: distributedlog-core-shaded test SKIPPED
2018-10-03T13:01:03.252 [INFO] Apache BookKeeper :: Tests :: Docker Images ........ SKIPPED
2018-10-03T13:01:03.252 [INFO] Apache BookKeeper :: Tests :: Docker Images :: All Released Versions SKIPPED
2018-10-03T13:01:03.252 [INFO] Apache BookKeeper :: Stream Storage :: Parent ...... SKIPPED
2018-10-03T13:01:03.252 [INFO] Apache BookKeeper :: Stream Storage :: Common Classes for Tests SKIPPED
2018-10-03T13:01:03.252 [INFO] Apache BookKeeper :: Stream Storage :: Common ...... SKIPPED
2018-10-03T13:01:03.252 [INFO] Apache BookKeeper :: Stream Storage :: Proto ....... SKIPPED
2018-10-03T13:01:03.252 [INFO] Apache BookKeeper :: Stream Storage :: Storage :: Parent SKIPPED
2018-10-03T13:01:03.252 [INFO] Apache BookKeeper :: Stream Storage :: Storage :: Api SKIPPED
2018-10-03T13:01:03.252 [INFO] Apache BookKeeper :: Stream Storage :: API ......... SKIPPED
2018-10-03T13:01:03.252 [INFO] Apache BookKeeper :: Stream Storage :: Clients :: Parent SKIPPED
2018-10-03T13:01:03.252 [INFO] Apache BookKeeper :: Stream Storage :: Clients :: Java Client :: Parent SKIPPED
2018-10-03T13:01:03.252 [INFO] Apache BookKeeper :: Stream Storage :: Clients :: Java Client :: Base SKIPPED
2018-10-03T13:01:03.252 [INFO] Apache BookKeeper :: Stream Storage :: State Library SKIPPED
2018-10-03T13:01:03.252 [INFO] Apache BookKeeper :: Stream Storage :: Storage :: Impl SKIPPED
2018-10-03T13:01:03.252 [INFO] Apache BookKeeper :: Stream Storage :: Clients :: Java Client :: KV SKIPPED
2018-10-03T13:01:03.252 [INFO] Apache BookKeeper :: Stream Storage :: Clients :: Java Client SKIPPED
2018-10-03T13:01:03.252 [INFO] Apache BookKeeper :: Stream Storage :: Server ...... SKIPPED
2018-10-03T13:01:03.252 [INFO] Apache BookKeeper :: Dist (Parent) ................. SKIPPED
2018-10-03T13:01:03.252 [INFO] Apache BookKeeper :: Dist (Server) ................. SKIPPED
2018-10-03T13:01:03.252 [INFO] Apache BookKeeper :: Tests :: Docker Images :: All Versions SKIPPED
2018-10-03T13:01:03.252 [INFO] Apache BookKeeper :: Tests :: Docker Images :: Current Version SKIPPED
2018-10-03T13:01:03.252 [INFO] Apache BookKeeper :: Tests :: Utility module for Arquillian based integration tests SKIPPED
2018-10-03T13:01:03.253 [INFO] Apache BookKeeper :: Tests :: Common topologies for Docker based integration tests SKIPPED
2018-10-03T13:01:03.253 [INFO] Apache BookKeeper :: Tests :: Base module for Arquillian based integration tests SKIPPED
2018-10-03T13:01:03.253 [INFO] Apache BookKeeper :: Tests :: Base module for Arquillian based integration tests using groovy SKIPPED
2018-10-03T13:01:03.253 [INFO] Apache BookKeeper :: Tests :: Backward Compatibility SKIPPED
2018-10-03T13:01:03.253 [INFO] Apache BookKeeper :: Tests :: Backward Compatibility :: Test upgrade between all released versions and current version SKIPPED
2018-10-03T13:01:03.253 [INFO] Apache BookKeeper :: Tests :: Backward Compatibility :: Test upgrade between 4.1.0 and current version SKIPPED
2018-10-03T13:01:03.253 [INFO] Apache BookKeeper :: Tests :: Backward Compatibility :: Test compat between old version and new version of hierarchical ledger manager SKIPPED
2018-10-03T13:01:03.253 [INFO] Apache BookKeeper :: Tests :: Backward Compatibility :: Test upgrade between 4.1.0 and current version (with hostname bookie ID) SKIPPED
2018-10-03T13:01:03.253 [INFO] Apache BookKeeper :: Tests :: Backward Compatibility :: Test recovery does not work when password no in metadata SKIPPED
2018-10-03T13:01:03.253 [INFO] Apache BookKeeper :: Tests :: Backward Compatibility :: Test upgrade 4.1.0 to current in cluster with cookies SKIPPED
2018-10-03T13:01:03.253 [INFO] Apache BookKeeper :: Tests :: Backward Compatibility :: Test old clients working on current server SKIPPED
2018-10-03T13:01:03.253 [INFO] Apache BookKeeper :: Tests :: Backward Compatibility :: Test upgrade between yahoo custom version and current SKIPPED
2018-10-03T13:01:03.253 [INFO] Apache BookKeeper :: Tests :: Integration .......... SKIPPED
2018-10-03T13:01:03.253 [INFO] Apache BookKeeper :: Tests :: Integration :: Smoke test SKIPPED
2018-10-03T13:01:03.253 [INFO] Apache BookKeeper :: Tests :: Integration :: Standalone test SKIPPED
2018-10-03T13:01:03.253 [INFO] Apache BookKeeper :: Tests :: Integration :: Cluster test SKIPPED
2018-10-03T13:01:03.253 [INFO] Apache BookKeeper :: Tests :: Bash Scripts Test .... SKIPPED
2018-10-03T13:01:03.253 [INFO] Apache BookKeeper :: Dist (All) .................... SKIPPED
2018-10-03T13:01:03.253 [INFO] Apache BookKeeper :: microbenchmarks ............... SKIPPED
2018-10-03T13:01:03.253 [INFO] Apache BookKeeper :: DistributedLog :: IO :: FileSystem SKIPPED
2018-10-03T13:01:03.253 [INFO] Apache BookKeeper :: DistributedLog :: IO .......... SKIPPED
2018-10-03T13:01:03.253 [INFO] Apache BookKeeper :: Stream Storage :: CLI ......... SKIPPED
2018-10-03T13:01:03.253 [INFO] ------------------------------------------------------------------------
2018-10-03T13:01:03.253 [INFO] BUILD FAILURE
2018-10-03T13:01:03.253 [INFO] ------------------------------------------------------------------------
2018-10-03T13:01:03.253 [INFO] Total time: 06:00 min
2018-10-03T13:01:03.254 [INFO] Finished at: 2018-10-03T13:01:03Z
2018-10-03T13:01:04.575 [INFO] Final Memory: 106M/2048M
2018-10-03T13:01:04.576 [INFO] ------------------------------------------------------------------------
Waiting for Jenkins to finish collecting data
2018-10-03T13:01:05.075 [ERROR] Failed to execute goal org.apache.maven.plugins:maven-checkstyle-plugin:3.0.0:check (checkstyle) on project bookkeeper-server: You have 2 Checkstyle violations. -> [Help 1]
2018-10-03T13:01:05.075 [ERROR] 
2018-10-03T13:01:05.075 [ERROR] To see the full stack trace of the errors, re-run Maven with the -e switch.
2018-10-03T13:01:05.075 [ERROR] Re-run Maven using the -X switch to enable full debug logging.
2018-10-03T13:01:05.075 [ERROR] 
2018-10-03T13:01:05.075 [ERROR] For more information about the errors and possible solutions, please read the following articles:
2018-10-03T13:01:05.075 [ERROR] [Help 1] http://cwiki.apache.org/confluence/display/MAVEN/MojoFailureException
2018-10-03T13:01:05.076 [ERROR] 
2018-10-03T13:01:05.076 [ERROR] After correcting the problems, you can resume the build with the command
2018-10-03T13:01:05.076 [ERROR]   mvn <goals> -rf :bookkeeper-server
channel stopped

Jenkins build is back to normal : bookkeeper_release_branch_47_java9 #180

Posted by Apache Jenkins Server <je...@builds.apache.org>.
See <https://builds.apache.org/job/bookkeeper_release_branch_47_java9/180/display/redirect?page=changes>


Build failed in Jenkins: bookkeeper_release_branch_47_java9 #179

Posted by Apache Jenkins Server <je...@builds.apache.org>.
See <https://builds.apache.org/job/bookkeeper_release_branch_47_java9/179/display/redirect?page=changes>

Changes:

[sijie] Issue #1740: IOUtils.close() only accepts Closeable as a vararg which

------------------------------------------
[...truncated 504.19 KB...]
2018-10-06T12:38:47.562 [INFO] Downloaded: https://repo.maven.apache.org/maven2/org/apache/directory/api/api-ldap-extras-trigger/1.0.0-M20/api-ldap-extras-trigger-1.0.0-M20.jar (49 kB at 100 kB/s)
2018-10-06T12:38:47.562 [INFO] Downloading: https://repo.maven.apache.org/maven2/org/apache/directory/server/apacheds-core-shared/2.0.0-M15/apacheds-core-shared-2.0.0-M15.jar
2018-10-06T12:38:47.571 [INFO] Downloaded: https://repo.maven.apache.org/maven2/org/apache/directory/server/apacheds-protocol-shared/2.0.0-M15/apacheds-protocol-shared-2.0.0-M15.jar (32 kB at 65 kB/s)
2018-10-06T12:38:47.571 [INFO] Downloading: https://repo.maven.apache.org/maven2/org/apache/directory/server/apacheds-ldif-partition/2.0.0-M15/apacheds-ldif-partition-2.0.0-M15.jar
2018-10-06T12:38:47.577 [INFO] Downloaded: https://repo.maven.apache.org/maven2/org/apache/directory/server/apacheds-core-shared/2.0.0-M15/apacheds-core-shared-2.0.0-M15.jar (38 kB at 75 kB/s)
2018-10-06T12:38:47.577 [INFO] Downloading: https://repo.maven.apache.org/maven2/org/apache/directory/server/apacheds-xdbm-partition/2.0.0-M15/apacheds-xdbm-partition-2.0.0-M15.jar
2018-10-06T12:38:47.581 [INFO] Downloaded: https://repo.maven.apache.org/maven2/org/apache/directory/server/apacheds-protocol-kerberos/2.0.0-M15/apacheds-protocol-kerberos-2.0.0-M15.jar (85 kB at 167 kB/s)
2018-10-06T12:38:47.581 [INFO] Downloading: https://repo.maven.apache.org/maven2/org/apache/directory/server/apacheds-mavibot-partition/2.0.0-M15/apacheds-mavibot-partition-2.0.0-M15.jar
2018-10-06T12:38:47.586 [INFO] Downloaded: https://repo.maven.apache.org/maven2/org/apache/directory/server/apacheds-ldif-partition/2.0.0-M15/apacheds-ldif-partition-2.0.0-M15.jar (29 kB at 57 kB/s)
2018-10-06T12:38:47.586 [INFO] Downloading: https://repo.maven.apache.org/maven2/org/apache/directory/mavibot/mavibot/1.0.0-M1/mavibot-1.0.0-M1.jar
2018-10-06T12:38:47.597 [INFO] Downloaded: https://repo.maven.apache.org/maven2/org/apache/directory/server/apacheds-mavibot-partition/2.0.0-M15/apacheds-mavibot-partition-2.0.0-M15.jar (48 kB at 92 kB/s)
2018-10-06T12:38:47.597 [INFO] Downloading: https://repo.maven.apache.org/maven2/org/apache/directory/server/apacheds-core-avl/2.0.0-M15/apacheds-core-avl-2.0.0-M15.jar
2018-10-06T12:38:47.606 [INFO] Downloaded: https://repo.maven.apache.org/maven2/org/apache/directory/server/apacheds-xdbm-partition/2.0.0-M15/apacheds-xdbm-partition-2.0.0-M15.jar (177 kB at 332 kB/s)
2018-10-06T12:38:47.607 [INFO] Downloading: https://repo.maven.apache.org/maven2/org/apache/directory/api/api-all/1.0.0-M20/api-all-1.0.0-M20.jar
2018-10-06T12:38:47.612 [INFO] Downloaded: https://repo.maven.apache.org/maven2/org/apache/directory/mavibot/mavibot/1.0.0-M1/mavibot-1.0.0-M1.jar (149 kB at 277 kB/s)
2018-10-06T12:38:47.612 [INFO] Downloading: https://repo.maven.apache.org/maven2/commons-pool/commons-pool/1.6/commons-pool-1.6.jar
2018-10-06T12:38:47.613 [INFO] Downloaded: https://repo.maven.apache.org/maven2/org/apache/directory/server/apacheds-core-avl/2.0.0-M15/apacheds-core-avl-2.0.0-M15.jar (61 kB at 113 kB/s)
2018-10-06T12:38:47.613 [INFO] Downloading: https://repo.maven.apache.org/maven2/org/apache/directory/server/apacheds-jdbm-partition/2.0.0-M15/apacheds-jdbm-partition-2.0.0-M15.jar
2018-10-06T12:38:47.632 [INFO] Downloaded: https://repo.maven.apache.org/maven2/org/apache/directory/server/apacheds-jdbm-partition/2.0.0-M15/apacheds-jdbm-partition-2.0.0-M15.jar (72 kB at 130 kB/s)
2018-10-06T12:38:47.632 [INFO] Downloading: https://repo.maven.apache.org/maven2/org/apache/directory/jdbm/apacheds-jdbm1/2.0.0-M2/apacheds-jdbm1-2.0.0-M2.jar
2018-10-06T12:38:47.633 [INFO] Downloaded: https://repo.maven.apache.org/maven2/commons-pool/commons-pool/1.6/commons-pool-1.6.jar (111 kB at 199 kB/s)
2018-10-06T12:38:47.633 [INFO] Downloading: https://repo.maven.apache.org/maven2/org/apache/directory/server/apacheds-protocol-ldap/2.0.0-M15/apacheds-protocol-ldap-2.0.0-M15.jar
2018-10-06T12:38:47.637 [INFO] Downloaded: https://repo.maven.apache.org/maven2/org/apache/directory/server/apacheds-kerberos-codec/2.0.0-M15/apacheds-kerberos-codec-2.0.0-M15.jar (691 kB at 1.2 MB/s)
2018-10-06T12:38:47.637 [INFO] Downloading: https://repo.maven.apache.org/maven2/org/apache/directory/api/api-asn1-ber/1.0.0-M20/api-asn1-ber-1.0.0-M20.jar
2018-10-06T12:38:47.652 [INFO] Downloaded: https://repo.maven.apache.org/maven2/org/apache/directory/api/api-asn1-ber/1.0.0-M20/api-asn1-ber-1.0.0-M20.jar (42 kB at 73 kB/s)
2018-10-06T12:38:47.652 [INFO] Downloading: https://repo.maven.apache.org/maven2/org/apache/directory/api/api-ldap-extras-codec-api/1.0.0-M20/api-ldap-extras-codec-api-1.0.0-M20.jar
2018-10-06T12:38:47.654 [INFO] Downloaded: https://repo.maven.apache.org/maven2/org/apache/directory/jdbm/apacheds-jdbm1/2.0.0-M2/apacheds-jdbm1-2.0.0-M2.jar (105 kB at 181 kB/s)
2018-10-06T12:38:47.654 [INFO] Downloading: https://repo.maven.apache.org/maven2/org/apache/directory/api/api-ldap-extras-codec/1.0.0-M20/api-ldap-extras-codec-1.0.0-M20.jar
2018-10-06T12:38:47.669 [INFO] Downloaded: https://repo.maven.apache.org/maven2/org/apache/directory/api/api-ldap-extras-codec-api/1.0.0-M20/api-ldap-extras-codec-api-1.0.0-M20.jar (55 kB at 92 kB/s)
2018-10-06T12:38:47.669 [INFO] Downloading: https://repo.maven.apache.org/maven2/org/apache/directory/api/api-ldap-extras-sp/1.0.0-M20/api-ldap-extras-sp-1.0.0-M20.jar
2018-10-06T12:38:47.669 [INFO] Downloaded: https://repo.maven.apache.org/maven2/org/apache/directory/server/apacheds-protocol-ldap/2.0.0-M15/apacheds-protocol-ldap-2.0.0-M15.jar (228 kB at 384 kB/s)
2018-10-06T12:38:47.669 [INFO] Downloading: https://repo.maven.apache.org/maven2/bouncycastle/bcprov-jdk15/140/bcprov-jdk15-140.jar
2018-10-06T12:38:47.681 [INFO] Downloaded: https://repo.maven.apache.org/maven2/org/apache/directory/api/api-ldap-extras-sp/1.0.0-M20/api-ldap-extras-sp-1.0.0-M20.jar (13 kB at 21 kB/s)
2018-10-06T12:38:47.681 [INFO] Downloading: https://repo.maven.apache.org/maven2/org/apache/zookeeper/zookeeper/3.4.13/zookeeper-3.4.13-tests.jar
2018-10-06T12:38:47.686 [INFO] Downloaded: https://repo.maven.apache.org/maven2/org/apache/directory/api/api-ldap-extras-codec/1.0.0-M20/api-ldap-extras-codec-1.0.0-M20.jar (208 kB at 340 kB/s)
2018-10-06T12:38:47.774 [INFO] Downloaded: https://repo.maven.apache.org/maven2/org/apache/zookeeper/zookeeper/3.4.13/zookeeper-3.4.13-tests.jar (727 kB at 1.0 MB/s)
2018-10-06T12:38:47.862 [INFO] Downloaded: https://repo.maven.apache.org/maven2/bouncycastle/bcprov-jdk15/140/bcprov-jdk15-140.jar (1.6 MB at 2.0 MB/s)
2018-10-06T12:38:47.915 [INFO] Downloaded: https://repo.maven.apache.org/maven2/org/apache/directory/api/api-all/1.0.0-M20/api-all-1.0.0-M20.jar (2.8 MB at 3.3 MB/s)
2018-10-06T12:38:48.672 [INFO] Downloaded: https://repo.maven.apache.org/maven2/org/rocksdb/rocksdbjni/5.13.1/rocksdbjni-5.13.1.jar (14 MB at 8.6 MB/s)
2018-10-06T12:38:48.714 [INFO] 
2018-10-06T12:38:48.714 [INFO] --- maven-clean-plugin:3.0.0:clean (default-clean) @ bookkeeper-server ---
2018-10-06T12:38:48.915 [INFO] 
2018-10-06T12:38:48.915 [INFO] --- apache-rat-plugin:0.12:check (default-cli) @ bookkeeper-server ---
2018-10-06T12:38:49.070 [INFO] Enabled default license matchers.
2018-10-06T12:38:49.076 [INFO] Will parse SCM ignores for exclusions...
2018-10-06T12:38:49.077 [INFO] Finished adding exclusions from SCM ignore files.
2018-10-06T12:38:49.077 [INFO] 61 implicit excludes (use -debug for more details).
2018-10-06T12:38:49.077 [INFO] Exclude: **/target/**/*
2018-10-06T12:38:49.077 [INFO] Exclude: **/.classpath
2018-10-06T12:38:49.077 [INFO] Exclude: **/.gitignore
2018-10-06T12:38:49.077 [INFO] Exclude: **/.project
2018-10-06T12:38:49.077 [INFO] Exclude: **/.checkstyle
2018-10-06T12:38:49.077 [INFO] Exclude: **/.settings/*
2018-10-06T12:38:49.077 [INFO] Exclude: src/test/resources/server-key.pem
2018-10-06T12:38:49.077 [INFO] Exclude: src/test/resources/server-key.p12
2018-10-06T12:38:49.077 [INFO] Exclude: src/test/resources/server-key.jks
2018-10-06T12:38:49.077 [INFO] Exclude: src/test/resources/server-cert.pem
2018-10-06T12:38:49.077 [INFO] Exclude: src/test/resources/client-key.pem
2018-10-06T12:38:49.077 [INFO] Exclude: src/test/resources/client-key.p12
2018-10-06T12:38:49.077 [INFO] Exclude: src/test/resources/client-key.jks
2018-10-06T12:38:49.077 [INFO] Exclude: src/test/resources/client-cert.pem
2018-10-06T12:38:49.077 [INFO] Exclude: src/test/resources/keyStoreClientPassword.txt
2018-10-06T12:38:49.077 [INFO] Exclude: src/test/resources/keyStoreServerPassword.txt
2018-10-06T12:38:49.111 [INFO] 637 resources included (use -debug for more details)
2018-10-06T12:38:50.071 [INFO] Rat check: Summary over all files. Unapproved: 0, unknown: 0, generated: 0, approved: 637 licenses.
2018-10-06T12:38:50.235 [INFO] 
2018-10-06T12:38:50.235 [INFO] --- maven-checkstyle-plugin:3.0.0:check (checkstyle) @ bookkeeper-server ---
2018-10-06T12:39:16.681 [INFO] Starting audit...
[ERROR] <https://builds.apache.org/job/bookkeeper_release_branch_47_java9/ws/bookkeeper-server/src/main/java/org/apache/bookkeeper/client/PendingReadOp.java>:537: Line is longer than 120 characters (found 125). [LineLength]
[ERROR] <https://builds.apache.org/job/bookkeeper_release_branch_47_java9/ws/bookkeeper-server/src/main/java/org/apache/bookkeeper/client/ReadLastConfirmedAndEntryOp.java>:498: Line is longer than 120 characters (found 128). [LineLength]
Audit done.
2018-10-06T12:39:16.681 [INFO] There are 2 errors reported by Checkstyle 6.19 with bookkeeper/checkstyle.xml ruleset.
2018-10-06T12:39:16.705 [ERROR] src/main/java/org/apache/bookkeeper/client/PendingReadOp.java:[537] (sizes) LineLength: Line is longer than 120 characters (found 125).
2018-10-06T12:39:16.707 [ERROR] src/main/java/org/apache/bookkeeper/client/ReadLastConfirmedAndEntryOp.java:[498] (sizes) LineLength: Line is longer than 120 characters (found 128).
[JENKINS] Archiving disabled
[JENKINS] Archiving disabled
[JENKINS] Archiving disabled
[JENKINS] Archiving disabled
[JENKINS] Archiving disabled
[JENKINS] Archiving disabled
[JENKINS] Archiving disabled
[JENKINS] Archiving disabled
[JENKINS] Archiving disabled
[JENKINS] Archiving disabled
[JENKINS] Archiving disabled
[JENKINS] Archiving disabled
[JENKINS] Archiving disabled
[JENKINS] Archiving disabled
[JENKINS] Archiving disabled
[JENKINS] Archiving disabled
[JENKINS] Archiving disabled
[JENKINS] Archiving disabled
[JENKINS] Archiving disabled
[JENKINS] Archiving disabled
[JENKINS] Archiving disabled
[JENKINS] Archiving disabled
[JENKINS] Archiving disabled
[JENKINS] Archiving disabled
[JENKINS] Archiving disabled
[JENKINS] Archiving disabled
[JENKINS] Archiving disabled
[JENKINS] Archiving disabled
[JENKINS] Archiving disabled
[JENKINS] Archiving disabled
[JENKINS] Archiving disabled
[JENKINS] Archiving disabled
[JENKINS] Archiving disabled
[JENKINS] Archiving disabled
[JENKINS] Archiving disabled
[JENKINS] Archiving disabled
[JENKINS] Archiving disabled
[JENKINS] Archiving disabled
[JENKINS] Archiving disabled
[JENKINS] Archiving disabled
[JENKINS] Archiving disabled
[JENKINS] Archiving disabled
[JENKINS] Archiving disabled
[JENKINS] Archiving disabled
[JENKINS] Archiving disabled
[JENKINS] Archiving disabled
[JENKINS] Archiving disabled
[JENKINS] Archiving disabled
[JENKINS] Archiving disabled
[JENKINS] Archiving disabled
[JENKINS] Archiving disabled
[JENKINS] Archiving disabled
[JENKINS] Archiving disabled
[JENKINS] Archiving disabled
[JENKINS] Archiving disabled
[JENKINS] Archiving disabled
[JENKINS] Archiving disabled
[JENKINS] Archiving disabled
[JENKINS] Archiving disabled
[JENKINS] Archiving disabled
[JENKINS] Archiving disabled
[JENKINS] Archiving disabled
[JENKINS] Archiving disabled
[JENKINS] Archiving disabled
[JENKINS] Archiving disabled
[JENKINS] Archiving disabled
[JENKINS] Archiving disabled
[JENKINS] Archiving disabled
[JENKINS] Archiving disabled
[JENKINS] Archiving disabled
[JENKINS] Archiving disabled
[JENKINS] Archiving disabled
[JENKINS] Archiving disabled
[JENKINS] Archiving disabled
[JENKINS] Archiving disabled
[JENKINS] Archiving disabled
[JENKINS] Archiving disabled
2018-10-06T12:40:26.313 [INFO] ------------------------------------------------------------------------
2018-10-06T12:40:26.313 [INFO] Reactor Summary:
2018-10-06T12:40:26.313 [INFO] 
2018-10-06T12:40:26.314 [INFO] Apache BookKeeper :: Parent ........................ SUCCESS [ 18.765 s]
2018-10-06T12:40:26.314 [INFO] Apache BookKeeper :: Build Tools ................... SUCCESS [  5.919 s]
2018-10-06T12:40:26.314 [INFO] Apache BookKeeper :: Circe Checksum Library ........ SUCCESS [01:49 min]
2018-10-06T12:40:26.314 [INFO] Apache BookKeeper :: Stats API ..................... SUCCESS [ 18.149 s]
2018-10-06T12:40:26.314 [INFO] Apache BookKeeper :: Common ........................ SUCCESS [ 43.740 s]
2018-10-06T12:40:26.314 [INFO] Apache BookKeeper :: Protocols ..................... SUCCESS [ 28.287 s]
2018-10-06T12:40:26.315 [INFO] Apache BookKeeper :: Http :: Http Server ........... SUCCESS [ 12.033 s]
2018-10-06T12:40:26.315 [INFO] Apache BookKeeper :: Server ........................ FAILURE [ 55.149 s]
2018-10-06T12:40:26.315 [INFO] Apache BookKeeper :: Tools ......................... SKIPPED
2018-10-06T12:40:26.315 [INFO] Apache BookKeeper :: Benchmark ..................... SKIPPED
2018-10-06T12:40:26.315 [INFO] Apache BookKeeper :: Stats Providers :: Twitter Finagle Stats SKIPPED
2018-10-06T12:40:26.315 [INFO] Apache BookKeeper :: Stats Providers :: Twitter Science Stats SKIPPED
2018-10-06T12:40:26.315 [INFO] Apache BookKeeper :: Stats Providers :: Twitter Ostrich Stats SKIPPED
2018-10-06T12:40:26.315 [INFO] Apache BookKeeper :: Stats Providers :: Codahale Metrics SKIPPED
2018-10-06T12:40:26.315 [INFO] Apache BookKeeper :: Stats Providers :: Prometheus . SKIPPED
2018-10-06T12:40:26.315 [INFO] Apache BookKeeper :: Stats Providers ............... SKIPPED
2018-10-06T12:40:26.315 [INFO] Apache BookKeeper :: Bookkeeper Http :: Twitter Http Server SKIPPED
2018-10-06T12:40:26.315 [INFO] Apache BookKeeper :: Bookkeeper Http :: Vertx Http Server SKIPPED
2018-10-06T12:40:26.316 [INFO] Apache BookKeeper :: Http .......................... SKIPPED
2018-10-06T12:40:26.316 [INFO] Apache BookKeeper :: Shaded :: Parent .............. SKIPPED
2018-10-06T12:40:26.316 [INFO] Apache BookKeeper :: Shaded :: bookkeeper-server-shaded SKIPPED
2018-10-06T12:40:26.316 [INFO] Apache BookKeeper :: Shaded :: bookkeeper-server-tests-shaded SKIPPED
2018-10-06T12:40:26.316 [INFO] Apache BookKeeper :: DistributedLog :: Parent ...... SKIPPED
2018-10-06T12:40:26.316 [INFO] Apache BookKeeper :: DistributedLog :: Common ...... SKIPPED
2018-10-06T12:40:26.316 [INFO] Apache BookKeeper :: DistributedLog :: Protocol .... SKIPPED
2018-10-06T12:40:26.316 [INFO] Apache BookKeeper :: DistributedLog :: Core Library  SKIPPED
2018-10-06T12:40:26.316 [INFO] Apache BookKeeper :: Shaded :: distributedlog-core-shaded SKIPPED
2018-10-06T12:40:26.316 [INFO] Apache BookKeeper :: Tests ......................... SKIPPED
2018-10-06T12:40:26.316 [INFO] Apache BookKeeper :: Tests :: Test Shaded Jars ..... SKIPPED
2018-10-06T12:40:26.316 [INFO] Apache BookKeeper :: Tests :: bookkeeper-server-shaded test SKIPPED
2018-10-06T12:40:26.316 [INFO] Apache BookKeeper :: Tests :: bookkeeper-server-tests-shaded test SKIPPED
2018-10-06T12:40:26.316 [INFO] Apache BookKeeper :: Tests :: distributedlog-core-shaded test SKIPPED
2018-10-06T12:40:26.317 [INFO] Apache BookKeeper :: Tests :: Docker Images ........ SKIPPED
2018-10-06T12:40:26.317 [INFO] Apache BookKeeper :: Tests :: Docker Images :: All Released Versions SKIPPED
2018-10-06T12:40:26.317 [INFO] Apache BookKeeper :: Stream Storage :: Parent ...... SKIPPED
2018-10-06T12:40:26.317 [INFO] Apache BookKeeper :: Stream Storage :: Common Classes for Tests SKIPPED
2018-10-06T12:40:26.317 [INFO] Apache BookKeeper :: Stream Storage :: Common ...... SKIPPED
2018-10-06T12:40:26.317 [INFO] Apache BookKeeper :: Stream Storage :: Proto ....... SKIPPED
2018-10-06T12:40:26.317 [INFO] Apache BookKeeper :: Stream Storage :: Storage :: Parent SKIPPED
2018-10-06T12:40:26.317 [INFO] Apache BookKeeper :: Stream Storage :: Storage :: Api SKIPPED
2018-10-06T12:40:26.317 [INFO] Apache BookKeeper :: Stream Storage :: API ......... SKIPPED
2018-10-06T12:40:26.317 [INFO] Apache BookKeeper :: Stream Storage :: Clients :: Parent SKIPPED
2018-10-06T12:40:26.317 [INFO] Apache BookKeeper :: Stream Storage :: Clients :: Java Client :: Parent SKIPPED
2018-10-06T12:40:26.317 [INFO] Apache BookKeeper :: Stream Storage :: Clients :: Java Client :: Base SKIPPED
2018-10-06T12:40:26.317 [INFO] Apache BookKeeper :: Stream Storage :: State Library SKIPPED
2018-10-06T12:40:26.318 [INFO] Apache BookKeeper :: Stream Storage :: Storage :: Impl SKIPPED
2018-10-06T12:40:26.318 [INFO] Apache BookKeeper :: Stream Storage :: Clients :: Java Client :: KV SKIPPED
2018-10-06T12:40:26.318 [INFO] Apache BookKeeper :: Stream Storage :: Clients :: Java Client SKIPPED
2018-10-06T12:40:26.318 [INFO] Apache BookKeeper :: Stream Storage :: Server ...... SKIPPED
2018-10-06T12:40:26.318 [INFO] Apache BookKeeper :: Dist (Parent) ................. SKIPPED
2018-10-06T12:40:26.318 [INFO] Apache BookKeeper :: Dist (Server) ................. SKIPPED
2018-10-06T12:40:26.318 [INFO] Apache BookKeeper :: Tests :: Docker Images :: All Versions SKIPPED
2018-10-06T12:40:26.318 [INFO] Apache BookKeeper :: Tests :: Docker Images :: Current Version SKIPPED
2018-10-06T12:40:26.318 [INFO] Apache BookKeeper :: Tests :: Utility module for Arquillian based integration tests SKIPPED
2018-10-06T12:40:26.318 [INFO] Apache BookKeeper :: Tests :: Common topologies for Docker based integration tests SKIPPED
2018-10-06T12:40:26.318 [INFO] Apache BookKeeper :: Tests :: Base module for Arquillian based integration tests SKIPPED
2018-10-06T12:40:26.318 [INFO] Apache BookKeeper :: Tests :: Base module for Arquillian based integration tests using groovy SKIPPED
2018-10-06T12:40:26.318 [INFO] Apache BookKeeper :: Tests :: Backward Compatibility SKIPPED
2018-10-06T12:40:26.318 [INFO] Apache BookKeeper :: Tests :: Backward Compatibility :: Test upgrade between all released versions and current version SKIPPED
2018-10-06T12:40:26.319 [INFO] Apache BookKeeper :: Tests :: Backward Compatibility :: Test upgrade between 4.1.0 and current version SKIPPED
2018-10-06T12:40:26.319 [INFO] Apache BookKeeper :: Tests :: Backward Compatibility :: Test compat between old version and new version of hierarchical ledger manager SKIPPED
2018-10-06T12:40:26.319 [INFO] Apache BookKeeper :: Tests :: Backward Compatibility :: Test upgrade between 4.1.0 and current version (with hostname bookie ID) SKIPPED
2018-10-06T12:40:26.319 [INFO] Apache BookKeeper :: Tests :: Backward Compatibility :: Test recovery does not work when password no in metadata SKIPPED
2018-10-06T12:40:26.319 [INFO] Apache BookKeeper :: Tests :: Backward Compatibility :: Test upgrade 4.1.0 to current in cluster with cookies SKIPPED
2018-10-06T12:40:26.319 [INFO] Apache BookKeeper :: Tests :: Backward Compatibility :: Test old clients working on current server SKIPPED
2018-10-06T12:40:26.319 [INFO] Apache BookKeeper :: Tests :: Backward Compatibility :: Test upgrade between yahoo custom version and current SKIPPED
2018-10-06T12:40:26.319 [INFO] Apache BookKeeper :: Tests :: Integration .......... SKIPPED
2018-10-06T12:40:26.319 [INFO] Apache BookKeeper :: Tests :: Integration :: Smoke test SKIPPED
2018-10-06T12:40:26.319 [INFO] Apache BookKeeper :: Tests :: Integration :: Standalone test SKIPPED
2018-10-06T12:40:26.319 [INFO] Apache BookKeeper :: Tests :: Integration :: Cluster test SKIPPED
2018-10-06T12:40:26.319 [INFO] Apache BookKeeper :: Tests :: Bash Scripts Test .... SKIPPED
2018-10-06T12:40:26.319 [INFO] Apache BookKeeper :: Dist (All) .................... SKIPPED
2018-10-06T12:40:26.320 [INFO] Apache BookKeeper :: microbenchmarks ............... SKIPPED
2018-10-06T12:40:26.320 [INFO] Apache BookKeeper :: DistributedLog :: IO :: FileSystem SKIPPED
2018-10-06T12:40:26.320 [INFO] Apache BookKeeper :: DistributedLog :: IO .......... SKIPPED
2018-10-06T12:40:26.320 [INFO] Apache BookKeeper :: Stream Storage :: CLI ......... SKIPPED
2018-10-06T12:40:26.320 [INFO] ------------------------------------------------------------------------
2018-10-06T12:40:26.320 [INFO] BUILD FAILURE
2018-10-06T12:40:26.320 [INFO] ------------------------------------------------------------------------
2018-10-06T12:40:26.320 [INFO] Total time: 06:22 min
2018-10-06T12:40:26.321 [INFO] Finished at: 2018-10-06T12:40:26Z
2018-10-06T12:40:27.489 [INFO] Final Memory: 106M/2048M
2018-10-06T12:40:27.489 [INFO] ------------------------------------------------------------------------
Waiting for Jenkins to finish collecting data
2018-10-06T12:40:28.319 [ERROR] Failed to execute goal org.apache.maven.plugins:maven-checkstyle-plugin:3.0.0:check (checkstyle) on project bookkeeper-server: You have 2 Checkstyle violations. -> [Help 1]
2018-10-06T12:40:28.319 [ERROR] 
2018-10-06T12:40:28.319 [ERROR] To see the full stack trace of the errors, re-run Maven with the -e switch.
2018-10-06T12:40:28.319 [ERROR] Re-run Maven using the -X switch to enable full debug logging.
2018-10-06T12:40:28.319 [ERROR] 
2018-10-06T12:40:28.319 [ERROR] For more information about the errors and possible solutions, please read the following articles:
2018-10-06T12:40:28.320 [ERROR] [Help 1] http://cwiki.apache.org/confluence/display/MAVEN/MojoFailureException
2018-10-06T12:40:28.320 [ERROR] 
2018-10-06T12:40:28.320 [ERROR] After correcting the problems, you can resume the build with the command
2018-10-06T12:40:28.320 [ERROR]   mvn <goals> -rf :bookkeeper-server
channel stopped

Build failed in Jenkins: bookkeeper_release_branch_47_java9 #178

Posted by Apache Jenkins Server <je...@builds.apache.org>.
See <https://builds.apache.org/job/bookkeeper_release_branch_47_java9/178/display/redirect>

------------------------------------------
[...truncated 504.55 KB...]
2018-10-05T12:42:46.922 [INFO] Downloaded: https://repo.maven.apache.org/maven2/io/netty/netty-all/4.1.22.Final/netty-all-4.1.22.Final.jar (3.8 MB at 7.1 MB/s)
2018-10-05T12:42:46.922 [INFO] Downloading: https://repo.maven.apache.org/maven2/org/apache/directory/server/apacheds-core-shared/2.0.0-M15/apacheds-core-shared-2.0.0-M15.jar
2018-10-05T12:42:46.931 [INFO] Downloaded: https://repo.maven.apache.org/maven2/org/apache/directory/server/apacheds-protocol-shared/2.0.0-M15/apacheds-protocol-shared-2.0.0-M15.jar (32 kB at 59 kB/s)
2018-10-05T12:42:46.931 [INFO] Downloading: https://repo.maven.apache.org/maven2/org/apache/directory/server/apacheds-ldif-partition/2.0.0-M15/apacheds-ldif-partition-2.0.0-M15.jar
2018-10-05T12:42:46.938 [INFO] Downloaded: https://repo.maven.apache.org/maven2/org/apache/directory/server/apacheds-core-shared/2.0.0-M15/apacheds-core-shared-2.0.0-M15.jar (38 kB at 68 kB/s)
2018-10-05T12:42:46.938 [INFO] Downloading: https://repo.maven.apache.org/maven2/org/apache/directory/server/apacheds-xdbm-partition/2.0.0-M15/apacheds-xdbm-partition-2.0.0-M15.jar
2018-10-05T12:42:46.944 [INFO] Downloaded: https://repo.maven.apache.org/maven2/org/apache/directory/server/apacheds-protocol-kerberos/2.0.0-M15/apacheds-protocol-kerberos-2.0.0-M15.jar (85 kB at 151 kB/s)
2018-10-05T12:42:46.944 [INFO] Downloading: https://repo.maven.apache.org/maven2/org/apache/directory/server/apacheds-mavibot-partition/2.0.0-M15/apacheds-mavibot-partition-2.0.0-M15.jar
2018-10-05T12:42:46.948 [INFO] Downloaded: https://repo.maven.apache.org/maven2/org/apache/directory/server/apacheds-ldif-partition/2.0.0-M15/apacheds-ldif-partition-2.0.0-M15.jar (29 kB at 52 kB/s)
2018-10-05T12:42:46.948 [INFO] Downloading: https://repo.maven.apache.org/maven2/org/apache/directory/mavibot/mavibot/1.0.0-M1/mavibot-1.0.0-M1.jar
2018-10-05T12:42:46.961 [INFO] Downloaded: https://repo.maven.apache.org/maven2/org/apache/directory/server/apacheds-mavibot-partition/2.0.0-M15/apacheds-mavibot-partition-2.0.0-M15.jar (48 kB at 84 kB/s)
2018-10-05T12:42:46.961 [INFO] Downloading: https://repo.maven.apache.org/maven2/org/apache/directory/server/apacheds-core-avl/2.0.0-M15/apacheds-core-avl-2.0.0-M15.jar
2018-10-05T12:42:46.970 [INFO] Downloaded: https://repo.maven.apache.org/maven2/org/apache/directory/server/apacheds-xdbm-partition/2.0.0-M15/apacheds-xdbm-partition-2.0.0-M15.jar (177 kB at 303 kB/s)
2018-10-05T12:42:46.970 [INFO] Downloading: https://repo.maven.apache.org/maven2/org/apache/directory/api/api-all/1.0.0-M20/api-all-1.0.0-M20.jar
2018-10-05T12:42:46.976 [INFO] Downloaded: https://repo.maven.apache.org/maven2/org/apache/directory/mavibot/mavibot/1.0.0-M1/mavibot-1.0.0-M1.jar (149 kB at 252 kB/s)
2018-10-05T12:42:46.976 [INFO] Downloading: https://repo.maven.apache.org/maven2/commons-pool/commons-pool/1.6/commons-pool-1.6.jar
2018-10-05T12:42:46.978 [INFO] Downloaded: https://repo.maven.apache.org/maven2/org/apache/directory/server/apacheds-core-avl/2.0.0-M15/apacheds-core-avl-2.0.0-M15.jar (61 kB at 103 kB/s)
2018-10-05T12:42:46.978 [INFO] Downloading: https://repo.maven.apache.org/maven2/org/apache/directory/server/apacheds-jdbm-partition/2.0.0-M15/apacheds-jdbm-partition-2.0.0-M15.jar
2018-10-05T12:42:46.985 [INFO] Downloaded: https://repo.maven.apache.org/maven2/org/apache/directory/server/apacheds-kerberos-codec/2.0.0-M15/apacheds-kerberos-codec-2.0.0-M15.jar (691 kB at 1.2 MB/s)
2018-10-05T12:42:46.985 [INFO] Downloading: https://repo.maven.apache.org/maven2/org/apache/directory/jdbm/apacheds-jdbm1/2.0.0-M2/apacheds-jdbm1-2.0.0-M2.jar
2018-10-05T12:42:46.997 [INFO] Downloaded: https://repo.maven.apache.org/maven2/org/apache/directory/server/apacheds-jdbm-partition/2.0.0-M15/apacheds-jdbm-partition-2.0.0-M15.jar (72 kB at 119 kB/s)
2018-10-05T12:42:46.998 [INFO] Downloading: https://repo.maven.apache.org/maven2/org/apache/directory/server/apacheds-protocol-ldap/2.0.0-M15/apacheds-protocol-ldap-2.0.0-M15.jar
2018-10-05T12:42:47.000 [INFO] Downloaded: https://repo.maven.apache.org/maven2/commons-pool/commons-pool/1.6/commons-pool-1.6.jar (111 kB at 181 kB/s)
2018-10-05T12:42:47.000 [INFO] Downloading: https://repo.maven.apache.org/maven2/org/apache/directory/api/api-asn1-ber/1.0.0-M20/api-asn1-ber-1.0.0-M20.jar
2018-10-05T12:42:47.008 [INFO] Downloaded: https://repo.maven.apache.org/maven2/org/apache/directory/jdbm/apacheds-jdbm1/2.0.0-M2/apacheds-jdbm1-2.0.0-M2.jar (105 kB at 168 kB/s)
2018-10-05T12:42:47.008 [INFO] Downloading: https://repo.maven.apache.org/maven2/org/apache/directory/api/api-ldap-extras-codec-api/1.0.0-M20/api-ldap-extras-codec-api-1.0.0-M20.jar
2018-10-05T12:42:47.015 [INFO] Downloaded: https://repo.maven.apache.org/maven2/org/apache/directory/api/api-asn1-ber/1.0.0-M20/api-asn1-ber-1.0.0-M20.jar (42 kB at 67 kB/s)
2018-10-05T12:42:47.016 [INFO] Downloading: https://repo.maven.apache.org/maven2/org/apache/directory/api/api-ldap-extras-codec/1.0.0-M20/api-ldap-extras-codec-1.0.0-M20.jar
2018-10-05T12:42:47.025 [INFO] Downloaded: https://repo.maven.apache.org/maven2/org/apache/directory/api/api-ldap-extras-codec-api/1.0.0-M20/api-ldap-extras-codec-api-1.0.0-M20.jar (55 kB at 86 kB/s)
2018-10-05T12:42:47.025 [INFO] Downloading: https://repo.maven.apache.org/maven2/org/apache/directory/api/api-ldap-extras-sp/1.0.0-M20/api-ldap-extras-sp-1.0.0-M20.jar
2018-10-05T12:42:47.035 [INFO] Downloaded: https://repo.maven.apache.org/maven2/org/apache/directory/server/apacheds-protocol-ldap/2.0.0-M15/apacheds-protocol-ldap-2.0.0-M15.jar (228 kB at 352 kB/s)
2018-10-05T12:42:47.035 [INFO] Downloading: https://repo.maven.apache.org/maven2/bouncycastle/bcprov-jdk15/140/bcprov-jdk15-140.jar
2018-10-05T12:42:47.037 [INFO] Downloaded: https://repo.maven.apache.org/maven2/org/apache/directory/api/api-ldap-extras-sp/1.0.0-M20/api-ldap-extras-sp-1.0.0-M20.jar (13 kB at 20 kB/s)
2018-10-05T12:42:47.037 [INFO] Downloading: https://repo.maven.apache.org/maven2/org/apache/zookeeper/zookeeper/3.4.13/zookeeper-3.4.13-tests.jar
2018-10-05T12:42:47.054 [INFO] Downloaded: https://repo.maven.apache.org/maven2/org/apache/directory/api/api-ldap-extras-codec/1.0.0-M20/api-ldap-extras-codec-1.0.0-M20.jar (208 kB at 312 kB/s)
2018-10-05T12:42:47.125 [INFO] Downloaded: https://repo.maven.apache.org/maven2/org/apache/zookeeper/zookeeper/3.4.13/zookeeper-3.4.13-tests.jar (727 kB at 984 kB/s)
2018-10-05T12:42:47.210 [INFO] Downloaded: https://repo.maven.apache.org/maven2/bouncycastle/bcprov-jdk15/140/bcprov-jdk15-140.jar (1.6 MB at 1.9 MB/s)
2018-10-05T12:42:47.395 [INFO] Downloaded: https://repo.maven.apache.org/maven2/org/apache/directory/api/api-all/1.0.0-M20/api-all-1.0.0-M20.jar (2.8 MB at 2.7 MB/s)
2018-10-05T12:42:47.876 [INFO] Downloaded: https://repo.maven.apache.org/maven2/org/rocksdb/rocksdbjni/5.13.1/rocksdbjni-5.13.1.jar (14 MB at 9.2 MB/s)
2018-10-05T12:42:47.912 [INFO] 
2018-10-05T12:42:47.912 [INFO] --- maven-clean-plugin:3.0.0:clean (default-clean) @ bookkeeper-server ---
2018-10-05T12:42:48.101 [INFO] 
2018-10-05T12:42:48.101 [INFO] --- apache-rat-plugin:0.12:check (default-cli) @ bookkeeper-server ---
2018-10-05T12:42:48.236 [INFO] Enabled default license matchers.
2018-10-05T12:42:48.240 [INFO] Will parse SCM ignores for exclusions...
2018-10-05T12:42:48.240 [INFO] Finished adding exclusions from SCM ignore files.
2018-10-05T12:42:48.241 [INFO] 61 implicit excludes (use -debug for more details).
2018-10-05T12:42:48.241 [INFO] Exclude: **/target/**/*
2018-10-05T12:42:48.241 [INFO] Exclude: **/.classpath
2018-10-05T12:42:48.241 [INFO] Exclude: **/.gitignore
2018-10-05T12:42:48.241 [INFO] Exclude: **/.project
2018-10-05T12:42:48.241 [INFO] Exclude: **/.checkstyle
2018-10-05T12:42:48.241 [INFO] Exclude: **/.settings/*
2018-10-05T12:42:48.241 [INFO] Exclude: src/test/resources/server-key.pem
2018-10-05T12:42:48.241 [INFO] Exclude: src/test/resources/server-key.p12
2018-10-05T12:42:48.241 [INFO] Exclude: src/test/resources/server-key.jks
2018-10-05T12:42:48.241 [INFO] Exclude: src/test/resources/server-cert.pem
2018-10-05T12:42:48.241 [INFO] Exclude: src/test/resources/client-key.pem
2018-10-05T12:42:48.241 [INFO] Exclude: src/test/resources/client-key.p12
2018-10-05T12:42:48.241 [INFO] Exclude: src/test/resources/client-key.jks
2018-10-05T12:42:48.241 [INFO] Exclude: src/test/resources/client-cert.pem
2018-10-05T12:42:48.241 [INFO] Exclude: src/test/resources/keyStoreClientPassword.txt
2018-10-05T12:42:48.241 [INFO] Exclude: src/test/resources/keyStoreServerPassword.txt
2018-10-05T12:42:48.322 [INFO] 637 resources included (use -debug for more details)
2018-10-05T12:42:48.686 [INFO] Rat check: Summary over all files. Unapproved: 0, unknown: 0, generated: 0, approved: 637 licenses.
2018-10-05T12:42:48.845 [INFO] 
2018-10-05T12:42:48.845 [INFO] --- maven-checkstyle-plugin:3.0.0:check (checkstyle) @ bookkeeper-server ---
2018-10-05T12:43:15.413 [INFO] Starting audit...
[ERROR] <https://builds.apache.org/job/bookkeeper_release_branch_47_java9/ws/bookkeeper-server/src/main/java/org/apache/bookkeeper/client/ReadLastConfirmedAndEntryOp.java>:498: Line is longer than 120 characters (found 128). [LineLength]
[ERROR] <https://builds.apache.org/job/bookkeeper_release_branch_47_java9/ws/bookkeeper-server/src/main/java/org/apache/bookkeeper/client/PendingReadOp.java>:537: Line is longer than 120 characters (found 125). [LineLength]
Audit done.
2018-10-05T12:43:15.413 [INFO] There are 2 errors reported by Checkstyle 6.19 with bookkeeper/checkstyle.xml ruleset.
2018-10-05T12:43:15.443 [ERROR] src/main/java/org/apache/bookkeeper/client/ReadLastConfirmedAndEntryOp.java:[498] (sizes) LineLength: Line is longer than 120 characters (found 128).
2018-10-05T12:43:15.445 [ERROR] src/main/java/org/apache/bookkeeper/client/PendingReadOp.java:[537] (sizes) LineLength: Line is longer than 120 characters (found 125).
[JENKINS] Archiving disabled
[JENKINS] Archiving disabled
[JENKINS] Archiving disabled
[JENKINS] Archiving disabled
[JENKINS] Archiving disabled
[JENKINS] Archiving disabled
[JENKINS] Archiving disabled
[JENKINS] Archiving disabled
[JENKINS] Archiving disabled
[JENKINS] Archiving disabled
[JENKINS] Archiving disabled
[JENKINS] Archiving disabled
[JENKINS] Archiving disabled
[JENKINS] Archiving disabled
[JENKINS] Archiving disabled
[JENKINS] Archiving disabled
[JENKINS] Archiving disabled
[JENKINS] Archiving disabled
[JENKINS] Archiving disabled
[JENKINS] Archiving disabled
[JENKINS] Archiving disabled
[JENKINS] Archiving disabled
[JENKINS] Archiving disabled
[JENKINS] Archiving disabled
[JENKINS] Archiving disabled
[JENKINS] Archiving disabled
[JENKINS] Archiving disabled
[JENKINS] Archiving disabled
[JENKINS] Archiving disabled
[JENKINS] Archiving disabled
[JENKINS] Archiving disabled
[JENKINS] Archiving disabled
[JENKINS] Archiving disabled
[JENKINS] Archiving disabled
[JENKINS] Archiving disabled
[JENKINS] Archiving disabled
[JENKINS] Archiving disabled
[JENKINS] Archiving disabled
[JENKINS] Archiving disabled
[JENKINS] Archiving disabled
[JENKINS] Archiving disabled
[JENKINS] Archiving disabled
[JENKINS] Archiving disabled
[JENKINS] Archiving disabled
[JENKINS] Archiving disabled
[JENKINS] Archiving disabled
[JENKINS] Archiving disabled
[JENKINS] Archiving disabled
[JENKINS] Archiving disabled
[JENKINS] Archiving disabled
[JENKINS] Archiving disabled
[JENKINS] Archiving disabled
[JENKINS] Archiving disabled
[JENKINS] Archiving disabled
[JENKINS] Archiving disabled
[JENKINS] Archiving disabled
[JENKINS] Archiving disabled
[JENKINS] Archiving disabled
[JENKINS] Archiving disabled
[JENKINS] Archiving disabled
[JENKINS] Archiving disabled
[JENKINS] Archiving disabled
[JENKINS] Archiving disabled
[JENKINS] Archiving disabled
[JENKINS] Archiving disabled
[JENKINS] Archiving disabled
[JENKINS] Archiving disabled
[JENKINS] Archiving disabled
[JENKINS] Archiving disabled
[JENKINS] Archiving disabled
[JENKINS] Archiving disabled
[JENKINS] Archiving disabled
[JENKINS] Archiving disabled
[JENKINS] Archiving disabled
[JENKINS] Archiving disabled
[JENKINS] Archiving disabled
[JENKINS] Archiving disabled
2018-10-05T12:44:02.946 [INFO] ------------------------------------------------------------------------
2018-10-05T12:44:02.946 [INFO] Reactor Summary:
2018-10-05T12:44:02.946 [INFO] 
2018-10-05T12:44:02.947 [INFO] Apache BookKeeper :: Parent ........................ SUCCESS [ 14.845 s]
2018-10-05T12:44:02.947 [INFO] Apache BookKeeper :: Build Tools ................... SUCCESS [  6.281 s]
2018-10-05T12:44:02.948 [INFO] Apache BookKeeper :: Circe Checksum Library ........ SUCCESS [01:46 min]
2018-10-05T12:44:02.948 [INFO] Apache BookKeeper :: Stats API ..................... SUCCESS [ 16.400 s]
2018-10-05T12:44:02.948 [INFO] Apache BookKeeper :: Common ........................ SUCCESS [ 39.480 s]
2018-10-05T12:44:02.948 [INFO] Apache BookKeeper :: Protocols ..................... SUCCESS [ 26.633 s]
2018-10-05T12:44:02.948 [INFO] Apache BookKeeper :: Http :: Http Server ........... SUCCESS [ 11.614 s]
2018-10-05T12:44:02.948 [INFO] Apache BookKeeper :: Server ........................ FAILURE [ 32.176 s]
2018-10-05T12:44:02.948 [INFO] Apache BookKeeper :: Tools ......................... SKIPPED
2018-10-05T12:44:02.948 [INFO] Apache BookKeeper :: Benchmark ..................... SKIPPED
2018-10-05T12:44:02.948 [INFO] Apache BookKeeper :: Stats Providers :: Twitter Finagle Stats SKIPPED
2018-10-05T12:44:02.948 [INFO] Apache BookKeeper :: Stats Providers :: Twitter Science Stats SKIPPED
2018-10-05T12:44:02.949 [INFO] Apache BookKeeper :: Stats Providers :: Twitter Ostrich Stats SKIPPED
2018-10-05T12:44:02.949 [INFO] Apache BookKeeper :: Stats Providers :: Codahale Metrics SKIPPED
2018-10-05T12:44:02.949 [INFO] Apache BookKeeper :: Stats Providers :: Prometheus . SKIPPED
2018-10-05T12:44:02.949 [INFO] Apache BookKeeper :: Stats Providers ............... SKIPPED
2018-10-05T12:44:02.949 [INFO] Apache BookKeeper :: Bookkeeper Http :: Twitter Http Server SKIPPED
2018-10-05T12:44:02.949 [INFO] Apache BookKeeper :: Bookkeeper Http :: Vertx Http Server SKIPPED
2018-10-05T12:44:02.949 [INFO] Apache BookKeeper :: Http .......................... SKIPPED
2018-10-05T12:44:02.949 [INFO] Apache BookKeeper :: Shaded :: Parent .............. SKIPPED
2018-10-05T12:44:02.949 [INFO] Apache BookKeeper :: Shaded :: bookkeeper-server-shaded SKIPPED
2018-10-05T12:44:02.949 [INFO] Apache BookKeeper :: Shaded :: bookkeeper-server-tests-shaded SKIPPED
2018-10-05T12:44:02.949 [INFO] Apache BookKeeper :: DistributedLog :: Parent ...... SKIPPED
2018-10-05T12:44:02.949 [INFO] Apache BookKeeper :: DistributedLog :: Common ...... SKIPPED
2018-10-05T12:44:02.949 [INFO] Apache BookKeeper :: DistributedLog :: Protocol .... SKIPPED
2018-10-05T12:44:02.949 [INFO] Apache BookKeeper :: DistributedLog :: Core Library  SKIPPED
2018-10-05T12:44:02.949 [INFO] Apache BookKeeper :: Shaded :: distributedlog-core-shaded SKIPPED
2018-10-05T12:44:02.949 [INFO] Apache BookKeeper :: Tests ......................... SKIPPED
2018-10-05T12:44:02.949 [INFO] Apache BookKeeper :: Tests :: Test Shaded Jars ..... SKIPPED
2018-10-05T12:44:02.949 [INFO] Apache BookKeeper :: Tests :: bookkeeper-server-shaded test SKIPPED
2018-10-05T12:44:02.949 [INFO] Apache BookKeeper :: Tests :: bookkeeper-server-tests-shaded test SKIPPED
2018-10-05T12:44:02.949 [INFO] Apache BookKeeper :: Tests :: distributedlog-core-shaded test SKIPPED
2018-10-05T12:44:02.949 [INFO] Apache BookKeeper :: Tests :: Docker Images ........ SKIPPED
2018-10-05T12:44:02.949 [INFO] Apache BookKeeper :: Tests :: Docker Images :: All Released Versions SKIPPED
2018-10-05T12:44:02.949 [INFO] Apache BookKeeper :: Stream Storage :: Parent ...... SKIPPED
2018-10-05T12:44:02.949 [INFO] Apache BookKeeper :: Stream Storage :: Common Classes for Tests SKIPPED
2018-10-05T12:44:02.950 [INFO] Apache BookKeeper :: Stream Storage :: Common ...... SKIPPED
2018-10-05T12:44:02.950 [INFO] Apache BookKeeper :: Stream Storage :: Proto ....... SKIPPED
2018-10-05T12:44:02.950 [INFO] Apache BookKeeper :: Stream Storage :: Storage :: Parent SKIPPED
2018-10-05T12:44:02.950 [INFO] Apache BookKeeper :: Stream Storage :: Storage :: Api SKIPPED
2018-10-05T12:44:02.950 [INFO] Apache BookKeeper :: Stream Storage :: API ......... SKIPPED
2018-10-05T12:44:02.950 [INFO] Apache BookKeeper :: Stream Storage :: Clients :: Parent SKIPPED
2018-10-05T12:44:02.950 [INFO] Apache BookKeeper :: Stream Storage :: Clients :: Java Client :: Parent SKIPPED
2018-10-05T12:44:02.950 [INFO] Apache BookKeeper :: Stream Storage :: Clients :: Java Client :: Base SKIPPED
2018-10-05T12:44:02.950 [INFO] Apache BookKeeper :: Stream Storage :: State Library SKIPPED
2018-10-05T12:44:02.950 [INFO] Apache BookKeeper :: Stream Storage :: Storage :: Impl SKIPPED
2018-10-05T12:44:02.950 [INFO] Apache BookKeeper :: Stream Storage :: Clients :: Java Client :: KV SKIPPED
2018-10-05T12:44:02.950 [INFO] Apache BookKeeper :: Stream Storage :: Clients :: Java Client SKIPPED
2018-10-05T12:44:02.950 [INFO] Apache BookKeeper :: Stream Storage :: Server ...... SKIPPED
2018-10-05T12:44:02.950 [INFO] Apache BookKeeper :: Dist (Parent) ................. SKIPPED
2018-10-05T12:44:02.950 [INFO] Apache BookKeeper :: Dist (Server) ................. SKIPPED
2018-10-05T12:44:02.950 [INFO] Apache BookKeeper :: Tests :: Docker Images :: All Versions SKIPPED
2018-10-05T12:44:02.950 [INFO] Apache BookKeeper :: Tests :: Docker Images :: Current Version SKIPPED
2018-10-05T12:44:02.950 [INFO] Apache BookKeeper :: Tests :: Utility module for Arquillian based integration tests SKIPPED
2018-10-05T12:44:02.950 [INFO] Apache BookKeeper :: Tests :: Common topologies for Docker based integration tests SKIPPED
2018-10-05T12:44:02.950 [INFO] Apache BookKeeper :: Tests :: Base module for Arquillian based integration tests SKIPPED
2018-10-05T12:44:02.950 [INFO] Apache BookKeeper :: Tests :: Base module for Arquillian based integration tests using groovy SKIPPED
2018-10-05T12:44:02.950 [INFO] Apache BookKeeper :: Tests :: Backward Compatibility SKIPPED
2018-10-05T12:44:02.950 [INFO] Apache BookKeeper :: Tests :: Backward Compatibility :: Test upgrade between all released versions and current version SKIPPED
2018-10-05T12:44:02.950 [INFO] Apache BookKeeper :: Tests :: Backward Compatibility :: Test upgrade between 4.1.0 and current version SKIPPED
2018-10-05T12:44:02.950 [INFO] Apache BookKeeper :: Tests :: Backward Compatibility :: Test compat between old version and new version of hierarchical ledger manager SKIPPED
2018-10-05T12:44:02.950 [INFO] Apache BookKeeper :: Tests :: Backward Compatibility :: Test upgrade between 4.1.0 and current version (with hostname bookie ID) SKIPPED
2018-10-05T12:44:02.950 [INFO] Apache BookKeeper :: Tests :: Backward Compatibility :: Test recovery does not work when password no in metadata SKIPPED
2018-10-05T12:44:02.950 [INFO] Apache BookKeeper :: Tests :: Backward Compatibility :: Test upgrade 4.1.0 to current in cluster with cookies SKIPPED
2018-10-05T12:44:02.950 [INFO] Apache BookKeeper :: Tests :: Backward Compatibility :: Test old clients working on current server SKIPPED
2018-10-05T12:44:02.951 [INFO] Apache BookKeeper :: Tests :: Backward Compatibility :: Test upgrade between yahoo custom version and current SKIPPED
2018-10-05T12:44:02.951 [INFO] Apache BookKeeper :: Tests :: Integration .......... SKIPPED
2018-10-05T12:44:02.951 [INFO] Apache BookKeeper :: Tests :: Integration :: Smoke test SKIPPED
2018-10-05T12:44:02.951 [INFO] Apache BookKeeper :: Tests :: Integration :: Standalone test SKIPPED
2018-10-05T12:44:02.951 [INFO] Apache BookKeeper :: Tests :: Integration :: Cluster test SKIPPED
2018-10-05T12:44:02.951 [INFO] Apache BookKeeper :: Tests :: Bash Scripts Test .... SKIPPED
2018-10-05T12:44:02.951 [INFO] Apache BookKeeper :: Dist (All) .................... SKIPPED
2018-10-05T12:44:02.951 [INFO] Apache BookKeeper :: microbenchmarks ............... SKIPPED
2018-10-05T12:44:02.951 [INFO] Apache BookKeeper :: DistributedLog :: IO :: FileSystem SKIPPED
2018-10-05T12:44:02.951 [INFO] Apache BookKeeper :: DistributedLog :: IO .......... SKIPPED
2018-10-05T12:44:02.951 [INFO] Apache BookKeeper :: Stream Storage :: CLI ......... SKIPPED
2018-10-05T12:44:02.951 [INFO] ------------------------------------------------------------------------
2018-10-05T12:44:02.951 [INFO] BUILD FAILURE
2018-10-05T12:44:02.951 [INFO] ------------------------------------------------------------------------
2018-10-05T12:44:02.951 [INFO] Total time: 05:49 min
2018-10-05T12:44:02.951 [INFO] Finished at: 2018-10-05T12:44:02Z
2018-10-05T12:44:04.186 [INFO] Final Memory: 106M/2048M
2018-10-05T12:44:04.186 [INFO] ------------------------------------------------------------------------
Waiting for Jenkins to finish collecting data
2018-10-05T12:44:05.305 [ERROR] Failed to execute goal org.apache.maven.plugins:maven-checkstyle-plugin:3.0.0:check (checkstyle) on project bookkeeper-server: You have 2 Checkstyle violations. -> [Help 1]
2018-10-05T12:44:05.305 [ERROR] 
2018-10-05T12:44:05.306 [ERROR] To see the full stack trace of the errors, re-run Maven with the -e switch.
2018-10-05T12:44:05.306 [ERROR] Re-run Maven using the -X switch to enable full debug logging.
2018-10-05T12:44:05.306 [ERROR] 
2018-10-05T12:44:05.306 [ERROR] For more information about the errors and possible solutions, please read the following articles:
2018-10-05T12:44:05.306 [ERROR] [Help 1] http://cwiki.apache.org/confluence/display/MAVEN/MojoFailureException
2018-10-05T12:44:05.306 [ERROR] 
2018-10-05T12:44:05.306 [ERROR] After correcting the problems, you can resume the build with the command
2018-10-05T12:44:05.306 [ERROR]   mvn <goals> -rf :bookkeeper-server
channel stopped

Build failed in Jenkins: bookkeeper_release_branch_47_java9 #177

Posted by Apache Jenkins Server <je...@builds.apache.org>.
See <https://builds.apache.org/job/bookkeeper_release_branch_47_java9/177/display/redirect>

------------------------------------------
[...truncated 504.08 KB...]
2018-10-04T12:38:55.128 [INFO] Downloaded: https://repo.maven.apache.org/maven2/org/apache/directory/api/api-ldap-extras-trigger/1.0.0-M20/api-ldap-extras-trigger-1.0.0-M20.jar (49 kB at 95 kB/s)
2018-10-04T12:38:55.128 [INFO] Downloading: https://repo.maven.apache.org/maven2/org/apache/directory/server/apacheds-core-shared/2.0.0-M15/apacheds-core-shared-2.0.0-M15.jar
2018-10-04T12:38:55.137 [INFO] Downloaded: https://repo.maven.apache.org/maven2/org/apache/directory/server/apacheds-protocol-shared/2.0.0-M15/apacheds-protocol-shared-2.0.0-M15.jar (32 kB at 62 kB/s)
2018-10-04T12:38:55.137 [INFO] Downloading: https://repo.maven.apache.org/maven2/org/apache/directory/server/apacheds-ldif-partition/2.0.0-M15/apacheds-ldif-partition-2.0.0-M15.jar
2018-10-04T12:38:55.143 [INFO] Downloaded: https://repo.maven.apache.org/maven2/org/apache/directory/server/apacheds-core-shared/2.0.0-M15/apacheds-core-shared-2.0.0-M15.jar (38 kB at 72 kB/s)
2018-10-04T12:38:55.143 [INFO] Downloading: https://repo.maven.apache.org/maven2/org/apache/directory/server/apacheds-xdbm-partition/2.0.0-M15/apacheds-xdbm-partition-2.0.0-M15.jar
2018-10-04T12:38:55.144 [INFO] Downloaded: https://repo.maven.apache.org/maven2/org/apache/directory/server/apacheds-protocol-kerberos/2.0.0-M15/apacheds-protocol-kerberos-2.0.0-M15.jar (85 kB at 160 kB/s)
2018-10-04T12:38:55.144 [INFO] Downloading: https://repo.maven.apache.org/maven2/org/apache/directory/server/apacheds-mavibot-partition/2.0.0-M15/apacheds-mavibot-partition-2.0.0-M15.jar
2018-10-04T12:38:55.152 [INFO] Downloaded: https://repo.maven.apache.org/maven2/org/apache/directory/server/apacheds-ldif-partition/2.0.0-M15/apacheds-ldif-partition-2.0.0-M15.jar (29 kB at 54 kB/s)
2018-10-04T12:38:55.152 [INFO] Downloading: https://repo.maven.apache.org/maven2/org/apache/directory/mavibot/mavibot/1.0.0-M1/mavibot-1.0.0-M1.jar
2018-10-04T12:38:55.161 [INFO] Downloaded: https://repo.maven.apache.org/maven2/org/apache/directory/server/apacheds-mavibot-partition/2.0.0-M15/apacheds-mavibot-partition-2.0.0-M15.jar (48 kB at 88 kB/s)
2018-10-04T12:38:55.161 [INFO] Downloading: https://repo.maven.apache.org/maven2/org/apache/directory/server/apacheds-core-avl/2.0.0-M15/apacheds-core-avl-2.0.0-M15.jar
2018-10-04T12:38:55.176 [INFO] Downloaded: https://repo.maven.apache.org/maven2/org/apache/directory/server/apacheds-xdbm-partition/2.0.0-M15/apacheds-xdbm-partition-2.0.0-M15.jar (177 kB at 316 kB/s)
2018-10-04T12:38:55.176 [INFO] Downloading: https://repo.maven.apache.org/maven2/org/apache/directory/api/api-all/1.0.0-M20/api-all-1.0.0-M20.jar
2018-10-04T12:38:55.180 [INFO] Downloaded: https://repo.maven.apache.org/maven2/org/apache/directory/mavibot/mavibot/1.0.0-M1/mavibot-1.0.0-M1.jar (149 kB at 264 kB/s)
2018-10-04T12:38:55.180 [INFO] Downloading: https://repo.maven.apache.org/maven2/commons-pool/commons-pool/1.6/commons-pool-1.6.jar
2018-10-04T12:38:55.182 [INFO] Downloaded: https://repo.maven.apache.org/maven2/org/apache/directory/server/apacheds-core-avl/2.0.0-M15/apacheds-core-avl-2.0.0-M15.jar (61 kB at 108 kB/s)
2018-10-04T12:38:55.182 [INFO] Downloading: https://repo.maven.apache.org/maven2/org/apache/directory/server/apacheds-jdbm-partition/2.0.0-M15/apacheds-jdbm-partition-2.0.0-M15.jar
2018-10-04T12:38:55.201 [INFO] Downloaded: https://repo.maven.apache.org/maven2/org/apache/directory/server/apacheds-jdbm-partition/2.0.0-M15/apacheds-jdbm-partition-2.0.0-M15.jar (72 kB at 124 kB/s)
2018-10-04T12:38:55.201 [INFO] Downloading: https://repo.maven.apache.org/maven2/org/apache/directory/jdbm/apacheds-jdbm1/2.0.0-M2/apacheds-jdbm1-2.0.0-M2.jar
2018-10-04T12:38:55.203 [INFO] Downloaded: https://repo.maven.apache.org/maven2/commons-pool/commons-pool/1.6/commons-pool-1.6.jar (111 kB at 189 kB/s)
2018-10-04T12:38:55.203 [INFO] Downloading: https://repo.maven.apache.org/maven2/org/apache/directory/server/apacheds-protocol-ldap/2.0.0-M15/apacheds-protocol-ldap-2.0.0-M15.jar
2018-10-04T12:38:55.210 [INFO] Downloaded: https://repo.maven.apache.org/maven2/org/apache/directory/server/apacheds-kerberos-codec/2.0.0-M15/apacheds-kerberos-codec-2.0.0-M15.jar (691 kB at 1.2 MB/s)
2018-10-04T12:38:55.210 [INFO] Downloading: https://repo.maven.apache.org/maven2/org/apache/directory/api/api-asn1-ber/1.0.0-M20/api-asn1-ber-1.0.0-M20.jar
2018-10-04T12:38:55.223 [INFO] Downloaded: https://repo.maven.apache.org/maven2/org/apache/directory/jdbm/apacheds-jdbm1/2.0.0-M2/apacheds-jdbm1-2.0.0-M2.jar (105 kB at 173 kB/s)
2018-10-04T12:38:55.223 [INFO] Downloading: https://repo.maven.apache.org/maven2/org/apache/directory/api/api-ldap-extras-codec-api/1.0.0-M20/api-ldap-extras-codec-api-1.0.0-M20.jar
2018-10-04T12:38:55.226 [INFO] Downloaded: https://repo.maven.apache.org/maven2/org/apache/directory/api/api-asn1-ber/1.0.0-M20/api-asn1-ber-1.0.0-M20.jar (42 kB at 69 kB/s)
2018-10-04T12:38:55.226 [INFO] Downloading: https://repo.maven.apache.org/maven2/org/apache/directory/api/api-ldap-extras-codec/1.0.0-M20/api-ldap-extras-codec-1.0.0-M20.jar
2018-10-04T12:38:55.237 [INFO] Downloaded: https://repo.maven.apache.org/maven2/org/apache/directory/server/apacheds-protocol-ldap/2.0.0-M15/apacheds-protocol-ldap-2.0.0-M15.jar (228 kB at 368 kB/s)
2018-10-04T12:38:55.237 [INFO] Downloading: https://repo.maven.apache.org/maven2/org/apache/directory/api/api-ldap-extras-sp/1.0.0-M20/api-ldap-extras-sp-1.0.0-M20.jar
2018-10-04T12:38:55.242 [INFO] Downloaded: https://repo.maven.apache.org/maven2/org/apache/directory/api/api-ldap-extras-codec-api/1.0.0-M20/api-ldap-extras-codec-api-1.0.0-M20.jar (55 kB at 88 kB/s)
2018-10-04T12:38:55.242 [INFO] Downloading: https://repo.maven.apache.org/maven2/bouncycastle/bcprov-jdk15/140/bcprov-jdk15-140.jar
2018-10-04T12:38:55.252 [INFO] Downloaded: https://repo.maven.apache.org/maven2/org/apache/directory/api/api-ldap-extras-sp/1.0.0-M20/api-ldap-extras-sp-1.0.0-M20.jar (13 kB at 20 kB/s)
2018-10-04T12:38:55.253 [INFO] Downloading: https://repo.maven.apache.org/maven2/org/apache/zookeeper/zookeeper/3.4.13/zookeeper-3.4.13-tests.jar
2018-10-04T12:38:55.267 [INFO] Downloaded: https://repo.maven.apache.org/maven2/org/apache/directory/api/api-ldap-extras-codec/1.0.0-M20/api-ldap-extras-codec-1.0.0-M20.jar (208 kB at 320 kB/s)
2018-10-04T12:38:55.356 [INFO] Downloaded: https://repo.maven.apache.org/maven2/org/apache/zookeeper/zookeeper/3.4.13/zookeeper-3.4.13-tests.jar (727 kB at 984 kB/s)
2018-10-04T12:38:55.436 [INFO] Downloaded: https://repo.maven.apache.org/maven2/bouncycastle/bcprov-jdk15/140/bcprov-jdk15-140.jar (1.6 MB at 1.9 MB/s)
2018-10-04T12:38:55.490 [INFO] Downloaded: https://repo.maven.apache.org/maven2/org/apache/directory/api/api-all/1.0.0-M20/api-all-1.0.0-M20.jar (2.8 MB at 3.2 MB/s)
2018-10-04T12:38:56.280 [INFO] Downloaded: https://repo.maven.apache.org/maven2/org/rocksdb/rocksdbjni/5.13.1/rocksdbjni-5.13.1.jar (14 MB at 8.3 MB/s)
2018-10-04T12:38:56.325 [INFO] 
2018-10-04T12:38:56.326 [INFO] --- maven-clean-plugin:3.0.0:clean (default-clean) @ bookkeeper-server ---
2018-10-04T12:38:56.548 [INFO] 
2018-10-04T12:38:56.548 [INFO] --- apache-rat-plugin:0.12:check (default-cli) @ bookkeeper-server ---
2018-10-04T12:38:56.704 [INFO] Enabled default license matchers.
2018-10-04T12:38:56.708 [INFO] Will parse SCM ignores for exclusions...
2018-10-04T12:38:56.708 [INFO] Finished adding exclusions from SCM ignore files.
2018-10-04T12:38:56.709 [INFO] 61 implicit excludes (use -debug for more details).
2018-10-04T12:38:56.709 [INFO] Exclude: **/target/**/*
2018-10-04T12:38:56.709 [INFO] Exclude: **/.classpath
2018-10-04T12:38:56.709 [INFO] Exclude: **/.gitignore
2018-10-04T12:38:56.709 [INFO] Exclude: **/.project
2018-10-04T12:38:56.709 [INFO] Exclude: **/.checkstyle
2018-10-04T12:38:56.709 [INFO] Exclude: **/.settings/*
2018-10-04T12:38:56.709 [INFO] Exclude: src/test/resources/server-key.pem
2018-10-04T12:38:56.709 [INFO] Exclude: src/test/resources/server-key.p12
2018-10-04T12:38:56.709 [INFO] Exclude: src/test/resources/server-key.jks
2018-10-04T12:38:56.709 [INFO] Exclude: src/test/resources/server-cert.pem
2018-10-04T12:38:56.709 [INFO] Exclude: src/test/resources/client-key.pem
2018-10-04T12:38:56.709 [INFO] Exclude: src/test/resources/client-key.p12
2018-10-04T12:38:56.709 [INFO] Exclude: src/test/resources/client-key.jks
2018-10-04T12:38:56.709 [INFO] Exclude: src/test/resources/client-cert.pem
2018-10-04T12:38:56.709 [INFO] Exclude: src/test/resources/keyStoreClientPassword.txt
2018-10-04T12:38:56.709 [INFO] Exclude: src/test/resources/keyStoreServerPassword.txt
2018-10-04T12:38:56.735 [INFO] 637 resources included (use -debug for more details)
2018-10-04T12:38:57.670 [INFO] Rat check: Summary over all files. Unapproved: 0, unknown: 0, generated: 0, approved: 637 licenses.
2018-10-04T12:38:57.834 [INFO] 
2018-10-04T12:38:57.834 [INFO] --- maven-checkstyle-plugin:3.0.0:check (checkstyle) @ bookkeeper-server ---
2018-10-04T12:39:24.070 [INFO] Starting audit...
[ERROR] <https://builds.apache.org/job/bookkeeper_release_branch_47_java9/ws/bookkeeper-server/src/main/java/org/apache/bookkeeper/client/PendingReadOp.java>:537: Line is longer than 120 characters (found 125). [LineLength]
[ERROR] <https://builds.apache.org/job/bookkeeper_release_branch_47_java9/ws/bookkeeper-server/src/main/java/org/apache/bookkeeper/client/ReadLastConfirmedAndEntryOp.java>:498: Line is longer than 120 characters (found 128). [LineLength]
Audit done.
2018-10-04T12:39:24.070 [INFO] There are 2 errors reported by Checkstyle 6.19 with bookkeeper/checkstyle.xml ruleset.
2018-10-04T12:39:24.111 [ERROR] src/main/java/org/apache/bookkeeper/client/PendingReadOp.java:[537] (sizes) LineLength: Line is longer than 120 characters (found 125).
2018-10-04T12:39:24.112 [ERROR] src/main/java/org/apache/bookkeeper/client/ReadLastConfirmedAndEntryOp.java:[498] (sizes) LineLength: Line is longer than 120 characters (found 128).
[JENKINS] Archiving disabled
[JENKINS] Archiving disabled
[JENKINS] Archiving disabled
[JENKINS] Archiving disabled
[JENKINS] Archiving disabled
[JENKINS] Archiving disabled
[JENKINS] Archiving disabled
[JENKINS] Archiving disabled
[JENKINS] Archiving disabled
[JENKINS] Archiving disabled
[JENKINS] Archiving disabled
[JENKINS] Archiving disabled
[JENKINS] Archiving disabled
[JENKINS] Archiving disabled
[JENKINS] Archiving disabled
[JENKINS] Archiving disabled
[JENKINS] Archiving disabled
[JENKINS] Archiving disabled
[JENKINS] Archiving disabled
[JENKINS] Archiving disabled
[JENKINS] Archiving disabled
[JENKINS] Archiving disabled
[JENKINS] Archiving disabled
[JENKINS] Archiving disabled
[JENKINS] Archiving disabled
[JENKINS] Archiving disabled
[JENKINS] Archiving disabled
[JENKINS] Archiving disabled
[JENKINS] Archiving disabled
[JENKINS] Archiving disabled
[JENKINS] Archiving disabled
[JENKINS] Archiving disabled
[JENKINS] Archiving disabled
[JENKINS] Archiving disabled
[JENKINS] Archiving disabled
[JENKINS] Archiving disabled
[JENKINS] Archiving disabled
[JENKINS] Archiving disabled
[JENKINS] Archiving disabled
[JENKINS] Archiving disabled
[JENKINS] Archiving disabled
[JENKINS] Archiving disabled
[JENKINS] Archiving disabled
[JENKINS] Archiving disabled
[JENKINS] Archiving disabled
[JENKINS] Archiving disabled
[JENKINS] Archiving disabled
[JENKINS] Archiving disabled
[JENKINS] Archiving disabled
[JENKINS] Archiving disabled
[JENKINS] Archiving disabled
[JENKINS] Archiving disabled
[JENKINS] Archiving disabled
[JENKINS] Archiving disabled
[JENKINS] Archiving disabled
[JENKINS] Archiving disabled
[JENKINS] Archiving disabled
[JENKINS] Archiving disabled
[JENKINS] Archiving disabled
[JENKINS] Archiving disabled
[JENKINS] Archiving disabled
[JENKINS] Archiving disabled
[JENKINS] Archiving disabled
[JENKINS] Archiving disabled
[JENKINS] Archiving disabled
[JENKINS] Archiving disabled
[JENKINS] Archiving disabled
[JENKINS] Archiving disabled
[JENKINS] Archiving disabled
[JENKINS] Archiving disabled
[JENKINS] Archiving disabled
[JENKINS] Archiving disabled
[JENKINS] Archiving disabled
[JENKINS] Archiving disabled
[JENKINS] Archiving disabled
[JENKINS] Archiving disabled
[JENKINS] Archiving disabled
2018-10-04T12:40:10.180 [INFO] ------------------------------------------------------------------------
2018-10-04T12:40:10.180 [INFO] Reactor Summary:
2018-10-04T12:40:10.180 [INFO] 
2018-10-04T12:40:10.181 [INFO] Apache BookKeeper :: Parent ........................ SUCCESS [ 16.337 s]
2018-10-04T12:40:10.181 [INFO] Apache BookKeeper :: Build Tools ................... SUCCESS [  6.229 s]
2018-10-04T12:40:10.182 [INFO] Apache BookKeeper :: Circe Checksum Library ........ SUCCESS [01:52 min]
2018-10-04T12:40:10.182 [INFO] Apache BookKeeper :: Stats API ..................... SUCCESS [ 18.337 s]
2018-10-04T12:40:10.182 [INFO] Apache BookKeeper :: Common ........................ SUCCESS [ 43.905 s]
2018-10-04T12:40:10.182 [INFO] Apache BookKeeper :: Protocols ..................... SUCCESS [ 28.944 s]
2018-10-04T12:40:10.182 [INFO] Apache BookKeeper :: Http :: Http Server ........... SUCCESS [ 12.433 s]
2018-10-04T12:40:10.182 [INFO] Apache BookKeeper :: Server ........................ FAILURE [ 32.479 s]
2018-10-04T12:40:10.183 [INFO] Apache BookKeeper :: Tools ......................... SKIPPED
2018-10-04T12:40:10.183 [INFO] Apache BookKeeper :: Benchmark ..................... SKIPPED
2018-10-04T12:40:10.183 [INFO] Apache BookKeeper :: Stats Providers :: Twitter Finagle Stats SKIPPED
2018-10-04T12:40:10.183 [INFO] Apache BookKeeper :: Stats Providers :: Twitter Science Stats SKIPPED
2018-10-04T12:40:10.183 [INFO] Apache BookKeeper :: Stats Providers :: Twitter Ostrich Stats SKIPPED
2018-10-04T12:40:10.183 [INFO] Apache BookKeeper :: Stats Providers :: Codahale Metrics SKIPPED
2018-10-04T12:40:10.183 [INFO] Apache BookKeeper :: Stats Providers :: Prometheus . SKIPPED
2018-10-04T12:40:10.183 [INFO] Apache BookKeeper :: Stats Providers ............... SKIPPED
2018-10-04T12:40:10.183 [INFO] Apache BookKeeper :: Bookkeeper Http :: Twitter Http Server SKIPPED
2018-10-04T12:40:10.183 [INFO] Apache BookKeeper :: Bookkeeper Http :: Vertx Http Server SKIPPED
2018-10-04T12:40:10.183 [INFO] Apache BookKeeper :: Http .......................... SKIPPED
2018-10-04T12:40:10.183 [INFO] Apache BookKeeper :: Shaded :: Parent .............. SKIPPED
2018-10-04T12:40:10.183 [INFO] Apache BookKeeper :: Shaded :: bookkeeper-server-shaded SKIPPED
2018-10-04T12:40:10.183 [INFO] Apache BookKeeper :: Shaded :: bookkeeper-server-tests-shaded SKIPPED
2018-10-04T12:40:10.183 [INFO] Apache BookKeeper :: DistributedLog :: Parent ...... SKIPPED
2018-10-04T12:40:10.183 [INFO] Apache BookKeeper :: DistributedLog :: Common ...... SKIPPED
2018-10-04T12:40:10.183 [INFO] Apache BookKeeper :: DistributedLog :: Protocol .... SKIPPED
2018-10-04T12:40:10.183 [INFO] Apache BookKeeper :: DistributedLog :: Core Library  SKIPPED
2018-10-04T12:40:10.183 [INFO] Apache BookKeeper :: Shaded :: distributedlog-core-shaded SKIPPED
2018-10-04T12:40:10.183 [INFO] Apache BookKeeper :: Tests ......................... SKIPPED
2018-10-04T12:40:10.183 [INFO] Apache BookKeeper :: Tests :: Test Shaded Jars ..... SKIPPED
2018-10-04T12:40:10.183 [INFO] Apache BookKeeper :: Tests :: bookkeeper-server-shaded test SKIPPED
2018-10-04T12:40:10.183 [INFO] Apache BookKeeper :: Tests :: bookkeeper-server-tests-shaded test SKIPPED
2018-10-04T12:40:10.184 [INFO] Apache BookKeeper :: Tests :: distributedlog-core-shaded test SKIPPED
2018-10-04T12:40:10.184 [INFO] Apache BookKeeper :: Tests :: Docker Images ........ SKIPPED
2018-10-04T12:40:10.184 [INFO] Apache BookKeeper :: Tests :: Docker Images :: All Released Versions SKIPPED
2018-10-04T12:40:10.184 [INFO] Apache BookKeeper :: Stream Storage :: Parent ...... SKIPPED
2018-10-04T12:40:10.184 [INFO] Apache BookKeeper :: Stream Storage :: Common Classes for Tests SKIPPED
2018-10-04T12:40:10.184 [INFO] Apache BookKeeper :: Stream Storage :: Common ...... SKIPPED
2018-10-04T12:40:10.184 [INFO] Apache BookKeeper :: Stream Storage :: Proto ....... SKIPPED
2018-10-04T12:40:10.184 [INFO] Apache BookKeeper :: Stream Storage :: Storage :: Parent SKIPPED
2018-10-04T12:40:10.184 [INFO] Apache BookKeeper :: Stream Storage :: Storage :: Api SKIPPED
2018-10-04T12:40:10.184 [INFO] Apache BookKeeper :: Stream Storage :: API ......... SKIPPED
2018-10-04T12:40:10.184 [INFO] Apache BookKeeper :: Stream Storage :: Clients :: Parent SKIPPED
2018-10-04T12:40:10.184 [INFO] Apache BookKeeper :: Stream Storage :: Clients :: Java Client :: Parent SKIPPED
2018-10-04T12:40:10.184 [INFO] Apache BookKeeper :: Stream Storage :: Clients :: Java Client :: Base SKIPPED
2018-10-04T12:40:10.184 [INFO] Apache BookKeeper :: Stream Storage :: State Library SKIPPED
2018-10-04T12:40:10.184 [INFO] Apache BookKeeper :: Stream Storage :: Storage :: Impl SKIPPED
2018-10-04T12:40:10.184 [INFO] Apache BookKeeper :: Stream Storage :: Clients :: Java Client :: KV SKIPPED
2018-10-04T12:40:10.184 [INFO] Apache BookKeeper :: Stream Storage :: Clients :: Java Client SKIPPED
2018-10-04T12:40:10.184 [INFO] Apache BookKeeper :: Stream Storage :: Server ...... SKIPPED
2018-10-04T12:40:10.184 [INFO] Apache BookKeeper :: Dist (Parent) ................. SKIPPED
2018-10-04T12:40:10.184 [INFO] Apache BookKeeper :: Dist (Server) ................. SKIPPED
2018-10-04T12:40:10.184 [INFO] Apache BookKeeper :: Tests :: Docker Images :: All Versions SKIPPED
2018-10-04T12:40:10.184 [INFO] Apache BookKeeper :: Tests :: Docker Images :: Current Version SKIPPED
2018-10-04T12:40:10.184 [INFO] Apache BookKeeper :: Tests :: Utility module for Arquillian based integration tests SKIPPED
2018-10-04T12:40:10.184 [INFO] Apache BookKeeper :: Tests :: Common topologies for Docker based integration tests SKIPPED
2018-10-04T12:40:10.185 [INFO] Apache BookKeeper :: Tests :: Base module for Arquillian based integration tests SKIPPED
2018-10-04T12:40:10.185 [INFO] Apache BookKeeper :: Tests :: Base module for Arquillian based integration tests using groovy SKIPPED
2018-10-04T12:40:10.185 [INFO] Apache BookKeeper :: Tests :: Backward Compatibility SKIPPED
2018-10-04T12:40:10.185 [INFO] Apache BookKeeper :: Tests :: Backward Compatibility :: Test upgrade between all released versions and current version SKIPPED
2018-10-04T12:40:10.185 [INFO] Apache BookKeeper :: Tests :: Backward Compatibility :: Test upgrade between 4.1.0 and current version SKIPPED
2018-10-04T12:40:10.185 [INFO] Apache BookKeeper :: Tests :: Backward Compatibility :: Test compat between old version and new version of hierarchical ledger manager SKIPPED
2018-10-04T12:40:10.185 [INFO] Apache BookKeeper :: Tests :: Backward Compatibility :: Test upgrade between 4.1.0 and current version (with hostname bookie ID) SKIPPED
2018-10-04T12:40:10.185 [INFO] Apache BookKeeper :: Tests :: Backward Compatibility :: Test recovery does not work when password no in metadata SKIPPED
2018-10-04T12:40:10.185 [INFO] Apache BookKeeper :: Tests :: Backward Compatibility :: Test upgrade 4.1.0 to current in cluster with cookies SKIPPED
2018-10-04T12:40:10.185 [INFO] Apache BookKeeper :: Tests :: Backward Compatibility :: Test old clients working on current server SKIPPED
2018-10-04T12:40:10.185 [INFO] Apache BookKeeper :: Tests :: Backward Compatibility :: Test upgrade between yahoo custom version and current SKIPPED
2018-10-04T12:40:10.185 [INFO] Apache BookKeeper :: Tests :: Integration .......... SKIPPED
2018-10-04T12:40:10.185 [INFO] Apache BookKeeper :: Tests :: Integration :: Smoke test SKIPPED
2018-10-04T12:40:10.185 [INFO] Apache BookKeeper :: Tests :: Integration :: Standalone test SKIPPED
2018-10-04T12:40:10.185 [INFO] Apache BookKeeper :: Tests :: Integration :: Cluster test SKIPPED
2018-10-04T12:40:10.185 [INFO] Apache BookKeeper :: Tests :: Bash Scripts Test .... SKIPPED
2018-10-04T12:40:10.185 [INFO] Apache BookKeeper :: Dist (All) .................... SKIPPED
2018-10-04T12:40:10.185 [INFO] Apache BookKeeper :: microbenchmarks ............... SKIPPED
2018-10-04T12:40:10.185 [INFO] Apache BookKeeper :: DistributedLog :: IO :: FileSystem SKIPPED
2018-10-04T12:40:10.185 [INFO] Apache BookKeeper :: DistributedLog :: IO .......... SKIPPED
2018-10-04T12:40:10.185 [INFO] Apache BookKeeper :: Stream Storage :: CLI ......... SKIPPED
2018-10-04T12:40:10.185 [INFO] ------------------------------------------------------------------------
2018-10-04T12:40:10.185 [INFO] BUILD FAILURE
2018-10-04T12:40:10.186 [INFO] ------------------------------------------------------------------------
2018-10-04T12:40:10.186 [INFO] Total time: 06:06 min
2018-10-04T12:40:10.187 [INFO] Finished at: 2018-10-04T12:40:10Z
2018-10-04T12:40:11.674 [INFO] Final Memory: 106M/2048M
2018-10-04T12:40:11.674 [INFO] ------------------------------------------------------------------------
Waiting for Jenkins to finish collecting data
2018-10-04T12:40:12.259 [ERROR] Failed to execute goal org.apache.maven.plugins:maven-checkstyle-plugin:3.0.0:check (checkstyle) on project bookkeeper-server: You have 2 Checkstyle violations. -> [Help 1]
2018-10-04T12:40:12.259 [ERROR] 
2018-10-04T12:40:12.259 [ERROR] To see the full stack trace of the errors, re-run Maven with the -e switch.
2018-10-04T12:40:12.259 [ERROR] Re-run Maven using the -X switch to enable full debug logging.
2018-10-04T12:40:12.259 [ERROR] 
2018-10-04T12:40:12.259 [ERROR] For more information about the errors and possible solutions, please read the following articles:
2018-10-04T12:40:12.260 [ERROR] [Help 1] http://cwiki.apache.org/confluence/display/MAVEN/MojoFailureException
2018-10-04T12:40:12.260 [ERROR] 
2018-10-04T12:40:12.260 [ERROR] After correcting the problems, you can resume the build with the command
2018-10-04T12:40:12.260 [ERROR]   mvn <goals> -rf :bookkeeper-server
channel stopped