You are viewing a plain text version of this content. The canonical link for it is here.
Posted to yarn-dev@hadoop.apache.org by Apache Jenkins Server <je...@builds.apache.org> on 2014/06/23 22:33:04 UTC
Failed: YARN-1365 PreCommit Build #4054
Jira: https://issues.apache.org/jira/browse/YARN-1365
Build: https://builds.apache.org/job/PreCommit-YARN-Build/4054/
###################################################################################
########################## LAST 60 LINES OF THE CONSOLE ###########################
[...truncated 6423 lines...]
{color:green}+1 @author{color}. The patch does not contain any @author tags.
{color:green}+1 tests included{color}. The patch appears to include 7 new or modified test files.
{color:green}+1 javac{color}. The applied patch does not increase the total number of javac compiler warnings.
{color:green}+1 javadoc{color}. There were no new javadoc warning messages.
{color:green}+1 eclipse:eclipse{color}. The patch built with eclipse:eclipse.
{color:green}+1 findbugs{color}. The patch does not introduce any new Findbugs (version 1.3.9) warnings.
{color:green}+1 release audit{color}. The applied patch does not increase the total number of release audit warnings.
{color:red}-1 core tests{color}. The patch failed these unit tests in hadoop-yarn-project/hadoop-yarn/hadoop-yarn-api hadoop-yarn-project/hadoop-yarn/hadoop-yarn-server/hadoop-yarn-server-resourcemanager:
org.apache.hadoop.yarn.server.resourcemanager.TestRMRestart
org.apache.hadoop.yarn.server.resourcemanager.rmapp.TestRMAppTransitions
org.apache.hadoop.yarn.server.resourcemanager.TestWorkPreservingRMRestart
org.apache.hadoop.yarn.server.resourcemanager.TestSubmitApplicationWithRMHA
{color:green}+1 contrib tests{color}. The patch passed contrib unit tests.
Test results: https://builds.apache.org/job/PreCommit-YARN-Build/4054//testReport/
Console output: https://builds.apache.org/job/PreCommit-YARN-Build/4054//console
This message is automatically generated.
======================================================================
======================================================================
Adding comment to Jira.
======================================================================
======================================================================
Comment added.
d2207de18b38cb491223fc47366ffb1553503c42 logged out
======================================================================
======================================================================
Finished build.
======================================================================
======================================================================
Build step 'Execute shell' marked build as failure
Archiving artifacts
Sending artifact delta relative to PreCommit-YARN-Build #4053
Archived 22 artifacts
Archive block size is 32768
Received 39 blocks and 7513803 bytes
Compression is 14.5%
Took 3 sec
[description-setter] Could not determine description.
Recording test results
Email was triggered for: Failure
Sending email for trigger: Failure
###################################################################################
############################## FAILED TESTS (if any) ##############################
6 tests failed.
REGRESSION: org.apache.hadoop.yarn.server.resourcemanager.TestRMRestart.testRMRestartOnMaxAppAttempts
Error Message:
test timed out after 60000 milliseconds
Stack Trace:
java.lang.Exception: test timed out after 60000 milliseconds
at java.lang.Thread.sleep(Native Method)
at org.apache.hadoop.yarn.server.resourcemanager.MockRM.waitForState(MockRM.java:118)
at org.apache.hadoop.yarn.server.resourcemanager.TestRMRestart.testRMRestartOnMaxAppAttempts(TestRMRestart.java:1057)
REGRESSION: org.apache.hadoop.yarn.server.resourcemanager.TestRMRestart.testRMRestart
Error Message:
App state is not correct (timedout) expected:<ACCEPTED> but was:<SUBMITTED>
Stack Trace:
java.lang.AssertionError: App state is not correct (timedout) expected:<ACCEPTED> but was:<SUBMITTED>
at org.junit.Assert.fail(Assert.java:88)
at org.junit.Assert.failNotEquals(Assert.java:743)
at org.junit.Assert.assertEquals(Assert.java:118)
at org.apache.hadoop.yarn.server.resourcemanager.MockRM.waitForState(MockRM.java:121)
at org.apache.hadoop.yarn.server.resourcemanager.TestRMRestart.testRMRestart(TestRMRestart.java:280)
REGRESSION: org.apache.hadoop.yarn.server.resourcemanager.TestRMRestart.testRMRestartWaitForPreviousAMToFinish
Error Message:
test timed out after 60000 milliseconds
Stack Trace:
java.lang.Exception: test timed out after 60000 milliseconds
at java.lang.Thread.sleep(Native Method)
at org.apache.hadoop.yarn.server.resourcemanager.MockRM.waitForState(MockRM.java:118)
at org.apache.hadoop.yarn.server.resourcemanager.TestRMRestart.testRMRestartWaitForPreviousAMToFinish(TestRMRestart.java:593)
REGRESSION: org.apache.hadoop.yarn.server.resourcemanager.TestSubmitApplicationWithRMHA.testGetApplicationReportIdempotent
Error Message:
expected:<ACCEPTED> but was:<SUBMITTED>
Stack Trace:
java.lang.AssertionError: expected:<ACCEPTED> but was:<SUBMITTED>
at org.junit.Assert.fail(Assert.java:88)
at org.junit.Assert.failNotEquals(Assert.java:743)
at org.junit.Assert.assertEquals(Assert.java:118)
at org.junit.Assert.assertEquals(Assert.java:144)
at org.apache.hadoop.yarn.server.resourcemanager.TestSubmitApplicationWithRMHA.testGetApplicationReportIdempotent(TestSubmitApplicationWithRMHA.java:211)
FAILED: org.apache.hadoop.yarn.server.resourcemanager.TestWorkPreservingRMRestart.testAppReregisterOnRMWorkPreservingRestart[0]
Error Message:
null
Stack Trace:
java.lang.NullPointerException: null
at org.apache.hadoop.yarn.server.resourcemanager.scheduler.AbstractYarnScheduler.getTransferredContainers(AbstractYarnScheduler.java:91)
at org.apache.hadoop.yarn.server.resourcemanager.ApplicationMasterService.registerApplicationMaster(ApplicationMasterService.java:297)
at org.apache.hadoop.yarn.server.resourcemanager.MockAM$1.run(MockAM.java:113)
at org.apache.hadoop.yarn.server.resourcemanager.MockAM$1.run(MockAM.java:110)
at java.security.AccessController.doPrivileged(Native Method)
at javax.security.auth.Subject.doAs(Subject.java:396)
at org.apache.hadoop.security.UserGroupInformation.doAs(UserGroupInformation.java:1626)
at org.apache.hadoop.yarn.server.resourcemanager.MockAM.registerAppAttempt(MockAM.java:109)
at org.apache.hadoop.yarn.server.resourcemanager.TestWorkPreservingRMRestart.testAppReregisterOnRMWorkPreservingRestart(TestWorkPreservingRMRestart.java:562)
REGRESSION: org.apache.hadoop.yarn.server.resourcemanager.rmapp.TestRMAppTransitions.testAppRunningKill[0]
Error Message:
application finish time is not greater then 0
Stack Trace:
java.lang.AssertionError: application finish time is not greater then 0
at org.junit.Assert.fail(Assert.java:88)
at org.junit.Assert.assertTrue(Assert.java:41)
at org.apache.hadoop.yarn.server.resourcemanager.rmapp.TestRMAppTransitions.assertTimesAtFinish(TestRMAppTransitions.java:297)
at org.apache.hadoop.yarn.server.resourcemanager.rmapp.TestRMAppTransitions.assertKilled(TestRMAppTransitions.java:312)
at org.apache.hadoop.yarn.server.resourcemanager.rmapp.TestRMAppTransitions.testAppRunningKill(TestRMAppTransitions.java:677)
Success: YARN-1365 PreCommit Build #4056
Posted by Apache Jenkins Server <je...@builds.apache.org>.
Jira: https://issues.apache.org/jira/browse/YARN-1365
Build: https://builds.apache.org/job/PreCommit-YARN-Build/4056/
###################################################################################
########################## LAST 60 LINES OF THE CONSOLE ###########################
[...truncated 3082 lines...]
{color:green}+1 overall{color}. Here are the results of testing the latest attachment
http://issues.apache.org/jira/secure/attachment/12652074/YARN-1365.008.patch
against trunk revision .
{color:green}+1 @author{color}. The patch does not contain any @author tags.
{color:green}+1 tests included{color}. The patch appears to include 7 new or modified test files.
{color:green}+1 javac{color}. The applied patch does not increase the total number of javac compiler warnings.
{color:green}+1 javadoc{color}. There were no new javadoc warning messages.
{color:green}+1 eclipse:eclipse{color}. The patch built with eclipse:eclipse.
{color:green}+1 findbugs{color}. The patch does not introduce any new Findbugs (version 1.3.9) warnings.
{color:green}+1 release audit{color}. The applied patch does not increase the total number of release audit warnings.
{color:green}+1 core tests{color}. The patch passed unit tests in hadoop-yarn-project/hadoop-yarn/hadoop-yarn-api hadoop-yarn-project/hadoop-yarn/hadoop-yarn-server/hadoop-yarn-server-resourcemanager.
{color:green}+1 contrib tests{color}. The patch passed contrib unit tests.
Test results: https://builds.apache.org/job/PreCommit-YARN-Build/4056//testReport/
Console output: https://builds.apache.org/job/PreCommit-YARN-Build/4056//console
This message is automatically generated.
======================================================================
======================================================================
Adding comment to Jira.
======================================================================
======================================================================
Comment added.
252de1e947883e542e9f779b9f45dce09f281c31 logged out
======================================================================
======================================================================
Finished build.
======================================================================
======================================================================
Archiving artifacts
Sending artifact delta relative to PreCommit-YARN-Build #4053
Archived 22 artifacts
Archive block size is 32768
Received 36 blocks and 7383190 bytes
Compression is 13.8%
Took 2.5 sec
Description set: YARN-1365
Recording test results
Email was triggered for: Success
Sending email for trigger: Success
###################################################################################
############################## FAILED TESTS (if any) ##############################
All tests passed
Failed: YARN-2195 PreCommit Build #4055
Posted by Apache Jenkins Server <je...@builds.apache.org>.
Jira: https://issues.apache.org/jira/browse/YARN-2195
Build: https://builds.apache.org/job/PreCommit-YARN-Build/4055/
###################################################################################
########################## LAST 60 LINES OF THE CONSOLE ###########################
[...truncated 2836 lines...]
http://issues.apache.org/jira/secure/attachment/12652055/YARN-2195.patch
against trunk revision .
{color:green}+1 @author{color}. The patch does not contain any @author tags.
{color:red}-1 tests included{color}. The patch doesn't appear to include any new or modified tests.
Please justify why no new tests are needed for this patch.
Also please list what manual steps were performed to verify this patch.
{color:green}+1 javac{color}. The applied patch does not increase the total number of javac compiler warnings.
{color:green}+1 javadoc{color}. There were no new javadoc warning messages.
{color:green}+1 eclipse:eclipse{color}. The patch built with eclipse:eclipse.
{color:green}+1 findbugs{color}. The patch does not introduce any new Findbugs (version 1.3.9) warnings.
{color:green}+1 release audit{color}. The applied patch does not increase the total number of release audit warnings.
{color:green}+1 core tests{color}. The patch passed unit tests in hadoop-yarn-project/hadoop-yarn/hadoop-yarn-api.
{color:green}+1 contrib tests{color}. The patch passed contrib unit tests.
Test results: https://builds.apache.org/job/PreCommit-YARN-Build/4055//testReport/
Console output: https://builds.apache.org/job/PreCommit-YARN-Build/4055//console
This message is automatically generated.
======================================================================
======================================================================
Adding comment to Jira.
======================================================================
======================================================================
Comment added.
7f1201c441507f38c02a25fd399907e1c09323db logged out
======================================================================
======================================================================
Finished build.
======================================================================
======================================================================
Build step 'Execute shell' marked build as failure
Archiving artifacts
Sending artifact delta relative to PreCommit-YARN-Build #4053
Archived 17 artifacts
Archive block size is 32768
Received 36 blocks and 6941187 bytes
Compression is 14.5%
Took 4.9 sec
[description-setter] Could not determine description.
Recording test results
Email was triggered for: Failure
Sending email for trigger: Failure
###################################################################################
############################## FAILED TESTS (if any) ##############################
No tests ran.