You are viewing a plain text version of this content. The canonical link for it is here.
Posted to notifications@logging.apache.org by Apache Jenkins Server <je...@builds.apache.org> on 2018/05/26 10:28:56 UTC
Build failed in Jenkins: logging-log4net » PR-16 #12
See <https://builds.apache.org/job/logging-log4net/job/PR-16/12/display/redirect>
------------------------------------------
[...truncated 20.50 KB...]
check-current-build-config:
set-build-configuration:
set-debug-build-configuration:
check-current-build-config:
set-build-configuration-flags:
runtests-netstandard-1.3:
[exec] Build started, please wait...
[exec] Build completed.
[exec]
[exec] Test run for /home/jenkins/jenkins-slave/workspace/logging-log4net_PR-16-SN25D6UCTITH36PS63DJQ2Q5GRHQL3KU6EXJV3QQ6STYNVW7HTDQ/netstandard/1.3/log4net.tests/bin/Debug/netcoreapp2.0/log4net.tests.dll(.NETCoreApp,Version=v2.0)
[exec] Microsoft (R) Test Execution Command Line Tool Version 15.7.0
[exec] Copyright (c) Microsoft Corporation. All rights reserved.
[exec]
[exec] Starting test execution, please wait...
[exec] Logging Vstest Diagnostics in file: /home/jenkins/jenkins-slave/workspace/logging-log4net_PR-16-SN25D6UCTITH36PS63DJQ2Q5GRHQL3KU6EXJV3QQ6STYNVW7HTDQ/netstandard/1.3/log4net.tests/test.diagnostics.log
[exec] The active test run was aborted. Reason:
[exec]
[exec] Test Run Aborted.
[exec] /home/jenkins/jenkins-slave/workspace/logging-log4net_PR-16-SN25D6UCTITH36PS63DJQ2Q5GRHQL3KU6EXJV3QQ6STYNVW7HTDQ/tests/nant.build(869,10):
[exec] External Program Failed: dotnet (return code was 1)
[move] 3 files moved.
BUILD SUCCEEDED - 1 non-fatal error(s), 2 warning(s)
Total time: 12.1 seconds.
[Pipeline] stash
Stashed 0 file(s)
[Pipeline] stash
Stashed 3 file(s)
[Pipeline] }
$ docker stop --time=1 50c9bd7ad7a2bb1a047b7f0058fc161f7dfb1c6676c5251c444d2fbca496eb2c
$ docker rm -f 50c9bd7ad7a2bb1a047b7f0058fc161f7dfb1c6676c5251c444d2fbca496eb2c
[Pipeline] // withDockerContainer
[Pipeline] }
[Pipeline] // script
[Pipeline] }
[Pipeline] // stage
[Pipeline] stage
[Pipeline] { (build net-2.0)
[Pipeline] node
Running on windows-2012-1 in f:\jenkins\jenkins-slave\workspace\logging-log4net_PR-16-SN25D6UCTITH36PS63DJQ2Q5GRHQL3KU6EXJV3QQ6STYNVW7HTDQ
[Pipeline] {
[Pipeline] withEnv
[Pipeline] {
[Pipeline] deleteDir
[Pipeline] checkout
Cloning the remote Git repository
Cloning with configured refspecs honoured and without tags
Cloning repository https://github.com/apache/logging-log4net.git
> git init f:\jenkins\jenkins-slave\workspace\logging-log4net_PR-16-SN25D6UCTITH36PS63DJQ2Q5GRHQL3KU6EXJV3QQ6STYNVW7HTDQ # timeout=10
Fetching upstream changes from https://github.com/apache/logging-log4net.git
> git --version # timeout=10
using GIT_ASKPASS to set credentials dpsenner at github
> git fetch --no-tags --progress https://github.com/apache/logging-log4net.git +refs/pull/16/head:refs/remotes/origin/PR-16 +refs/heads/develop:refs/remotes/origin/develop
> git config remote.origin.url https://github.com/apache/logging-log4net.git # timeout=10
> git config --add remote.origin.fetch +refs/pull/16/head:refs/remotes/origin/PR-16 # timeout=10
> git config --add remote.origin.fetch +refs/heads/develop:refs/remotes/origin/develop # timeout=10
> git config remote.origin.url https://github.com/apache/logging-log4net.git # timeout=10
Fetching without tags
Fetching upstream changes from https://github.com/apache/logging-log4net.git
using GIT_ASKPASS to set credentials dpsenner at github
> git fetch --no-tags --progress https://github.com/apache/logging-log4net.git +refs/pull/16/head:refs/remotes/origin/PR-16 +refs/heads/develop:refs/remotes/origin/develop
Merging remotes/origin/develop commit 3f281880a1fb152a8b8b66c0d66be95441904e8b into PR head commit c77a38322a12c42c695f1f97eadfbff1e30f219c
> git config core.sparsecheckout # timeout=10
> git checkout -f c77a38322a12c42c695f1f97eadfbff1e30f219c
> git merge 3f281880a1fb152a8b8b66c0d66be95441904e8b # timeout=10
> git rev-parse "HEAD^{commit}" # timeout=10
Merge succeeded, producing c957fe2e0f9a69885c0552a8ba76b9138a87f327
Checking out Revision c957fe2e0f9a69885c0552a8ba76b9138a87f327 (PR-16)
> git config core.sparsecheckout # timeout=10
> git checkout -f c957fe2e0f9a69885c0552a8ba76b9138a87f327
Commit message: "Merge commit '3f281880a1fb152a8b8b66c0d66be95441904e8b' into HEAD"
> git rev-list --no-walk 0d29c73424e782c86eb86bada476abdf6278fd17 # timeout=10
First time build. Skipping changelog.
[Pipeline] bat
[logging-log4net_PR-16-SN25D6UCTITH36PS63DJQ2Q5GRHQL3KU6EXJV3QQ6STYNVW7HTDQ] Running batch script
f:\jenkins\jenkins-slave\workspace\logging-log4net_PR-16-SN25D6UCTITH36PS63DJQ2Q5GRHQL3KU6EXJV3QQ6STYNVW7HTDQ>F:\jenkins\tools\nant\nant-0.92\bin\NAnt.exe -t:net-2.0 -buildfile:log4net.build compile-net-2.0
NAnt 0.92 (Build 0.92.4543.0; release; 6/9/2012)
Copyright (C) 2001-2012 Gerry Shaw
http://nant.sourceforge.net
Buildfile: file:///f:/jenkins/jenkins-slave/workspace/logging-log4net_PR-16-SN25D6UCTITH36PS63DJQ2Q5GRHQL3KU6EXJV3QQ6STYNVW7HTDQ/log4net.build
Target framework: Microsoft .NET Framework 2.0
Target(s) specified: compile-net-2.0
check-current-build-config:
set-build-configuration:
set-debug-build-configuration:
check-current-build-config:
set-build-configuration-flags:
compile-net-2.0:
set-debug-build-configuration:
check-current-build-config:
set-build-configuration-flags:
compile-net-2.0-current-configuration:
check-bin-dir:
[mkdir] Creating directory 'f:\jenkins\jenkins-slave\workspace\logging-log4net_PR-16-SN25D6UCTITH36PS63DJQ2Q5GRHQL3KU6EXJV3QQ6STYNVW7HTDQ\bin'.
check-doc-dir:
[mkdir] Creating directory 'f:\jenkins\jenkins-slave\workspace\logging-log4net_PR-16-SN25D6UCTITH36PS63DJQ2Q5GRHQL3KU6EXJV3QQ6STYNVW7HTDQ\doc'.
check-sdkdoc-dir:
check-sdkdoc-debug:
check-current-build-config:
check-build-debug:
check-build-defines:
set-net-2.0-runtime-configuration:
check-log4net-basedir:
check-current-bin-dir:
[mkdir] Creating directory 'f:\jenkins\jenkins-slave\workspace\logging-log4net_PR-16-SN25D6UCTITH36PS63DJQ2Q5GRHQL3KU6EXJV3QQ6STYNVW7HTDQ\bin\net\2.0\debug'.
clean-current-bin-dir:
[echo] Cleaning the bin/net/2.0/debug binaries directory.
[delete] Deleting directory 'f:\jenkins\jenkins-slave\workspace\logging-log4net_PR-16-SN25D6UCTITH36PS63DJQ2Q5GRHQL3KU6EXJV3QQ6STYNVW7HTDQ\bin\net\2.0\debug'.
[mkdir] Creating directory 'f:\jenkins\jenkins-slave\workspace\logging-log4net_PR-16-SN25D6UCTITH36PS63DJQ2Q5GRHQL3KU6EXJV3QQ6STYNVW7HTDQ\bin\net\2.0\debug'.
[csc] Compiling 226 files to 'f:\jenkins\jenkins-slave\workspace\logging-log4net_PR-16-SN25D6UCTITH36PS63DJQ2Q5GRHQL3KU6EXJV3QQ6STYNVW7HTDQ\bin\net\2.0\debug\log4net.dll'.
[csc] f:\jenkins\jenkins-slave\workspace\logging-log4net_PR-16-SN25D6UCTITH36PS63DJQ2Q5GRHQL3KU6EXJV3QQ6STYNVW7HTDQ\src\Appender\FileAppender.cs(389,121): error CS0241: Default parameter specifiers are not permitted
[csc] f:\jenkins\jenkins-slave\workspace\logging-log4net_PR-16-SN25D6UCTITH36PS63DJQ2Q5GRHQL3KU6EXJV3QQ6STYNVW7HTDQ\src\Appender\FileAppender.cs(539,121): error CS0241: Default parameter specifiers are not permitted
[csc] f:\jenkins\jenkins-slave\workspace\logging-log4net_PR-16-SN25D6UCTITH36PS63DJQ2Q5GRHQL3KU6EXJV3QQ6STYNVW7HTDQ\src\Appender\FileAppender.cs(644,121): error CS0241: Default parameter specifiers are not permitted
[csc] f:\jenkins\jenkins-slave\workspace\logging-log4net_PR-16-SN25D6UCTITH36PS63DJQ2Q5GRHQL3KU6EXJV3QQ6STYNVW7HTDQ\src\Appender\FileAppender.cs(776,112): error CS0241: Default parameter specifiers are not permitted
BUILD FAILED
f:\jenkins\jenkins-slave\workspace\logging-log4net_PR-16-SN25D6UCTITH36PS63DJQ2Q5GRHQL3KU6EXJV3QQ6STYNVW7HTDQ\log4net.build(613,8):
External Program Failed: C:\Windows\Microsoft.NET\Framework64\v2.0.50727\csc.exe (return code was 1)
Total time: 0.7 seconds.
[Pipeline] }
[Pipeline] // withEnv
[Pipeline] }
[Pipeline] // node
[Pipeline] }
[Pipeline] // stage
[Pipeline] stage
[Pipeline] { (build net-3.5)
Stage 'build net-3.5' skipped due to earlier failure(s)
[Pipeline] }
[Pipeline] // stage
[Pipeline] stage
[Pipeline] { (build net-3.5-cp)
Stage 'build net-3.5-cp' skipped due to earlier failure(s)
[Pipeline] }
[Pipeline] // stage
[Pipeline] stage
[Pipeline] { (build net-4.0)
Stage 'build net-4.0' skipped due to earlier failure(s)
[Pipeline] }
[Pipeline] // stage
[Pipeline] stage
[Pipeline] { (build net-4.0-cp)
Stage 'build net-4.0-cp' skipped due to earlier failure(s)
[Pipeline] }
[Pipeline] // stage
[Pipeline] stage
[Pipeline] { (build net-4.5)
Stage 'build net-4.5' skipped due to earlier failure(s)
[Pipeline] }
[Pipeline] // stage
[Pipeline] stage
[Pipeline] { (build mono-2.0)
Stage 'build mono-2.0' skipped due to earlier failure(s)
[Pipeline] }
[Pipeline] // stage
[Pipeline] stage
[Pipeline] { (build mono-3.5)
Stage 'build mono-3.5' skipped due to earlier failure(s)
[Pipeline] }
[Pipeline] // stage
[Pipeline] stage
[Pipeline] { (build mono-4.0)
Stage 'build mono-4.0' skipped due to earlier failure(s)
[Pipeline] }
[Pipeline] // stage
[Pipeline] stage
[Pipeline] { (build site)
Stage 'build site' skipped due to earlier failure(s)
[Pipeline] }
[Pipeline] // stage
[Pipeline] stage
[Pipeline] { (prepare package)
Stage 'prepare package' skipped due to earlier failure(s)
[Pipeline] }
[Pipeline] // stage
[Pipeline] stage
[Pipeline] { (check test results)
Stage 'check test results' skipped due to earlier failure(s)
[Pipeline] }
[Pipeline] // stage
[Pipeline] stage
[Pipeline] { (publish site)
Stage 'publish site' skipped due to earlier failure(s)
[Pipeline] }
[Pipeline] // stage
[Pipeline] stage
[Pipeline] { (Declarative: Post Actions)
[Pipeline] step
Build failed in Jenkins: logging-log4net » PR-16 #15
Posted by Apache Jenkins Server <je...@builds.apache.org>.
See <https://builds.apache.org/job/logging-log4net/job/PR-16/15/display/redirect>
------------------------------------------
[...truncated 123.14 KB...]
check-current-build-config:
set-build-configuration:
set-debug-build-configuration:
check-current-build-config:
set-build-configuration-flags:
runtests-netstandard-1.3:
[exec] Build started, please wait...
[exec] Build completed.
[exec]
[exec] Test run for /home/jenkins/jenkins-slave/workspace/logging-log4net_PR-16-SN25D6UCTITH36PS63DJQ2Q5GRHQL3KU6EXJV3QQ6STYNVW7HTDQ/netstandard/1.3/log4net.tests/bin/Debug/netcoreapp2.0/log4net.tests.dll(.NETCoreApp,Version=v2.0)
[exec] Microsoft (R) Test Execution Command Line Tool Version 15.7.0
[exec] Copyright (c) Microsoft Corporation. All rights reserved.
[exec]
[exec] Starting test execution, please wait...
[exec] Logging Vstest Diagnostics in file: /home/jenkins/jenkins-slave/workspace/logging-log4net_PR-16-SN25D6UCTITH36PS63DJQ2Q5GRHQL3KU6EXJV3QQ6STYNVW7HTDQ/netstandard/1.3/log4net.tests/test.diagnostics.log
[exec] The active test run was aborted. Reason:
[exec]
[exec] Test Run Aborted.
[exec] /home/jenkins/jenkins-slave/workspace/logging-log4net_PR-16-SN25D6UCTITH36PS63DJQ2Q5GRHQL3KU6EXJV3QQ6STYNVW7HTDQ/tests/nant.build(869,10):
[exec] External Program Failed: dotnet (return code was 1)
[move] 3 files moved.
BUILD SUCCEEDED - 1 non-fatal error(s), 2 warning(s)
Total time: 8.4 seconds.
[Pipeline] stash
Stashed 0 file(s)
[Pipeline] stash
Stashed 3 file(s)
[Pipeline] }
$ docker stop --time=1 5f2a2519b6706d681ef3baabd0cb6a4cf2b10e287eec902413b248008abc4652
$ docker rm -f 5f2a2519b6706d681ef3baabd0cb6a4cf2b10e287eec902413b248008abc4652
[Pipeline] // withDockerContainer
[Pipeline] }
[Pipeline] // script
[Pipeline] }
[Pipeline] // stage
[Pipeline] stage
[Pipeline] { (build net-2.0)
[Pipeline] node
Running on windows-2012-3 in f:\jenkins\jenkins-slave\workspace\logging-log4net_PR-16-SN25D6UCTITH36PS63DJQ2Q5GRHQL3KU6EXJV3QQ6STYNVW7HTDQ
[Pipeline] {
[Pipeline] withEnv
[Pipeline] {
[Pipeline] deleteDir
[Pipeline] checkout
Cloning the remote Git repository
Cloning with configured refspecs honoured and without tags
Cloning repository https://github.com/apache/logging-log4net.git
> git init f:\jenkins\jenkins-slave\workspace\logging-log4net_PR-16-SN25D6UCTITH36PS63DJQ2Q5GRHQL3KU6EXJV3QQ6STYNVW7HTDQ # timeout=10
Fetching upstream changes from https://github.com/apache/logging-log4net.git
> git --version # timeout=10
using GIT_ASKPASS to set credentials dpsenner at github
> git fetch --no-tags --progress https://github.com/apache/logging-log4net.git +refs/pull/16/head:refs/remotes/origin/PR-16 +refs/heads/develop:refs/remotes/origin/develop
> git config remote.origin.url https://github.com/apache/logging-log4net.git # timeout=10
> git config --add remote.origin.fetch +refs/pull/16/head:refs/remotes/origin/PR-16 # timeout=10
> git config --add remote.origin.fetch +refs/heads/develop:refs/remotes/origin/develop # timeout=10
> git config remote.origin.url https://github.com/apache/logging-log4net.git # timeout=10
Fetching without tags
Fetching upstream changes from https://github.com/apache/logging-log4net.git
using GIT_ASKPASS to set credentials dpsenner at github
> git fetch --no-tags --progress https://github.com/apache/logging-log4net.git +refs/pull/16/head:refs/remotes/origin/PR-16 +refs/heads/develop:refs/remotes/origin/develop
Merging remotes/origin/develop commit f238e175ca4f23410af7a226a1efc711e2d210b7 into PR head commit c77a38322a12c42c695f1f97eadfbff1e30f219c
> git config core.sparsecheckout # timeout=10
> git checkout -f c77a38322a12c42c695f1f97eadfbff1e30f219c
> git merge f238e175ca4f23410af7a226a1efc711e2d210b7 # timeout=10
> git rev-parse "HEAD^{commit}" # timeout=10
Merge succeeded, producing b055839ad07ab2e1932ef231d23cd1d3409c2f0a
Checking out Revision b055839ad07ab2e1932ef231d23cd1d3409c2f0a (PR-16)
> git config core.sparsecheckout # timeout=10
> git checkout -f b055839ad07ab2e1932ef231d23cd1d3409c2f0a
Commit message: "Merge commit 'f238e175ca4f23410af7a226a1efc711e2d210b7' into HEAD"
> git rev-list --no-walk 7930cfd4185e0a91bfdaac1c89142fb3aa142950 # timeout=10
First time build. Skipping changelog.
[Pipeline] bat
[logging-log4net_PR-16-SN25D6UCTITH36PS63DJQ2Q5GRHQL3KU6EXJV3QQ6STYNVW7HTDQ] Running batch script
f:\jenkins\jenkins-slave\workspace\logging-log4net_PR-16-SN25D6UCTITH36PS63DJQ2Q5GRHQL3KU6EXJV3QQ6STYNVW7HTDQ>F:\jenkins\tools\nant\nant-0.92\bin\NAnt.exe -t:net-2.0 -buildfile:log4net.build compile-net-2.0
NAnt 0.92 (Build 0.92.4543.0; release; 6/9/2012)
Copyright (C) 2001-2012 Gerry Shaw
http://nant.sourceforge.net
Buildfile: file:///f:/jenkins/jenkins-slave/workspace/logging-log4net_PR-16-SN25D6UCTITH36PS63DJQ2Q5GRHQL3KU6EXJV3QQ6STYNVW7HTDQ/log4net.build
Target framework: Microsoft .NET Framework 2.0
Target(s) specified: compile-net-2.0
check-current-build-config:
set-build-configuration:
set-debug-build-configuration:
check-current-build-config:
set-build-configuration-flags:
compile-net-2.0:
set-debug-build-configuration:
check-current-build-config:
set-build-configuration-flags:
compile-net-2.0-current-configuration:
check-bin-dir:
[mkdir] Creating directory 'f:\jenkins\jenkins-slave\workspace\logging-log4net_PR-16-SN25D6UCTITH36PS63DJQ2Q5GRHQL3KU6EXJV3QQ6STYNVW7HTDQ\bin'.
check-doc-dir:
[mkdir] Creating directory 'f:\jenkins\jenkins-slave\workspace\logging-log4net_PR-16-SN25D6UCTITH36PS63DJQ2Q5GRHQL3KU6EXJV3QQ6STYNVW7HTDQ\doc'.
check-sdkdoc-dir:
check-sdkdoc-debug:
check-current-build-config:
check-build-debug:
check-build-defines:
set-net-2.0-runtime-configuration:
check-log4net-basedir:
check-current-bin-dir:
[mkdir] Creating directory 'f:\jenkins\jenkins-slave\workspace\logging-log4net_PR-16-SN25D6UCTITH36PS63DJQ2Q5GRHQL3KU6EXJV3QQ6STYNVW7HTDQ\bin\net\2.0\debug'.
clean-current-bin-dir:
[echo] Cleaning the bin/net/2.0/debug binaries directory.
[delete] Deleting directory 'f:\jenkins\jenkins-slave\workspace\logging-log4net_PR-16-SN25D6UCTITH36PS63DJQ2Q5GRHQL3KU6EXJV3QQ6STYNVW7HTDQ\bin\net\2.0\debug'.
[mkdir] Creating directory 'f:\jenkins\jenkins-slave\workspace\logging-log4net_PR-16-SN25D6UCTITH36PS63DJQ2Q5GRHQL3KU6EXJV3QQ6STYNVW7HTDQ\bin\net\2.0\debug'.
[csc] Compiling 226 files to 'f:\jenkins\jenkins-slave\workspace\logging-log4net_PR-16-SN25D6UCTITH36PS63DJQ2Q5GRHQL3KU6EXJV3QQ6STYNVW7HTDQ\bin\net\2.0\debug\log4net.dll'.
[csc] f:\jenkins\jenkins-slave\workspace\logging-log4net_PR-16-SN25D6UCTITH36PS63DJQ2Q5GRHQL3KU6EXJV3QQ6STYNVW7HTDQ\src\Appender\FileAppender.cs(389,121): error CS0241: Default parameter specifiers are not permitted
[csc] f:\jenkins\jenkins-slave\workspace\logging-log4net_PR-16-SN25D6UCTITH36PS63DJQ2Q5GRHQL3KU6EXJV3QQ6STYNVW7HTDQ\src\Appender\FileAppender.cs(539,121): error CS0241: Default parameter specifiers are not permitted
[csc] f:\jenkins\jenkins-slave\workspace\logging-log4net_PR-16-SN25D6UCTITH36PS63DJQ2Q5GRHQL3KU6EXJV3QQ6STYNVW7HTDQ\src\Appender\FileAppender.cs(644,121): error CS0241: Default parameter specifiers are not permitted
[csc] f:\jenkins\jenkins-slave\workspace\logging-log4net_PR-16-SN25D6UCTITH36PS63DJQ2Q5GRHQL3KU6EXJV3QQ6STYNVW7HTDQ\src\Appender\FileAppender.cs(776,112): error CS0241: Default parameter specifiers are not permitted
BUILD FAILED
f:\jenkins\jenkins-slave\workspace\logging-log4net_PR-16-SN25D6UCTITH36PS63DJQ2Q5GRHQL3KU6EXJV3QQ6STYNVW7HTDQ\log4net.build(613,8):
External Program Failed: C:\Windows\Microsoft.NET\Framework64\v2.0.50727\csc.exe (return code was 1)
Total time: 0.4 seconds.
[Pipeline] }
[Pipeline] // withEnv
[Pipeline] }
[Pipeline] // node
[Pipeline] }
[Pipeline] // stage
[Pipeline] stage
[Pipeline] { (build net-3.5)
Stage "build net-3.5" skipped due to earlier failure(s)
[Pipeline] }
[Pipeline] // stage
[Pipeline] stage
[Pipeline] { (build net-3.5-cp)
Stage "build net-3.5-cp" skipped due to earlier failure(s)
[Pipeline] }
[Pipeline] // stage
[Pipeline] stage
[Pipeline] { (build net-4.0)
Stage "build net-4.0" skipped due to earlier failure(s)
[Pipeline] }
[Pipeline] // stage
[Pipeline] stage
[Pipeline] { (build net-4.0-cp)
Stage "build net-4.0-cp" skipped due to earlier failure(s)
[Pipeline] }
[Pipeline] // stage
[Pipeline] stage
[Pipeline] { (build net-4.5)
Stage "build net-4.5" skipped due to earlier failure(s)
[Pipeline] }
[Pipeline] // stage
[Pipeline] stage
[Pipeline] { (build mono-2.0)
Stage "build mono-2.0" skipped due to earlier failure(s)
[Pipeline] }
[Pipeline] // stage
[Pipeline] stage
[Pipeline] { (build mono-3.5)
Stage "build mono-3.5" skipped due to earlier failure(s)
[Pipeline] }
[Pipeline] // stage
[Pipeline] stage
[Pipeline] { (build mono-4.0)
Stage "build mono-4.0" skipped due to earlier failure(s)
[Pipeline] }
[Pipeline] // stage
[Pipeline] stage
[Pipeline] { (build site)
Stage "build site" skipped due to earlier failure(s)
[Pipeline] }
[Pipeline] // stage
[Pipeline] stage
[Pipeline] { (prepare package)
Stage "prepare package" skipped due to earlier failure(s)
[Pipeline] }
[Pipeline] // stage
[Pipeline] stage
[Pipeline] { (check test results)
Stage "check test results" skipped due to earlier failure(s)
[Pipeline] }
[Pipeline] // stage
[Pipeline] stage
[Pipeline] { (publish site)
Stage "publish site" skipped due to earlier failure(s)
[Pipeline] }
[Pipeline] // stage
[Pipeline] stage
[Pipeline] { (Declarative: Post Actions)
[Pipeline] step
Build failed in Jenkins: logging-log4net » PR-16 #14
Posted by Apache Jenkins Server <je...@builds.apache.org>.
See <https://builds.apache.org/job/logging-log4net/job/PR-16/14/display/redirect>
------------------------------------------
[...truncated 123.40 KB...]
set-build-configuration:
set-debug-build-configuration:
check-current-build-config:
set-build-configuration-flags:
runtests-netstandard-1.3:
[exec] Build started, please wait...
[exec] Build completed.
[exec]
[exec] Test run for /home/jenkins/jenkins-slave/workspace/logging-log4net_PR-16-SN25D6UCTITH36PS63DJQ2Q5GRHQL3KU6EXJV3QQ6STYNVW7HTDQ/netstandard/1.3/log4net.tests/bin/Debug/netcoreapp2.0/log4net.tests.dll(.NETCoreApp,Version=v2.0)
[exec] Microsoft (R) Test Execution Command Line Tool Version 15.7.0
[exec] Copyright (c) Microsoft Corporation. All rights reserved.
[exec]
[exec] Starting test execution, please wait...
[exec] Logging Vstest Diagnostics in file: /home/jenkins/jenkins-slave/workspace/logging-log4net_PR-16-SN25D6UCTITH36PS63DJQ2Q5GRHQL3KU6EXJV3QQ6STYNVW7HTDQ/netstandard/1.3/log4net.tests/test.diagnostics.log
[exec] The active test run was aborted. Reason:
[exec]
[exec] Test Run Aborted.
[exec] /home/jenkins/jenkins-slave/workspace/logging-log4net_PR-16-SN25D6UCTITH36PS63DJQ2Q5GRHQL3KU6EXJV3QQ6STYNVW7HTDQ/tests/nant.build(869,10):
[exec] External Program Failed: dotnet (return code was 1)
[move] 3 files moved.
BUILD SUCCEEDED - 1 non-fatal error(s), 2 warning(s)
Total time: 8.4 seconds.
[Pipeline] stash
Stashed 0 file(s)
[Pipeline] stash
Stashed 3 file(s)
[Pipeline] }
$ docker stop --time=1 b02dc482cc90c921fd902a7cdd60076ecfd121832da5e710fffd0e4b9c9e772d
$ docker rm -f b02dc482cc90c921fd902a7cdd60076ecfd121832da5e710fffd0e4b9c9e772d
[Pipeline] // withDockerContainer
[Pipeline] }
[Pipeline] // script
[Pipeline] }
[Pipeline] // stage
[Pipeline] stage
[Pipeline] { (build net-2.0)
[Pipeline] node
Still waiting to schedule task
Waiting for next available executor on windows-2012-1||windows-2012-2||windows-2012-3
Running on windows-2012-2 in f:\jenkins\jenkins-slave\workspace\logging-log4net_PR-16-SN25D6UCTITH36PS63DJQ2Q5GRHQL3KU6EXJV3QQ6STYNVW7HTDQ
[Pipeline] {
[Pipeline] withEnv
[Pipeline] {
[Pipeline] deleteDir
[Pipeline] checkout
Cloning the remote Git repository
Cloning with configured refspecs honoured and without tags
Cloning repository https://github.com/apache/logging-log4net.git
> git init f:\jenkins\jenkins-slave\workspace\logging-log4net_PR-16-SN25D6UCTITH36PS63DJQ2Q5GRHQL3KU6EXJV3QQ6STYNVW7HTDQ # timeout=10
Fetching upstream changes from https://github.com/apache/logging-log4net.git
> git --version # timeout=10
using GIT_ASKPASS to set credentials dpsenner at github
> git fetch --no-tags --progress https://github.com/apache/logging-log4net.git +refs/pull/16/head:refs/remotes/origin/PR-16 +refs/heads/develop:refs/remotes/origin/develop
> git config remote.origin.url https://github.com/apache/logging-log4net.git # timeout=10
> git config --add remote.origin.fetch +refs/pull/16/head:refs/remotes/origin/PR-16 # timeout=10
> git config --add remote.origin.fetch +refs/heads/develop:refs/remotes/origin/develop # timeout=10
> git config remote.origin.url https://github.com/apache/logging-log4net.git # timeout=10
Fetching without tags
Fetching upstream changes from https://github.com/apache/logging-log4net.git
using GIT_ASKPASS to set credentials dpsenner at github
> git fetch --no-tags --progress https://github.com/apache/logging-log4net.git +refs/pull/16/head:refs/remotes/origin/PR-16 +refs/heads/develop:refs/remotes/origin/develop
Merging remotes/origin/develop commit c5b4747e8151bd334566c51e9c523c724ce0327f into PR head commit c77a38322a12c42c695f1f97eadfbff1e30f219c
> git config core.sparsecheckout # timeout=10
> git checkout -f c77a38322a12c42c695f1f97eadfbff1e30f219c
> git merge c5b4747e8151bd334566c51e9c523c724ce0327f # timeout=10
> git rev-parse "HEAD^{commit}" # timeout=10
Merge succeeded, producing ab56502a4c48c5f843d4c015d28b4895767b0c10
Checking out Revision ab56502a4c48c5f843d4c015d28b4895767b0c10 (PR-16)
> git config core.sparsecheckout # timeout=10
> git checkout -f ab56502a4c48c5f843d4c015d28b4895767b0c10
Commit message: "Merge commit 'c5b4747e8151bd334566c51e9c523c724ce0327f' into HEAD"
> git rev-list --no-walk 55abbbb6c9bff03c471a3b811522e0ef5c7363f1 # timeout=10
First time build. Skipping changelog.
[Pipeline] bat
[logging-log4net_PR-16-SN25D6UCTITH36PS63DJQ2Q5GRHQL3KU6EXJV3QQ6STYNVW7HTDQ] Running batch script
f:\jenkins\jenkins-slave\workspace\logging-log4net_PR-16-SN25D6UCTITH36PS63DJQ2Q5GRHQL3KU6EXJV3QQ6STYNVW7HTDQ>F:\jenkins\tools\nant\nant-0.92\bin\NAnt.exe -t:net-2.0 -buildfile:log4net.build compile-net-2.0
NAnt 0.92 (Build 0.92.4543.0; release; 6/9/2012)
Copyright (C) 2001-2012 Gerry Shaw
http://nant.sourceforge.net
Buildfile: file:///f:/jenkins/jenkins-slave/workspace/logging-log4net_PR-16-SN25D6UCTITH36PS63DJQ2Q5GRHQL3KU6EXJV3QQ6STYNVW7HTDQ/log4net.build
Target framework: Microsoft .NET Framework 2.0
Target(s) specified: compile-net-2.0
check-current-build-config:
set-build-configuration:
set-debug-build-configuration:
check-current-build-config:
set-build-configuration-flags:
compile-net-2.0:
set-debug-build-configuration:
check-current-build-config:
set-build-configuration-flags:
compile-net-2.0-current-configuration:
check-bin-dir:
[mkdir] Creating directory 'f:\jenkins\jenkins-slave\workspace\logging-log4net_PR-16-SN25D6UCTITH36PS63DJQ2Q5GRHQL3KU6EXJV3QQ6STYNVW7HTDQ\bin'.
check-doc-dir:
[mkdir] Creating directory 'f:\jenkins\jenkins-slave\workspace\logging-log4net_PR-16-SN25D6UCTITH36PS63DJQ2Q5GRHQL3KU6EXJV3QQ6STYNVW7HTDQ\doc'.
check-sdkdoc-dir:
check-sdkdoc-debug:
check-current-build-config:
check-build-debug:
check-build-defines:
set-net-2.0-runtime-configuration:
check-log4net-basedir:
check-current-bin-dir:
[mkdir] Creating directory 'f:\jenkins\jenkins-slave\workspace\logging-log4net_PR-16-SN25D6UCTITH36PS63DJQ2Q5GRHQL3KU6EXJV3QQ6STYNVW7HTDQ\bin\net\2.0\debug'.
clean-current-bin-dir:
[echo] Cleaning the bin/net/2.0/debug binaries directory.
[delete] Deleting directory 'f:\jenkins\jenkins-slave\workspace\logging-log4net_PR-16-SN25D6UCTITH36PS63DJQ2Q5GRHQL3KU6EXJV3QQ6STYNVW7HTDQ\bin\net\2.0\debug'.
[mkdir] Creating directory 'f:\jenkins\jenkins-slave\workspace\logging-log4net_PR-16-SN25D6UCTITH36PS63DJQ2Q5GRHQL3KU6EXJV3QQ6STYNVW7HTDQ\bin\net\2.0\debug'.
[csc] Compiling 226 files to 'f:\jenkins\jenkins-slave\workspace\logging-log4net_PR-16-SN25D6UCTITH36PS63DJQ2Q5GRHQL3KU6EXJV3QQ6STYNVW7HTDQ\bin\net\2.0\debug\log4net.dll'.
[csc] f:\jenkins\jenkins-slave\workspace\logging-log4net_PR-16-SN25D6UCTITH36PS63DJQ2Q5GRHQL3KU6EXJV3QQ6STYNVW7HTDQ\src\Appender\FileAppender.cs(389,121): error CS0241: Default parameter specifiers are not permitted
[csc] f:\jenkins\jenkins-slave\workspace\logging-log4net_PR-16-SN25D6UCTITH36PS63DJQ2Q5GRHQL3KU6EXJV3QQ6STYNVW7HTDQ\src\Appender\FileAppender.cs(539,121): error CS0241: Default parameter specifiers are not permitted
[csc] f:\jenkins\jenkins-slave\workspace\logging-log4net_PR-16-SN25D6UCTITH36PS63DJQ2Q5GRHQL3KU6EXJV3QQ6STYNVW7HTDQ\src\Appender\FileAppender.cs(644,121): error CS0241: Default parameter specifiers are not permitted
[csc] f:\jenkins\jenkins-slave\workspace\logging-log4net_PR-16-SN25D6UCTITH36PS63DJQ2Q5GRHQL3KU6EXJV3QQ6STYNVW7HTDQ\src\Appender\FileAppender.cs(776,112): error CS0241: Default parameter specifiers are not permitted
BUILD FAILED
f:\jenkins\jenkins-slave\workspace\logging-log4net_PR-16-SN25D6UCTITH36PS63DJQ2Q5GRHQL3KU6EXJV3QQ6STYNVW7HTDQ\log4net.build(613,8):
External Program Failed: C:\Windows\Microsoft.NET\Framework64\v2.0.50727\csc.exe (return code was 1)
Total time: 0.4 seconds.
[Pipeline] }
[Pipeline] // withEnv
[Pipeline] }
[Pipeline] // node
[Pipeline] }
[Pipeline] // stage
[Pipeline] stage
[Pipeline] { (build net-3.5)
Stage 'build net-3.5' skipped due to earlier failure(s)
[Pipeline] }
[Pipeline] // stage
[Pipeline] stage
[Pipeline] { (build net-3.5-cp)
Stage 'build net-3.5-cp' skipped due to earlier failure(s)
[Pipeline] }
[Pipeline] // stage
[Pipeline] stage
[Pipeline] { (build net-4.0)
Stage 'build net-4.0' skipped due to earlier failure(s)
[Pipeline] }
[Pipeline] // stage
[Pipeline] stage
[Pipeline] { (build net-4.0-cp)
Stage 'build net-4.0-cp' skipped due to earlier failure(s)
[Pipeline] }
[Pipeline] // stage
[Pipeline] stage
[Pipeline] { (build net-4.5)
Stage 'build net-4.5' skipped due to earlier failure(s)
[Pipeline] }
[Pipeline] // stage
[Pipeline] stage
[Pipeline] { (build mono-2.0)
Stage 'build mono-2.0' skipped due to earlier failure(s)
[Pipeline] }
[Pipeline] // stage
[Pipeline] stage
[Pipeline] { (build mono-3.5)
Stage 'build mono-3.5' skipped due to earlier failure(s)
[Pipeline] }
[Pipeline] // stage
[Pipeline] stage
[Pipeline] { (build mono-4.0)
Stage 'build mono-4.0' skipped due to earlier failure(s)
[Pipeline] }
[Pipeline] // stage
[Pipeline] stage
[Pipeline] { (build site)
Stage 'build site' skipped due to earlier failure(s)
[Pipeline] }
[Pipeline] // stage
[Pipeline] stage
[Pipeline] { (prepare package)
Stage 'prepare package' skipped due to earlier failure(s)
[Pipeline] }
[Pipeline] // stage
[Pipeline] stage
[Pipeline] { (check test results)
Stage 'check test results' skipped due to earlier failure(s)
[Pipeline] }
[Pipeline] // stage
[Pipeline] stage
[Pipeline] { (publish site)
Stage 'publish site' skipped due to earlier failure(s)
[Pipeline] }
[Pipeline] // stage
[Pipeline] stage
[Pipeline] { (Declarative: Post Actions)
[Pipeline] step
Build failed in Jenkins: logging-log4net » PR-16 #13
Posted by Apache Jenkins Server <je...@builds.apache.org>.
See <https://builds.apache.org/job/logging-log4net/job/PR-16/13/display/redirect>
------------------------------------------
[...truncated 123.29 KB...]
set-build-configuration:
set-debug-build-configuration:
check-current-build-config:
set-build-configuration-flags:
runtests-netstandard-1.3:
[exec] Build started, please wait...
[exec] Build completed.
[exec]
[exec] Test run for /home/jenkins/jenkins-slave/workspace/logging-log4net_PR-16-SN25D6UCTITH36PS63DJQ2Q5GRHQL3KU6EXJV3QQ6STYNVW7HTDQ/netstandard/1.3/log4net.tests/bin/Debug/netcoreapp2.0/log4net.tests.dll(.NETCoreApp,Version=v2.0)
[exec] Microsoft (R) Test Execution Command Line Tool Version 15.7.0
[exec] Copyright (c) Microsoft Corporation. All rights reserved.
[exec]
[exec] Starting test execution, please wait...
[exec] Logging Vstest Diagnostics in file: /home/jenkins/jenkins-slave/workspace/logging-log4net_PR-16-SN25D6UCTITH36PS63DJQ2Q5GRHQL3KU6EXJV3QQ6STYNVW7HTDQ/netstandard/1.3/log4net.tests/test.diagnostics.log
[exec] The active test run was aborted. Reason:
[exec]
[exec] Test Run Aborted.
[exec] /home/jenkins/jenkins-slave/workspace/logging-log4net_PR-16-SN25D6UCTITH36PS63DJQ2Q5GRHQL3KU6EXJV3QQ6STYNVW7HTDQ/tests/nant.build(869,10):
[exec] External Program Failed: dotnet (return code was 1)
[move] 3 files moved.
BUILD SUCCEEDED - 1 non-fatal error(s), 2 warning(s)
Total time: 10.9 seconds.
[Pipeline] stash
Stashed 0 file(s)
[Pipeline] stash
Stashed 3 file(s)
[Pipeline] }
$ docker stop --time=1 a9fc0204100a2c5220d23d91e782003958fa182b69bfca10c6fde356b938430e
$ docker rm -f a9fc0204100a2c5220d23d91e782003958fa182b69bfca10c6fde356b938430e
[Pipeline] // withDockerContainer
[Pipeline] }
[Pipeline] // script
[Pipeline] }
[Pipeline] // stage
[Pipeline] stage
[Pipeline] { (build net-2.0)
[Pipeline] node
Still waiting to schedule task
Waiting for next available executor on windows-2012-1||windows-2012-2||windows-2012-3
Running on windows-2012-2 in f:\jenkins\jenkins-slave\workspace\logging-log4net_PR-16-SN25D6UCTITH36PS63DJQ2Q5GRHQL3KU6EXJV3QQ6STYNVW7HTDQ
[Pipeline] {
[Pipeline] withEnv
[Pipeline] {
[Pipeline] deleteDir
[Pipeline] checkout
Cloning the remote Git repository
Cloning with configured refspecs honoured and without tags
Cloning repository https://github.com/apache/logging-log4net.git
> git init f:\jenkins\jenkins-slave\workspace\logging-log4net_PR-16-SN25D6UCTITH36PS63DJQ2Q5GRHQL3KU6EXJV3QQ6STYNVW7HTDQ # timeout=10
Fetching upstream changes from https://github.com/apache/logging-log4net.git
> git --version # timeout=10
using GIT_ASKPASS to set credentials dpsenner at github
> git fetch --no-tags --progress https://github.com/apache/logging-log4net.git +refs/pull/16/head:refs/remotes/origin/PR-16 +refs/heads/develop:refs/remotes/origin/develop
> git config remote.origin.url https://github.com/apache/logging-log4net.git # timeout=10
> git config --add remote.origin.fetch +refs/pull/16/head:refs/remotes/origin/PR-16 # timeout=10
> git config --add remote.origin.fetch +refs/heads/develop:refs/remotes/origin/develop # timeout=10
> git config remote.origin.url https://github.com/apache/logging-log4net.git # timeout=10
Fetching without tags
Fetching upstream changes from https://github.com/apache/logging-log4net.git
using GIT_ASKPASS to set credentials dpsenner at github
> git fetch --no-tags --progress https://github.com/apache/logging-log4net.git +refs/pull/16/head:refs/remotes/origin/PR-16 +refs/heads/develop:refs/remotes/origin/develop
Merging remotes/origin/develop commit 423afad482a91ca3cffcb53e3f2b78fd3858ea4a into PR head commit c77a38322a12c42c695f1f97eadfbff1e30f219c
> git config core.sparsecheckout # timeout=10
> git checkout -f c77a38322a12c42c695f1f97eadfbff1e30f219c
> git merge 423afad482a91ca3cffcb53e3f2b78fd3858ea4a # timeout=10
> git rev-parse "HEAD^{commit}" # timeout=10
Merge succeeded, producing 5d498e678acee39613928ed931d1fdc38bbca2ed
Checking out Revision 5d498e678acee39613928ed931d1fdc38bbca2ed (PR-16)
> git config core.sparsecheckout # timeout=10
> git checkout -f 5d498e678acee39613928ed931d1fdc38bbca2ed
Commit message: "Merge commit '423afad482a91ca3cffcb53e3f2b78fd3858ea4a' into HEAD"
> git rev-list --no-walk 3da5cfd286011d0a513c3d64ab39ae6d98fed4b5 # timeout=10
First time build. Skipping changelog.
[Pipeline] bat
[logging-log4net_PR-16-SN25D6UCTITH36PS63DJQ2Q5GRHQL3KU6EXJV3QQ6STYNVW7HTDQ] Running batch script
f:\jenkins\jenkins-slave\workspace\logging-log4net_PR-16-SN25D6UCTITH36PS63DJQ2Q5GRHQL3KU6EXJV3QQ6STYNVW7HTDQ>F:\jenkins\tools\nant\nant-0.92\bin\NAnt.exe -t:net-2.0 -buildfile:log4net.build compile-net-2.0
NAnt 0.92 (Build 0.92.4543.0; release; 6/9/2012)
Copyright (C) 2001-2012 Gerry Shaw
http://nant.sourceforge.net
Buildfile: file:///f:/jenkins/jenkins-slave/workspace/logging-log4net_PR-16-SN25D6UCTITH36PS63DJQ2Q5GRHQL3KU6EXJV3QQ6STYNVW7HTDQ/log4net.build
Target framework: Microsoft .NET Framework 2.0
Target(s) specified: compile-net-2.0
check-current-build-config:
set-build-configuration:
set-debug-build-configuration:
check-current-build-config:
set-build-configuration-flags:
compile-net-2.0:
set-debug-build-configuration:
check-current-build-config:
set-build-configuration-flags:
compile-net-2.0-current-configuration:
check-bin-dir:
[mkdir] Creating directory 'f:\jenkins\jenkins-slave\workspace\logging-log4net_PR-16-SN25D6UCTITH36PS63DJQ2Q5GRHQL3KU6EXJV3QQ6STYNVW7HTDQ\bin'.
check-doc-dir:
[mkdir] Creating directory 'f:\jenkins\jenkins-slave\workspace\logging-log4net_PR-16-SN25D6UCTITH36PS63DJQ2Q5GRHQL3KU6EXJV3QQ6STYNVW7HTDQ\doc'.
check-sdkdoc-dir:
check-sdkdoc-debug:
check-current-build-config:
check-build-debug:
check-build-defines:
set-net-2.0-runtime-configuration:
check-log4net-basedir:
check-current-bin-dir:
[mkdir] Creating directory 'f:\jenkins\jenkins-slave\workspace\logging-log4net_PR-16-SN25D6UCTITH36PS63DJQ2Q5GRHQL3KU6EXJV3QQ6STYNVW7HTDQ\bin\net\2.0\debug'.
clean-current-bin-dir:
[echo] Cleaning the bin/net/2.0/debug binaries directory.
[delete] Deleting directory 'f:\jenkins\jenkins-slave\workspace\logging-log4net_PR-16-SN25D6UCTITH36PS63DJQ2Q5GRHQL3KU6EXJV3QQ6STYNVW7HTDQ\bin\net\2.0\debug'.
[mkdir] Creating directory 'f:\jenkins\jenkins-slave\workspace\logging-log4net_PR-16-SN25D6UCTITH36PS63DJQ2Q5GRHQL3KU6EXJV3QQ6STYNVW7HTDQ\bin\net\2.0\debug'.
[csc] Compiling 226 files to 'f:\jenkins\jenkins-slave\workspace\logging-log4net_PR-16-SN25D6UCTITH36PS63DJQ2Q5GRHQL3KU6EXJV3QQ6STYNVW7HTDQ\bin\net\2.0\debug\log4net.dll'.
[csc] f:\jenkins\jenkins-slave\workspace\logging-log4net_PR-16-SN25D6UCTITH36PS63DJQ2Q5GRHQL3KU6EXJV3QQ6STYNVW7HTDQ\src\Appender\FileAppender.cs(389,121): error CS0241: Default parameter specifiers are not permitted
[csc] f:\jenkins\jenkins-slave\workspace\logging-log4net_PR-16-SN25D6UCTITH36PS63DJQ2Q5GRHQL3KU6EXJV3QQ6STYNVW7HTDQ\src\Appender\FileAppender.cs(539,121): error CS0241: Default parameter specifiers are not permitted
[csc] f:\jenkins\jenkins-slave\workspace\logging-log4net_PR-16-SN25D6UCTITH36PS63DJQ2Q5GRHQL3KU6EXJV3QQ6STYNVW7HTDQ\src\Appender\FileAppender.cs(644,121): error CS0241: Default parameter specifiers are not permitted
[csc] f:\jenkins\jenkins-slave\workspace\logging-log4net_PR-16-SN25D6UCTITH36PS63DJQ2Q5GRHQL3KU6EXJV3QQ6STYNVW7HTDQ\src\Appender\FileAppender.cs(776,112): error CS0241: Default parameter specifiers are not permitted
BUILD FAILED
f:\jenkins\jenkins-slave\workspace\logging-log4net_PR-16-SN25D6UCTITH36PS63DJQ2Q5GRHQL3KU6EXJV3QQ6STYNVW7HTDQ\log4net.build(613,8):
External Program Failed: C:\Windows\Microsoft.NET\Framework64\v2.0.50727\csc.exe (return code was 1)
Total time: 0.5 seconds.
[Pipeline] }
[Pipeline] // withEnv
[Pipeline] }
[Pipeline] // node
[Pipeline] }
[Pipeline] // stage
[Pipeline] stage
[Pipeline] { (build net-3.5)
Stage 'build net-3.5' skipped due to earlier failure(s)
[Pipeline] }
[Pipeline] // stage
[Pipeline] stage
[Pipeline] { (build net-3.5-cp)
Stage 'build net-3.5-cp' skipped due to earlier failure(s)
[Pipeline] }
[Pipeline] // stage
[Pipeline] stage
[Pipeline] { (build net-4.0)
Stage 'build net-4.0' skipped due to earlier failure(s)
[Pipeline] }
[Pipeline] // stage
[Pipeline] stage
[Pipeline] { (build net-4.0-cp)
Stage 'build net-4.0-cp' skipped due to earlier failure(s)
[Pipeline] }
[Pipeline] // stage
[Pipeline] stage
[Pipeline] { (build net-4.5)
Stage 'build net-4.5' skipped due to earlier failure(s)
[Pipeline] }
[Pipeline] // stage
[Pipeline] stage
[Pipeline] { (build mono-2.0)
Stage 'build mono-2.0' skipped due to earlier failure(s)
[Pipeline] }
[Pipeline] // stage
[Pipeline] stage
[Pipeline] { (build mono-3.5)
Stage 'build mono-3.5' skipped due to earlier failure(s)
[Pipeline] }
[Pipeline] // stage
[Pipeline] stage
[Pipeline] { (build mono-4.0)
Stage 'build mono-4.0' skipped due to earlier failure(s)
[Pipeline] }
[Pipeline] // stage
[Pipeline] stage
[Pipeline] { (build site)
Stage 'build site' skipped due to earlier failure(s)
[Pipeline] }
[Pipeline] // stage
[Pipeline] stage
[Pipeline] { (prepare package)
Stage 'prepare package' skipped due to earlier failure(s)
[Pipeline] }
[Pipeline] // stage
[Pipeline] stage
[Pipeline] { (check test results)
Stage 'check test results' skipped due to earlier failure(s)
[Pipeline] }
[Pipeline] // stage
[Pipeline] stage
[Pipeline] { (publish site)
Stage 'publish site' skipped due to earlier failure(s)
[Pipeline] }
[Pipeline] // stage
[Pipeline] stage
[Pipeline] { (Declarative: Post Actions)
[Pipeline] step