You are viewing a plain text version of this content. The canonical link for it is here.
Posted to builds@hbase.apache.org by Apache Jenkins Server <je...@builds.apache.org> on 2014/08/27 19:55:42 UTC

Build failed in Jenkins: HBase-TRUNK #5438

See <https://builds.apache.org/job/HBase-TRUNK/5438/changes>

Changes:

[jxiang] HBASE-11788 HBase is not deleting the cell when a Put with a KeyValue, KeyValue.Type.Delete is submitted

[stack] HBASE-9875 NamespaceJanitor chore is not used

------------------------------------------
[...truncated 1002 lines...]
Tests run: 5, Failures: 0, Errors: 0, Skipped: 0, Time elapsed: 3.403 sec - in org.apache.hadoop.hbase.util.TestByteBloomFilter
Running org.apache.hadoop.hbase.util.TestHBaseFsckComparator
Tests run: 6, Failures: 0, Errors: 0, Skipped: 0, Time elapsed: 1.264 sec - in org.apache.hadoop.hbase.util.TestHBaseFsckComparator
Running org.apache.hadoop.hbase.util.TestRegionSplitCalculator
Tests run: 15, Failures: 0, Errors: 0, Skipped: 0, Time elapsed: 2.188 sec - in org.apache.hadoop.hbase.util.TestRegionSplitCalculator
Running org.apache.hadoop.hbase.util.TestPoolMap$TestRoundRobinPoolType
Tests run: 3, Failures: 0, Errors: 0, Skipped: 0, Time elapsed: 0.914 sec - in org.apache.hadoop.hbase.util.TestPoolMap$TestRoundRobinPoolType
Running org.apache.hadoop.hbase.util.TestPoolMap$TestThreadLocalPoolType
Tests run: 3, Failures: 0, Errors: 0, Skipped: 0, Time elapsed: 0.349 sec - in org.apache.hadoop.hbase.util.TestPoolMap$TestThreadLocalPoolType
Running org.apache.hadoop.hbase.util.TestPoolMap$TestReusablePoolType
Tests run: 3, Failures: 0, Errors: 0, Skipped: 0, Time elapsed: 0.448 sec - in org.apache.hadoop.hbase.util.TestPoolMap$TestReusablePoolType
Running org.apache.hadoop.hbase.util.TestHFileArchiveUtil
Tests run: 4, Failures: 0, Errors: 0, Skipped: 0, Time elapsed: 2.842 sec - in org.apache.hadoop.hbase.util.TestHFileArchiveUtil
Running org.apache.hadoop.hbase.util.TestBoundedPriorityBlockingQueue
Tests run: 7, Failures: 0, Errors: 0, Skipped: 0, Time elapsed: 2.256 sec - in org.apache.hadoop.hbase.util.TestBoundedPriorityBlockingQueue
Running org.apache.hadoop.hbase.util.TestByteBufferUtils
Tests run: 12, Failures: 0, Errors: 0, Skipped: 0, Time elapsed: 2.982 sec - in org.apache.hadoop.hbase.util.TestByteBufferUtils
Running org.apache.hadoop.hbase.filter.TestNullComparator
Tests run: 3, Failures: 0, Errors: 0, Skipped: 0, Time elapsed: 0.947 sec - in org.apache.hadoop.hbase.filter.TestNullComparator
Running org.apache.hadoop.hbase.filter.TestFilter
Tests run: 21, Failures: 0, Errors: 0, Skipped: 0, Time elapsed: 14.351 sec - in org.apache.hadoop.hbase.filter.TestFilter
Running org.apache.hadoop.hbase.filter.TestInclusiveStopFilter
Tests run: 2, Failures: 0, Errors: 0, Skipped: 0, Time elapsed: 0.748 sec - in org.apache.hadoop.hbase.filter.TestInclusiveStopFilter
Running org.apache.hadoop.hbase.filter.TestDependentColumnFilter
Tests run: 4, Failures: 0, Errors: 0, Skipped: 0, Time elapsed: 5.967 sec - in org.apache.hadoop.hbase.filter.TestDependentColumnFilter
Running org.apache.hadoop.hbase.filter.TestParseFilter
Tests run: 34, Failures: 0, Errors: 0, Skipped: 0, Time elapsed: 4.966 sec - in org.apache.hadoop.hbase.filter.TestParseFilter
Running org.apache.hadoop.hbase.filter.TestComparatorSerialization
Tests run: 6, Failures: 0, Errors: 0, Skipped: 0, Time elapsed: 2.95 sec - in org.apache.hadoop.hbase.filter.TestComparatorSerialization
Running org.apache.hadoop.hbase.filter.TestMultipleColumnPrefixFilter
Tests run: 3, Failures: 0, Errors: 0, Skipped: 0, Time elapsed: 13.119 sec - in org.apache.hadoop.hbase.filter.TestMultipleColumnPrefixFilter
Running org.apache.hadoop.hbase.filter.TestColumnPaginationFilter
Tests run: 1, Failures: 0, Errors: 0, Skipped: 0, Time elapsed: 2.123 sec - in org.apache.hadoop.hbase.filter.TestColumnPaginationFilter
Running org.apache.hadoop.hbase.filter.TestRandomRowFilter
Tests run: 2, Failures: 0, Errors: 0, Skipped: 0, Time elapsed: 1.712 sec - in org.apache.hadoop.hbase.filter.TestRandomRowFilter
Running org.apache.hadoop.hbase.filter.TestSingleColumnValueFilter
Tests run: 2, Failures: 0, Errors: 0, Skipped: 0, Time elapsed: 2.083 sec - in org.apache.hadoop.hbase.filter.TestSingleColumnValueFilter
Running org.apache.hadoop.hbase.filter.TestPageFilter
Tests run: 2, Failures: 0, Errors: 0, Skipped: 0, Time elapsed: 0.771 sec - in org.apache.hadoop.hbase.filter.TestPageFilter
Running org.apache.hadoop.hbase.filter.TestFilterSerialization
Tests run: 25, Failures: 0, Errors: 0, Skipped: 0, Time elapsed: 5.63 sec - in org.apache.hadoop.hbase.filter.TestFilterSerialization
Running org.apache.hadoop.hbase.filter.TestInvocationRecordFilter
Tests run: 1, Failures: 0, Errors: 0, Skipped: 0, Time elapsed: 3.821 sec - in org.apache.hadoop.hbase.filter.TestInvocationRecordFilter
Running org.apache.hadoop.hbase.filter.TestFilterList
Tests run: 7, Failures: 0, Errors: 0, Skipped: 0, Time elapsed: 2.57 sec - in org.apache.hadoop.hbase.filter.TestFilterList
Running org.apache.hadoop.hbase.filter.TestFirstKeyValueMatchingQualifiersFilter
Tests run: 1, Failures: 0, Errors: 0, Skipped: 0, Time elapsed: 0.78 sec - in org.apache.hadoop.hbase.filter.TestFirstKeyValueMatchingQualifiersFilter
Running org.apache.hadoop.hbase.filter.TestFuzzyRowFilter
Tests run: 2, Failures: 0, Errors: 0, Skipped: 0, Time elapsed: 0.95 sec - in org.apache.hadoop.hbase.filter.TestFuzzyRowFilter
Running org.apache.hadoop.hbase.filter.TestPrefixFilter
Tests run: 3, Failures: 0, Errors: 0, Skipped: 0, Time elapsed: 0.942 sec - in org.apache.hadoop.hbase.filter.TestPrefixFilter
Running org.apache.hadoop.hbase.filter.TestSingleColumnValueExcludeFilter
Tests run: 1, Failures: 0, Errors: 0, Skipped: 0, Time elapsed: 0.567 sec - in org.apache.hadoop.hbase.filter.TestSingleColumnValueExcludeFilter
Running org.apache.hadoop.hbase.filter.TestBitComparator
Tests run: 6, Failures: 0, Errors: 0, Skipped: 0, Time elapsed: 1.307 sec - in org.apache.hadoop.hbase.filter.TestBitComparator
Running org.apache.hadoop.hbase.filter.TestColumnPrefixFilter
Tests run: 2, Failures: 0, Errors: 0, Skipped: 0, Time elapsed: 8.245 sec - in org.apache.hadoop.hbase.filter.TestColumnPrefixFilter
Running org.apache.hadoop.hbase.TestServerName
Tests run: 6, Failures: 0, Errors: 0, Skipped: 0, Time elapsed: 1.203 sec - in org.apache.hadoop.hbase.TestServerName
Running org.apache.hadoop.hbase.TestPerformanceEvaluation
Tests run: 4, Failures: 0, Errors: 0, Skipped: 1, Time elapsed: 1.071 sec - in org.apache.hadoop.hbase.TestPerformanceEvaluation
Running org.apache.hadoop.hbase.TestServerLoad
Tests run: 2, Failures: 0, Errors: 0, Skipped: 0, Time elapsed: 0.951 sec - in org.apache.hadoop.hbase.TestServerLoad
Running org.apache.hadoop.hbase.client.TestPutDeleteEtcCellIteration
Tests run: 6, Failures: 0, Errors: 0, Skipped: 0, Time elapsed: 1.445 sec - in org.apache.hadoop.hbase.client.TestPutDeleteEtcCellIteration
Running org.apache.hadoop.hbase.client.TestConnectionUtils
Tests run: 1, Failures: 0, Errors: 0, Skipped: 0, Time elapsed: 0.671 sec - in org.apache.hadoop.hbase.client.TestConnectionUtils
Running org.apache.hadoop.hbase.client.TestIntraRowPagination
Tests run: 1, Failures: 0, Errors: 0, Skipped: 0, Time elapsed: 3.496 sec - in org.apache.hadoop.hbase.client.TestIntraRowPagination
Running org.apache.hadoop.hbase.client.TestResult
Tests run: 7, Failures: 0, Errors: 0, Skipped: 0, Time elapsed: 1.484 sec - in org.apache.hadoop.hbase.client.TestResult
Running org.apache.hadoop.hbase.client.TestHBaseAdminNoCluster
Tests run: 1, Failures: 0, Errors: 0, Skipped: 0, Time elapsed: 4.459 sec - in org.apache.hadoop.hbase.client.TestHBaseAdminNoCluster
Running org.apache.hadoop.hbase.protobuf.TestProtobufUtil
Tests run: 7, Failures: 0, Errors: 0, Skipped: 0, Time elapsed: 3.165 sec - in org.apache.hadoop.hbase.protobuf.TestProtobufUtil
Running org.apache.hadoop.hbase.protobuf.TestReplicationProtobuf
Tests run: 1, Failures: 0, Errors: 0, Skipped: 0, Time elapsed: 0.795 sec - in org.apache.hadoop.hbase.protobuf.TestReplicationProtobuf
Running org.apache.hadoop.hbase.procedure.TestProcedureMember
Tests run: 8, Failures: 0, Errors: 0, Skipped: 0, Time elapsed: 2.207 sec - in org.apache.hadoop.hbase.procedure.TestProcedureMember
Running org.apache.hadoop.hbase.procedure.TestProcedureManager
Tests run: 1, Failures: 0, Errors: 0, Skipped: 0, Time elapsed: 1.703 sec - in org.apache.hadoop.hbase.procedure.TestProcedureManager
Running org.apache.hadoop.hbase.procedure.TestProcedure
Tests run: 4, Failures: 0, Errors: 0, Skipped: 0, Time elapsed: 2.325 sec - in org.apache.hadoop.hbase.procedure.TestProcedure
Running org.apache.hadoop.hbase.procedure.TestProcedureCoordinator
Tests run: 7, Failures: 0, Errors: 0, Skipped: 0, Time elapsed: 1.821 sec - in org.apache.hadoop.hbase.procedure.TestProcedureCoordinator
Running org.apache.hadoop.hbase.constraint.TestConstraints
Tests run: 6, Failures: 0, Errors: 0, Skipped: 0, Time elapsed: 3.149 sec - in org.apache.hadoop.hbase.constraint.TestConstraints
Running org.apache.hadoop.hbase.rest.TestGZIPResponseWrapper
Tests run: 4, Failures: 0, Errors: 0, Skipped: 0, Time elapsed: 1.246 sec - in org.apache.hadoop.hbase.rest.TestGZIPResponseWrapper
Running org.apache.hadoop.hbase.rest.client.TestRemoteAdminRetries
Tests run: 7, Failures: 0, Errors: 0, Skipped: 0, Time elapsed: 2.741 sec - in org.apache.hadoop.hbase.rest.client.TestRemoteAdminRetries
Running org.apache.hadoop.hbase.rest.client.TestRemoteHTableRetries
Tests run: 7, Failures: 0, Errors: 0, Skipped: 0, Time elapsed: 2.701 sec - in org.apache.hadoop.hbase.rest.client.TestRemoteHTableRetries
Running org.apache.hadoop.hbase.rest.model.TestVersionModel
Tests run: 6, Failures: 0, Errors: 0, Skipped: 0, Time elapsed: 1.347 sec - in org.apache.hadoop.hbase.rest.model.TestVersionModel
Running org.apache.hadoop.hbase.rest.model.TestStorageClusterVersionModel
Tests run: 6, Failures: 0, Errors: 0, Skipped: 0, Time elapsed: 1.487 sec - in org.apache.hadoop.hbase.rest.model.TestStorageClusterVersionModel
Running org.apache.hadoop.hbase.rest.model.TestColumnSchemaModel
Tests run: 6, Failures: 0, Errors: 0, Skipped: 0, Time elapsed: 1.356 sec - in org.apache.hadoop.hbase.rest.model.TestColumnSchemaModel
Running org.apache.hadoop.hbase.rest.model.TestCellModel
Tests run: 6, Failures: 0, Errors: 0, Skipped: 0, Time elapsed: 1.371 sec - in org.apache.hadoop.hbase.rest.model.TestCellModel
Running org.apache.hadoop.hbase.rest.model.TestTableListModel
Tests run: 6, Failures: 0, Errors: 0, Skipped: 0, Time elapsed: 1.645 sec - in org.apache.hadoop.hbase.rest.model.TestTableListModel
Running org.apache.hadoop.hbase.rest.model.TestStorageClusterStatusModel
Tests run: 6, Failures: 0, Errors: 0, Skipped: 0, Time elapsed: 1.984 sec - in org.apache.hadoop.hbase.rest.model.TestStorageClusterStatusModel
Running org.apache.hadoop.hbase.rest.model.TestScannerModel
Tests run: 6, Failures: 0, Errors: 0, Skipped: 0, Time elapsed: 1.66 sec - in org.apache.hadoop.hbase.rest.model.TestScannerModel
Running org.apache.hadoop.hbase.rest.model.TestTableSchemaModel
Tests run: 6, Failures: 0, Errors: 0, Skipped: 0, Time elapsed: 1.657 sec - in org.apache.hadoop.hbase.rest.model.TestTableSchemaModel
Running org.apache.hadoop.hbase.rest.model.TestTableInfoModel
Tests run: 6, Failures: 0, Errors: 0, Skipped: 0, Time elapsed: 1.399 sec - in org.apache.hadoop.hbase.rest.model.TestTableInfoModel
Running org.apache.hadoop.hbase.rest.model.TestTableRegionModel
Tests run: 8, Failures: 0, Errors: 0, Skipped: 0, Time elapsed: 1.728 sec - in org.apache.hadoop.hbase.rest.model.TestTableRegionModel
Running org.apache.hadoop.hbase.rest.model.TestRowModel
Tests run: 6, Failures: 0, Errors: 0, Skipped: 0, Time elapsed: 1.13 sec - in org.apache.hadoop.hbase.rest.model.TestRowModel
Running org.apache.hadoop.hbase.rest.model.TestCellSetModel
Tests run: 6, Failures: 0, Errors: 0, Skipped: 0, Time elapsed: 1.696 sec - in org.apache.hadoop.hbase.rest.model.TestCellSetModel
Running org.apache.hadoop.hbase.TestHTableDescriptor
Tests run: 11, Failures: 0, Errors: 0, Skipped: 0, Time elapsed: 3.362 sec - in org.apache.hadoop.hbase.TestHTableDescriptor
Running org.apache.hadoop.hbase.snapshot.TestRestoreSnapshotHelper
Tests run: 1, Failures: 0, Errors: 0, Skipped: 0, Time elapsed: 5.534 sec - in org.apache.hadoop.hbase.snapshot.TestRestoreSnapshotHelper
Running org.apache.hadoop.hbase.coprocessor.TestRegionObserverStacking
Tests run: 1, Failures: 0, Errors: 0, Skipped: 0, Time elapsed: 3.255 sec - in org.apache.hadoop.hbase.coprocessor.TestRegionObserverStacking
Running org.apache.hadoop.hbase.coprocessor.TestCoprocessorInterface
Tests run: 2, Failures: 0, Errors: 0, Skipped: 0, Time elapsed: 20.231 sec - in org.apache.hadoop.hbase.coprocessor.TestCoprocessorInterface
Running org.apache.hadoop.hbase.executor.TestExecutorService
Tests run: 1, Failures: 0, Errors: 0, Skipped: 0, Time elapsed: 3.153 sec - in org.apache.hadoop.hbase.executor.TestExecutorService
Running org.apache.hadoop.hbase.zookeeper.TestZooKeeperMainServer
Tests run: 2, Failures: 0, Errors: 0, Skipped: 0, Time elapsed: 2.614 sec - in org.apache.hadoop.hbase.zookeeper.TestZooKeeperMainServer
Running org.apache.hadoop.hbase.zookeeper.TestZKConfig
Tests run: 1, Failures: 0, Errors: 0, Skipped: 0, Time elapsed: 1.159 sec - in org.apache.hadoop.hbase.zookeeper.TestZKConfig
Running org.apache.hadoop.hbase.metrics.TestMetricsHistogram
Tests run: 3, Failures: 0, Errors: 0, Skipped: 0, Time elapsed: 1.916 sec - in org.apache.hadoop.hbase.metrics.TestMetricsHistogram
Running org.apache.hadoop.hbase.TestHColumnDescriptor
Tests run: 3, Failures: 0, Errors: 0, Skipped: 0, Time elapsed: 2.997 sec - in org.apache.hadoop.hbase.TestHColumnDescriptor
Running org.apache.hadoop.hbase.monitoring.TestMemoryBoundedLogMessageBuffer
Tests run: 2, Failures: 0, Errors: 0, Skipped: 0, Time elapsed: 0.777 sec - in org.apache.hadoop.hbase.monitoring.TestMemoryBoundedLogMessageBuffer
Running org.apache.hadoop.hbase.monitoring.TestTaskMonitor
Tests run: 3, Failures: 0, Errors: 0, Skipped: 0, Time elapsed: 1.799 sec - in org.apache.hadoop.hbase.monitoring.TestTaskMonitor

Results :

Tests run: 912, Failures: 0, Errors: 0, Skipped: 7

[INFO] ------------------------------------------------------------------------
[INFO] Reactor Summary:
[INFO] 
[INFO] HBase ............................................. SUCCESS [7.302s]
[INFO] HBase - Common .................................... SUCCESS [2:14.610s]
[INFO] HBase - Protocol .................................. SUCCESS [21.085s]
[INFO] HBase - Client .................................... SUCCESS [1:29.962s]
[INFO] HBase - Hadoop Compatibility ...................... SUCCESS [11.610s]
[INFO] HBase - Hadoop Two Compatibility .................. SUCCESS [15.829s]
[INFO] HBase - Prefix Tree ............................... SUCCESS [22.321s]
[INFO] HBase - Server .................................... FAILURE [28:09.541s]
[INFO] HBase - Testing Util .............................. SKIPPED
[INFO] HBase - Thrift .................................... SKIPPED
[INFO] HBase - Shell ..................................... SKIPPED
[INFO] HBase - Integration Tests ......................... SKIPPED
[INFO] HBase - Examples .................................. SKIPPED
[INFO] HBase - Assembly .................................. SKIPPED
[INFO] ------------------------------------------------------------------------
[INFO] BUILD FAILURE
[INFO] ------------------------------------------------------------------------
[INFO] Total time: 33:14.435s
[INFO] Finished at: Wed Aug 27 17:50:52 UTC 2014
[INFO] Final Memory: 64M/992M
[INFO] ------------------------------------------------------------------------
[ERROR] Failed to execute goal org.apache.maven.plugins:maven-surefire-plugin:2.17:test (default-test) on project hbase-server: ExecutionException: java.lang.RuntimeException: The forked VM terminated without properly saying goodbye. VM crash or System.exit called?
[ERROR] Command was /bin/sh -c cd <https://builds.apache.org/job/HBase-TRUNK/ws/hbase-server> && /home/jenkins/tools/java/jdk1.7.0_25-32/jre/bin/java -enableassertions -XX:MaxDirectMemorySize=1G -Xmx1900m -XX:MaxPermSize=256m -Djava.security.egd=file:/dev/./urandom -Djava.net.preferIPv4Stack=true -Djava.awt.headless=true -jar <https://builds.apache.org/job/HBase-TRUNK/ws/hbase-server/target/surefire/surefirebooter3878356272626471511.jar> <https://builds.apache.org/job/HBase-TRUNK/ws/hbase-server/target/surefire/surefire5227710500267194182tmp> <https://builds.apache.org/job/HBase-TRUNK/ws/hbase-server/target/surefire/surefire_4002558952718242312020tmp>
[ERROR] -> [Help 1]
[ERROR] 
[ERROR] To see the full stack trace of the errors, re-run Maven with the -e switch.
[ERROR] Re-run Maven using the -X switch to enable full debug logging.
[ERROR] 
[ERROR] For more information about the errors and possible solutions, please read the following articles:
[ERROR] [Help 1] http://cwiki.apache.org/confluence/display/MAVEN/MojoFailureException
[ERROR] 
[ERROR] After correcting the problems, you can resume the build with the command
[ERROR]   mvn <goals> -rf :hbase-server
Build step 'Invoke top-level Maven targets' marked build as failure
Performing Post build task...
Match found for :.* : True
Logical operation result is TRUE
Running script  :   ZOMBIE_TESTS_COUNT=`jps | grep surefirebooter | wc -l`
  if [[ $ZOMBIE_TESTS_COUNT != 0 ]] ; then
    #It seems sometimes the tests are not dying immediately. Let's give them 10s
    echo "Suspicious java process found - waiting 10s to see if there are just slow to stop"
    sleep 10   
    ZOMBIE_TESTS_COUNT=`jps | grep surefirebooter | wc -l`
    if [[ $ZOMBIE_TESTS_COUNT != 0 ]] ; then
      echo "There are $ZOMBIE_TESTS_COUNT zombie tests, they should have been killed by surefire but survived"
      echo "************ BEGIN zombies jstack extract"
      ZB_STACK=`jps | grep surefirebooter | cut -d ' ' -f 1 | xargs -n 1 jstack | grep ".test" | grep "\.java"`
      jps | grep surefirebooter | cut -d ' ' -f 1 | xargs -n 1 jstack
      echo "************ END  zombies jstack extract"
      JIRA_COMMENT="$JIRA_COMMENT

     {color:red}-1 core zombie tests{color}.  There are ${ZOMBIE_TESTS_COUNT} zombie test(s): ${ZB_STACK}"
      BAD=1
      jps | grep surefirebooter | cut -d ' ' -f 1 | xargs kill -9
    else
      echo "We're ok: there is no zombie test, but some tests took some time to stop"
    fi
  else
    echo "We're ok: there is no zombie test"
  fi
[HBase-TRUNK] $ /bin/bash -xe /tmp/hudson1889914333416833471.sh
++ jps
++ wc -l
++ grep surefirebooter
+ ZOMBIE_TESTS_COUNT=1
+ [[ 1 != 0 ]]
+ echo 'Suspicious java process found - waiting 10s to see if there are just slow to stop'
Suspicious java process found - waiting 10s to see if there are just slow to stop
+ sleep 10
++ jps
++ grep surefirebooter
++ wc -l
+ ZOMBIE_TESTS_COUNT=1
+ [[ 1 != 0 ]]
+ echo 'There are 1 zombie tests, they should have been killed by surefire but survived'
There are 1 zombie tests, they should have been killed by surefire but survived
+ echo '************ BEGIN zombies jstack extract'
************ BEGIN zombies jstack extract
++ cut -d ' ' -f 1
++ xargs -n 1 jstack
++ grep .test
++ grep '\.java'
++ grep surefirebooter
++ jps
+ ZB_STACK='	at org.apache.hadoop.hbase.regionserver.TestExplicitColumnTracker.testStackOverflow(TestExplicitColumnTracker.java:208)'
+ jps
+ grep surefirebooter
+ cut -d ' ' -f 1
+ xargs -n 1 jstack
1877: No such process
POST BUILD TASK : FAILURE
END OF POST BUILD TASK : 0
Archiving artifacts
Sending artifact delta relative to HBase-TRUNK #5421
Archived 890 artifacts
Archive block size is 32768
Received 8 blocks and 33442221 bytes
Compression is 0.8%
Took 37 sec
Recording test results
Updating HBASE-11788
Updating HBASE-9875

Jenkins build is back to normal : HBase-TRUNK #5442

Posted by Apache Jenkins Server <je...@builds.apache.org>.
See <https://builds.apache.org/job/HBase-TRUNK/5442/changes>


Build failed in Jenkins: HBase-TRUNK #5441

Posted by Apache Jenkins Server <je...@builds.apache.org>.
See <https://builds.apache.org/job/HBase-TRUNK/5441/changes>

Changes:

[jmhsieh] HBASE-11849 remove classes with audience.private for internals that we don't use.

------------------------------------------
[...truncated 978 lines...]
Tests run: 1, Failures: 0, Errors: 0, Skipped: 0, Time elapsed: 1.179 sec - in org.apache.hadoop.hbase.mapreduce.TestGroupingTableMapper
Running org.apache.hadoop.hbase.mapreduce.TestSimpleTotalOrderPartitioner
Tests run: 1, Failures: 0, Errors: 0, Skipped: 0, Time elapsed: 0.248 sec - in org.apache.hadoop.hbase.mapreduce.TestSimpleTotalOrderPartitioner
Killed
Running org.apache.hadoop.hbase.mapreduce.hadoopbackport.TestJarFinder
Tests run: 4, Failures: 0, Errors: 0, Skipped: 0, Time elapsed: 3.096 sec - in org.apache.hadoop.hbase.mapreduce.hadoopbackport.TestJarFinder
Running org.apache.hadoop.hbase.mapreduce.TestTableSplit
Tests run: 3, Failures: 0, Errors: 0, Skipped: 0, Time elapsed: 1.063 sec - in org.apache.hadoop.hbase.mapreduce.TestTableSplit
Running org.apache.hadoop.hbase.TestSerialization
Tests run: 9, Failures: 0, Errors: 0, Skipped: 0, Time elapsed: 3.489 sec - in org.apache.hadoop.hbase.TestSerialization
Running org.apache.hadoop.hbase.util.TestCompressionTest
Tests run: 2, Failures: 0, Errors: 0, Skipped: 0, Time elapsed: 1.205 sec - in org.apache.hadoop.hbase.util.TestCompressionTest
Running org.apache.hadoop.hbase.util.TestSortedCopyOnWriteSet
Tests run: 2, Failures: 0, Errors: 0, Skipped: 0, Time elapsed: 0.758 sec - in org.apache.hadoop.hbase.util.TestSortedCopyOnWriteSet
Running org.apache.hadoop.hbase.util.TestRegionSizeCalculator
Tests run: 3, Failures: 0, Errors: 0, Skipped: 0, Time elapsed: 1.668 sec - in org.apache.hadoop.hbase.util.TestRegionSizeCalculator
Running org.apache.hadoop.hbase.util.TestRootPath
Tests run: 1, Failures: 0, Errors: 0, Skipped: 0, Time elapsed: 0.512 sec - in org.apache.hadoop.hbase.util.TestRootPath
Running org.apache.hadoop.hbase.util.TestIncrementingEnvironmentEdge
Tests run: 1, Failures: 0, Errors: 0, Skipped: 0, Time elapsed: 0.681 sec - in org.apache.hadoop.hbase.util.TestIncrementingEnvironmentEdge
Running org.apache.hadoop.hbase.util.TestTableName
Tests run: 4, Failures: 0, Errors: 0, Skipped: 0, Time elapsed: 1.104 sec - in org.apache.hadoop.hbase.util.TestTableName
Running org.apache.hadoop.hbase.util.TestByteBloomFilter
Tests run: 5, Failures: 0, Errors: 0, Skipped: 0, Time elapsed: 2.8 sec - in org.apache.hadoop.hbase.util.TestByteBloomFilter
Running org.apache.hadoop.hbase.util.TestHBaseFsckComparator
Tests run: 6, Failures: 0, Errors: 0, Skipped: 0, Time elapsed: 0.999 sec - in org.apache.hadoop.hbase.util.TestHBaseFsckComparator
Running org.apache.hadoop.hbase.util.TestRegionSplitCalculator
Tests run: 15, Failures: 0, Errors: 0, Skipped: 0, Time elapsed: 1.893 sec - in org.apache.hadoop.hbase.util.TestRegionSplitCalculator
Running org.apache.hadoop.hbase.util.TestPoolMap$TestRoundRobinPoolType
Tests run: 3, Failures: 0, Errors: 0, Skipped: 0, Time elapsed: 1.009 sec - in org.apache.hadoop.hbase.util.TestPoolMap$TestRoundRobinPoolType
Running org.apache.hadoop.hbase.util.TestPoolMap$TestThreadLocalPoolType
Tests run: 3, Failures: 0, Errors: 0, Skipped: 0, Time elapsed: 0.393 sec - in org.apache.hadoop.hbase.util.TestPoolMap$TestThreadLocalPoolType
Running org.apache.hadoop.hbase.util.TestPoolMap$TestReusablePoolType
Tests run: 3, Failures: 0, Errors: 0, Skipped: 0, Time elapsed: 0.293 sec - in org.apache.hadoop.hbase.util.TestPoolMap$TestReusablePoolType
Running org.apache.hadoop.hbase.util.TestHFileArchiveUtil
Tests run: 4, Failures: 0, Errors: 0, Skipped: 0, Time elapsed: 2.567 sec - in org.apache.hadoop.hbase.util.TestHFileArchiveUtil
Running org.apache.hadoop.hbase.util.TestBoundedPriorityBlockingQueue
Tests run: 7, Failures: 0, Errors: 0, Skipped: 0, Time elapsed: 2.454 sec - in org.apache.hadoop.hbase.util.TestBoundedPriorityBlockingQueue
Running org.apache.hadoop.hbase.util.TestByteBufferUtils
Tests run: 12, Failures: 0, Errors: 0, Skipped: 0, Time elapsed: 2.743 sec - in org.apache.hadoop.hbase.util.TestByteBufferUtils
Running org.apache.hadoop.hbase.filter.TestNullComparator
Tests run: 3, Failures: 0, Errors: 0, Skipped: 0, Time elapsed: 0.983 sec - in org.apache.hadoop.hbase.filter.TestNullComparator
Running org.apache.hadoop.hbase.filter.TestFilter
Tests run: 21, Failures: 0, Errors: 0, Skipped: 0, Time elapsed: 13.79 sec - in org.apache.hadoop.hbase.filter.TestFilter
Running org.apache.hadoop.hbase.filter.TestInclusiveStopFilter
Tests run: 2, Failures: 0, Errors: 0, Skipped: 0, Time elapsed: 0.717 sec - in org.apache.hadoop.hbase.filter.TestInclusiveStopFilter
Running org.apache.hadoop.hbase.filter.TestDependentColumnFilter
Tests run: 4, Failures: 0, Errors: 0, Skipped: 0, Time elapsed: 4.922 sec - in org.apache.hadoop.hbase.filter.TestDependentColumnFilter
Running org.apache.hadoop.hbase.filter.TestParseFilter
Tests run: 34, Failures: 0, Errors: 0, Skipped: 0, Time elapsed: 4.945 sec - in org.apache.hadoop.hbase.filter.TestParseFilter
Running org.apache.hadoop.hbase.filter.TestComparatorSerialization
Tests run: 6, Failures: 0, Errors: 0, Skipped: 0, Time elapsed: 2.958 sec - in org.apache.hadoop.hbase.filter.TestComparatorSerialization
Running org.apache.hadoop.hbase.filter.TestMultipleColumnPrefixFilter
Tests run: 3, Failures: 0, Errors: 0, Skipped: 0, Time elapsed: 11.577 sec - in org.apache.hadoop.hbase.filter.TestMultipleColumnPrefixFilter
Running org.apache.hadoop.hbase.filter.TestColumnPaginationFilter
Tests run: 1, Failures: 0, Errors: 0, Skipped: 0, Time elapsed: 1.891 sec - in org.apache.hadoop.hbase.filter.TestColumnPaginationFilter
Running org.apache.hadoop.hbase.filter.TestRandomRowFilter
Tests run: 2, Failures: 0, Errors: 0, Skipped: 0, Time elapsed: 1.571 sec - in org.apache.hadoop.hbase.filter.TestRandomRowFilter
Running org.apache.hadoop.hbase.filter.TestSingleColumnValueFilter
Tests run: 2, Failures: 0, Errors: 0, Skipped: 0, Time elapsed: 2.05 sec - in org.apache.hadoop.hbase.filter.TestSingleColumnValueFilter
Running org.apache.hadoop.hbase.filter.TestPageFilter
Tests run: 2, Failures: 0, Errors: 0, Skipped: 0, Time elapsed: 0.944 sec - in org.apache.hadoop.hbase.filter.TestPageFilter
Running org.apache.hadoop.hbase.filter.TestFilterSerialization
Tests run: 25, Failures: 0, Errors: 0, Skipped: 0, Time elapsed: 4.998 sec - in org.apache.hadoop.hbase.filter.TestFilterSerialization
Running org.apache.hadoop.hbase.filter.TestInvocationRecordFilter
Tests run: 1, Failures: 0, Errors: 0, Skipped: 0, Time elapsed: 3.638 sec - in org.apache.hadoop.hbase.filter.TestInvocationRecordFilter
Running org.apache.hadoop.hbase.filter.TestFilterList
Tests run: 7, Failures: 0, Errors: 0, Skipped: 0, Time elapsed: 2.654 sec - in org.apache.hadoop.hbase.filter.TestFilterList
Running org.apache.hadoop.hbase.filter.TestFirstKeyValueMatchingQualifiersFilter
Tests run: 1, Failures: 0, Errors: 0, Skipped: 0, Time elapsed: 0.616 sec - in org.apache.hadoop.hbase.filter.TestFirstKeyValueMatchingQualifiersFilter
Running org.apache.hadoop.hbase.filter.TestFuzzyRowFilter
Tests run: 2, Failures: 0, Errors: 0, Skipped: 0, Time elapsed: 0.783 sec - in org.apache.hadoop.hbase.filter.TestFuzzyRowFilter
Running org.apache.hadoop.hbase.filter.TestPrefixFilter
Tests run: 3, Failures: 0, Errors: 0, Skipped: 0, Time elapsed: 0.68 sec - in org.apache.hadoop.hbase.filter.TestPrefixFilter
Running org.apache.hadoop.hbase.filter.TestSingleColumnValueExcludeFilter
Tests run: 1, Failures: 0, Errors: 0, Skipped: 0, Time elapsed: 0.598 sec - in org.apache.hadoop.hbase.filter.TestSingleColumnValueExcludeFilter
Running org.apache.hadoop.hbase.filter.TestBitComparator
Tests run: 6, Failures: 0, Errors: 0, Skipped: 0, Time elapsed: 1.317 sec - in org.apache.hadoop.hbase.filter.TestBitComparator
Running org.apache.hadoop.hbase.filter.TestColumnPrefixFilter
Tests run: 2, Failures: 0, Errors: 0, Skipped: 0, Time elapsed: 10.002 sec - in org.apache.hadoop.hbase.filter.TestColumnPrefixFilter
Running org.apache.hadoop.hbase.TestServerName
Tests run: 6, Failures: 0, Errors: 0, Skipped: 0, Time elapsed: 1.294 sec - in org.apache.hadoop.hbase.TestServerName
Running org.apache.hadoop.hbase.TestPerformanceEvaluation
Tests run: 4, Failures: 0, Errors: 0, Skipped: 1, Time elapsed: 1.231 sec - in org.apache.hadoop.hbase.TestPerformanceEvaluation
Running org.apache.hadoop.hbase.TestServerLoad
Tests run: 2, Failures: 0, Errors: 0, Skipped: 0, Time elapsed: 0.738 sec - in org.apache.hadoop.hbase.TestServerLoad
Running org.apache.hadoop.hbase.client.TestPutDeleteEtcCellIteration
Tests run: 6, Failures: 0, Errors: 0, Skipped: 0, Time elapsed: 1.283 sec - in org.apache.hadoop.hbase.client.TestPutDeleteEtcCellIteration
Running org.apache.hadoop.hbase.client.TestConnectionUtils
Tests run: 1, Failures: 0, Errors: 0, Skipped: 0, Time elapsed: 0.822 sec - in org.apache.hadoop.hbase.client.TestConnectionUtils
Running org.apache.hadoop.hbase.client.TestIntraRowPagination
Tests run: 1, Failures: 0, Errors: 0, Skipped: 0, Time elapsed: 3.966 sec - in org.apache.hadoop.hbase.client.TestIntraRowPagination
Running org.apache.hadoop.hbase.client.TestResult
Tests run: 7, Failures: 0, Errors: 0, Skipped: 0, Time elapsed: 1.455 sec - in org.apache.hadoop.hbase.client.TestResult
Running org.apache.hadoop.hbase.client.TestHBaseAdminNoCluster
Tests run: 1, Failures: 0, Errors: 0, Skipped: 0, Time elapsed: 4.174 sec - in org.apache.hadoop.hbase.client.TestHBaseAdminNoCluster
Running org.apache.hadoop.hbase.protobuf.TestProtobufUtil
Tests run: 7, Failures: 0, Errors: 0, Skipped: 0, Time elapsed: 3.138 sec - in org.apache.hadoop.hbase.protobuf.TestProtobufUtil
Running org.apache.hadoop.hbase.protobuf.TestReplicationProtobuf
Tests run: 1, Failures: 0, Errors: 0, Skipped: 0, Time elapsed: 0.898 sec - in org.apache.hadoop.hbase.protobuf.TestReplicationProtobuf
Running org.apache.hadoop.hbase.procedure.TestProcedureMember
Tests run: 8, Failures: 0, Errors: 0, Skipped: 0, Time elapsed: 2.022 sec - in org.apache.hadoop.hbase.procedure.TestProcedureMember
Running org.apache.hadoop.hbase.procedure.TestProcedureManager
Tests run: 1, Failures: 0, Errors: 0, Skipped: 0, Time elapsed: 1.64 sec - in org.apache.hadoop.hbase.procedure.TestProcedureManager
Running org.apache.hadoop.hbase.procedure.TestProcedure
Tests run: 4, Failures: 0, Errors: 0, Skipped: 0, Time elapsed: 1.994 sec - in org.apache.hadoop.hbase.procedure.TestProcedure
Running org.apache.hadoop.hbase.procedure.TestProcedureCoordinator
Tests run: 7, Failures: 0, Errors: 0, Skipped: 0, Time elapsed: 1.727 sec - in org.apache.hadoop.hbase.procedure.TestProcedureCoordinator
Running org.apache.hadoop.hbase.constraint.TestConstraints
Tests run: 6, Failures: 0, Errors: 0, Skipped: 0, Time elapsed: 2.778 sec - in org.apache.hadoop.hbase.constraint.TestConstraints
Running org.apache.hadoop.hbase.rest.TestGZIPResponseWrapper
Tests run: 4, Failures: 0, Errors: 0, Skipped: 0, Time elapsed: 1.071 sec - in org.apache.hadoop.hbase.rest.TestGZIPResponseWrapper
Running org.apache.hadoop.hbase.rest.client.TestRemoteAdminRetries
Tests run: 7, Failures: 0, Errors: 0, Skipped: 0, Time elapsed: 2.786 sec - in org.apache.hadoop.hbase.rest.client.TestRemoteAdminRetries
Running org.apache.hadoop.hbase.rest.client.TestRemoteHTableRetries
Tests run: 7, Failures: 0, Errors: 0, Skipped: 0, Time elapsed: 2.579 sec - in org.apache.hadoop.hbase.rest.client.TestRemoteHTableRetries
Running org.apache.hadoop.hbase.rest.model.TestVersionModel
Tests run: 6, Failures: 0, Errors: 0, Skipped: 0, Time elapsed: 1.55 sec - in org.apache.hadoop.hbase.rest.model.TestVersionModel
Running org.apache.hadoop.hbase.rest.model.TestStorageClusterVersionModel
Tests run: 6, Failures: 0, Errors: 0, Skipped: 0, Time elapsed: 1.088 sec - in org.apache.hadoop.hbase.rest.model.TestStorageClusterVersionModel
Running org.apache.hadoop.hbase.rest.model.TestColumnSchemaModel
Tests run: 6, Failures: 0, Errors: 0, Skipped: 0, Time elapsed: 1.311 sec - in org.apache.hadoop.hbase.rest.model.TestColumnSchemaModel
Running org.apache.hadoop.hbase.rest.model.TestCellModel
Tests run: 6, Failures: 0, Errors: 0, Skipped: 0, Time elapsed: 1.119 sec - in org.apache.hadoop.hbase.rest.model.TestCellModel
Running org.apache.hadoop.hbase.rest.model.TestTableListModel
Tests run: 6, Failures: 0, Errors: 0, Skipped: 0, Time elapsed: 1.395 sec - in org.apache.hadoop.hbase.rest.model.TestTableListModel
Running org.apache.hadoop.hbase.rest.model.TestStorageClusterStatusModel
Tests run: 6, Failures: 0, Errors: 0, Skipped: 0, Time elapsed: 1.46 sec - in org.apache.hadoop.hbase.rest.model.TestStorageClusterStatusModel
Running org.apache.hadoop.hbase.rest.model.TestScannerModel
Tests run: 6, Failures: 0, Errors: 0, Skipped: 0, Time elapsed: 1.385 sec - in org.apache.hadoop.hbase.rest.model.TestScannerModel
Running org.apache.hadoop.hbase.rest.model.TestTableSchemaModel
Tests run: 6, Failures: 0, Errors: 0, Skipped: 0, Time elapsed: 1.3 sec - in org.apache.hadoop.hbase.rest.model.TestTableSchemaModel
Running org.apache.hadoop.hbase.rest.model.TestTableInfoModel
Tests run: 6, Failures: 0, Errors: 0, Skipped: 0, Time elapsed: 1.483 sec - in org.apache.hadoop.hbase.rest.model.TestTableInfoModel
Running org.apache.hadoop.hbase.rest.model.TestTableRegionModel
Tests run: 8, Failures: 0, Errors: 0, Skipped: 0, Time elapsed: 1.532 sec - in org.apache.hadoop.hbase.rest.model.TestTableRegionModel
Running org.apache.hadoop.hbase.rest.model.TestRowModel
Tests run: 6, Failures: 0, Errors: 0, Skipped: 0, Time elapsed: 1.238 sec - in org.apache.hadoop.hbase.rest.model.TestRowModel
Running org.apache.hadoop.hbase.rest.model.TestCellSetModel
Tests run: 6, Failures: 0, Errors: 0, Skipped: 0, Time elapsed: 1.234 sec - in org.apache.hadoop.hbase.rest.model.TestCellSetModel
Running org.apache.hadoop.hbase.TestHTableDescriptor
Tests run: 11, Failures: 0, Errors: 0, Skipped: 0, Time elapsed: 3.213 sec - in org.apache.hadoop.hbase.TestHTableDescriptor
Running org.apache.hadoop.hbase.snapshot.TestRestoreSnapshotHelper
Tests run: 1, Failures: 0, Errors: 0, Skipped: 0, Time elapsed: 4.911 sec - in org.apache.hadoop.hbase.snapshot.TestRestoreSnapshotHelper
Running org.apache.hadoop.hbase.coprocessor.TestRegionObserverStacking
Tests run: 1, Failures: 0, Errors: 0, Skipped: 0, Time elapsed: 3.143 sec - in org.apache.hadoop.hbase.coprocessor.TestRegionObserverStacking
Running org.apache.hadoop.hbase.coprocessor.TestCoprocessorInterface
Tests run: 2, Failures: 0, Errors: 0, Skipped: 0, Time elapsed: 18.334 sec - in org.apache.hadoop.hbase.coprocessor.TestCoprocessorInterface
Running org.apache.hadoop.hbase.executor.TestExecutorService
Tests run: 1, Failures: 0, Errors: 0, Skipped: 0, Time elapsed: 3.207 sec - in org.apache.hadoop.hbase.executor.TestExecutorService
Running org.apache.hadoop.hbase.zookeeper.TestZooKeeperMainServer
Tests run: 2, Failures: 0, Errors: 0, Skipped: 0, Time elapsed: 2.174 sec - in org.apache.hadoop.hbase.zookeeper.TestZooKeeperMainServer
Running org.apache.hadoop.hbase.zookeeper.TestZKConfig
Tests run: 1, Failures: 0, Errors: 0, Skipped: 0, Time elapsed: 0.985 sec - in org.apache.hadoop.hbase.zookeeper.TestZKConfig
Running org.apache.hadoop.hbase.metrics.TestMetricsHistogram
Tests run: 3, Failures: 0, Errors: 0, Skipped: 0, Time elapsed: 1.741 sec - in org.apache.hadoop.hbase.metrics.TestMetricsHistogram
Running org.apache.hadoop.hbase.TestHColumnDescriptor
Tests run: 3, Failures: 0, Errors: 0, Skipped: 0, Time elapsed: 2.743 sec - in org.apache.hadoop.hbase.TestHColumnDescriptor
Running org.apache.hadoop.hbase.monitoring.TestMemoryBoundedLogMessageBuffer
Tests run: 2, Failures: 0, Errors: 0, Skipped: 0, Time elapsed: 0.825 sec - in org.apache.hadoop.hbase.monitoring.TestMemoryBoundedLogMessageBuffer
Running org.apache.hadoop.hbase.monitoring.TestTaskMonitor
Tests run: 3, Failures: 0, Errors: 0, Skipped: 0, Time elapsed: 1.585 sec - in org.apache.hadoop.hbase.monitoring.TestTaskMonitor

Results :

Tests run: 912, Failures: 0, Errors: 0, Skipped: 7

[INFO] ------------------------------------------------------------------------
[INFO] Reactor Summary:
[INFO] 
[INFO] HBase ............................................. SUCCESS [16.632s]
[INFO] HBase - Common .................................... SUCCESS [3:02.449s]
[INFO] HBase - Protocol .................................. SUCCESS [29.864s]
[INFO] HBase - Client .................................... SUCCESS [1:42.996s]
[INFO] HBase - Hadoop Compatibility ...................... SUCCESS [14.543s]
[INFO] HBase - Hadoop Two Compatibility .................. SUCCESS [17.970s]
[INFO] HBase - Prefix Tree ............................... SUCCESS [35.435s]
[INFO] HBase - Server .................................... FAILURE [33:14.632s]
[INFO] HBase - Testing Util .............................. SKIPPED
[INFO] HBase - Thrift .................................... SKIPPED
[INFO] HBase - Shell ..................................... SKIPPED
[INFO] HBase - Integration Tests ......................... SKIPPED
[INFO] HBase - Examples .................................. SKIPPED
[INFO] HBase - Assembly .................................. SKIPPED
[INFO] ------------------------------------------------------------------------
[INFO] BUILD FAILURE
[INFO] ------------------------------------------------------------------------
[INFO] Total time: 39:59.780s
[INFO] Finished at: Thu Aug 28 19:44:49 UTC 2014
[INFO] Final Memory: 64M/986M
[INFO] ------------------------------------------------------------------------
[ERROR] Failed to execute goal org.apache.maven.plugins:maven-surefire-plugin:2.17:test (default-test) on project hbase-server: ExecutionException: java.lang.RuntimeException: The forked VM terminated without properly saying goodbye. VM crash or System.exit called?
[ERROR] Command was /bin/sh -c cd <https://builds.apache.org/job/HBase-TRUNK/ws/hbase-server> && /home/jenkins/tools/java/jdk1.7.0_25-32/jre/bin/java -enableassertions -XX:MaxDirectMemorySize=1G -Xmx1900m -XX:MaxPermSize=256m -Djava.security.egd=file:/dev/./urandom -Djava.net.preferIPv4Stack=true -Djava.awt.headless=true -jar <https://builds.apache.org/job/HBase-TRUNK/ws/hbase-server/target/surefire/surefirebooter6431965562794824981.jar> <https://builds.apache.org/job/HBase-TRUNK/ws/hbase-server/target/surefire/surefire266882997064694890tmp> <https://builds.apache.org/job/HBase-TRUNK/ws/hbase-server/target/surefire/surefire_4008026114009614238792tmp>
[ERROR] -> [Help 1]
[ERROR] 
[ERROR] To see the full stack trace of the errors, re-run Maven with the -e switch.
[ERROR] Re-run Maven using the -X switch to enable full debug logging.
[ERROR] 
[ERROR] For more information about the errors and possible solutions, please read the following articles:
[ERROR] [Help 1] http://cwiki.apache.org/confluence/display/MAVEN/MojoFailureException
[ERROR] 
[ERROR] After correcting the problems, you can resume the build with the command
[ERROR]   mvn <goals> -rf :hbase-server
Build step 'Invoke top-level Maven targets' marked build as failure
Performing Post build task...
Match found for :.* : True
Logical operation result is TRUE
Running script  :   ZOMBIE_TESTS_COUNT=`jps | grep surefirebooter | wc -l`
  if [[ $ZOMBIE_TESTS_COUNT != 0 ]] ; then
    #It seems sometimes the tests are not dying immediately. Let's give them 10s
    echo "Suspicious java process found - waiting 10s to see if there are just slow to stop"
    sleep 10   
    ZOMBIE_TESTS_COUNT=`jps | grep surefirebooter | wc -l`
    if [[ $ZOMBIE_TESTS_COUNT != 0 ]] ; then
      echo "There are $ZOMBIE_TESTS_COUNT zombie tests, they should have been killed by surefire but survived"
      echo "************ BEGIN zombies jstack extract"
      ZB_STACK=`jps | grep surefirebooter | cut -d ' ' -f 1 | xargs -n 1 jstack | grep ".test" | grep "\.java"`
      jps | grep surefirebooter | cut -d ' ' -f 1 | xargs -n 1 jstack
      echo "************ END  zombies jstack extract"
      JIRA_COMMENT="$JIRA_COMMENT

     {color:red}-1 core zombie tests{color}.  There are ${ZOMBIE_TESTS_COUNT} zombie test(s): ${ZB_STACK}"
      BAD=1
      jps | grep surefirebooter | cut -d ' ' -f 1 | xargs kill -9
    else
      echo "We're ok: there is no zombie test, but some tests took some time to stop"
    fi
  else
    echo "We're ok: there is no zombie test"
  fi
[HBase-TRUNK] $ /bin/bash -xe /tmp/hudson6242602098510959234.sh
++ jps
++ grep surefirebooter
++ wc -l
+ ZOMBIE_TESTS_COUNT=0
+ [[ 0 != 0 ]]
+ echo 'We'\''re ok: there is no zombie test'
We're ok: there is no zombie test
POST BUILD TASK : SUCCESS
END OF POST BUILD TASK : 0
Archiving artifacts
Sending artifact delta relative to HBase-TRUNK #5421
Archived 889 artifacts
Archive block size is 32768
Received 8 blocks and 33331026 bytes
Compression is 0.8%
Took 1 min 3 sec
Recording test results
Updating HBASE-11849

Build failed in Jenkins: HBase-TRUNK #5440

Posted by Apache Jenkins Server <je...@builds.apache.org>.
See <https://builds.apache.org/job/HBase-TRUNK/5440/changes>

Changes:

[anoopsamjohn] HBASE-9875 Removing the empty file NamespaceJanitor

------------------------------------------
[...truncated 978 lines...]
Running org.apache.hadoop.hbase.mapreduce.TestSimpleTotalOrderPartitioner
Tests run: 1, Failures: 0, Errors: 0, Skipped: 0, Time elapsed: 0.348 sec - in org.apache.hadoop.hbase.mapreduce.TestSimpleTotalOrderPartitioner
Running org.apache.hadoop.hbase.mapreduce.TestTableMapReduceUtil
Tests run: 4, Failures: 0, Errors: 0, Skipped: 0, Time elapsed: 7.159 sec - in org.apache.hadoop.hbase.mapreduce.TestTableMapReduceUtil
Running org.apache.hadoop.hbase.mapreduce.hadoopbackport.TestJarFinder
Tests run: 4, Failures: 0, Errors: 0, Skipped: 0, Time elapsed: 3.268 sec - in org.apache.hadoop.hbase.mapreduce.hadoopbackport.TestJarFinder
Running org.apache.hadoop.hbase.mapreduce.TestTableSplit
Tests run: 3, Failures: 0, Errors: 0, Skipped: 0, Time elapsed: 1.193 sec - in org.apache.hadoop.hbase.mapreduce.TestTableSplit
Running org.apache.hadoop.hbase.TestSerialization
Tests run: 9, Failures: 0, Errors: 0, Skipped: 0, Time elapsed: 3.286 sec - in org.apache.hadoop.hbase.TestSerialization
Running org.apache.hadoop.hbase.util.TestCompressionTest
Tests run: 2, Failures: 0, Errors: 0, Skipped: 0, Time elapsed: 1.082 sec - in org.apache.hadoop.hbase.util.TestCompressionTest
Running org.apache.hadoop.hbase.util.TestSortedCopyOnWriteSet
Tests run: 2, Failures: 0, Errors: 0, Skipped: 0, Time elapsed: 0.898 sec - in org.apache.hadoop.hbase.util.TestSortedCopyOnWriteSet
Running org.apache.hadoop.hbase.util.TestRegionSizeCalculator
Tests run: 3, Failures: 0, Errors: 0, Skipped: 0, Time elapsed: 1.94 sec - in org.apache.hadoop.hbase.util.TestRegionSizeCalculator
Running org.apache.hadoop.hbase.util.TestRootPath
Tests run: 1, Failures: 0, Errors: 0, Skipped: 0, Time elapsed: 0.549 sec - in org.apache.hadoop.hbase.util.TestRootPath
Running org.apache.hadoop.hbase.util.TestIncrementingEnvironmentEdge
Tests run: 1, Failures: 0, Errors: 0, Skipped: 0, Time elapsed: 0.747 sec - in org.apache.hadoop.hbase.util.TestIncrementingEnvironmentEdge
Running org.apache.hadoop.hbase.util.TestTableName
Tests run: 4, Failures: 0, Errors: 0, Skipped: 0, Time elapsed: 0.873 sec - in org.apache.hadoop.hbase.util.TestTableName
Running org.apache.hadoop.hbase.util.TestByteBloomFilter
Tests run: 5, Failures: 0, Errors: 0, Skipped: 0, Time elapsed: 3.126 sec - in org.apache.hadoop.hbase.util.TestByteBloomFilter
Running org.apache.hadoop.hbase.util.TestHBaseFsckComparator
Tests run: 6, Failures: 0, Errors: 0, Skipped: 0, Time elapsed: 1.016 sec - in org.apache.hadoop.hbase.util.TestHBaseFsckComparator
Running org.apache.hadoop.hbase.util.TestRegionSplitCalculator
Tests run: 15, Failures: 0, Errors: 0, Skipped: 0, Time elapsed: 2.174 sec - in org.apache.hadoop.hbase.util.TestRegionSplitCalculator
Running org.apache.hadoop.hbase.util.TestPoolMap$TestRoundRobinPoolType
Tests run: 3, Failures: 0, Errors: 0, Skipped: 0, Time elapsed: 0.922 sec - in org.apache.hadoop.hbase.util.TestPoolMap$TestRoundRobinPoolType
Running org.apache.hadoop.hbase.util.TestPoolMap$TestThreadLocalPoolType
Tests run: 3, Failures: 0, Errors: 0, Skipped: 0, Time elapsed: 0.321 sec - in org.apache.hadoop.hbase.util.TestPoolMap$TestThreadLocalPoolType
Running org.apache.hadoop.hbase.util.TestPoolMap$TestReusablePoolType
Tests run: 3, Failures: 0, Errors: 0, Skipped: 0, Time elapsed: 0.358 sec - in org.apache.hadoop.hbase.util.TestPoolMap$TestReusablePoolType
Running org.apache.hadoop.hbase.util.TestHFileArchiveUtil
Tests run: 4, Failures: 0, Errors: 0, Skipped: 0, Time elapsed: 2.566 sec - in org.apache.hadoop.hbase.util.TestHFileArchiveUtil
Running org.apache.hadoop.hbase.util.TestBoundedPriorityBlockingQueue
Tests run: 7, Failures: 0, Errors: 0, Skipped: 0, Time elapsed: 2.344 sec - in org.apache.hadoop.hbase.util.TestBoundedPriorityBlockingQueue
Running org.apache.hadoop.hbase.util.TestByteBufferUtils
Tests run: 12, Failures: 0, Errors: 0, Skipped: 0, Time elapsed: 2.432 sec - in org.apache.hadoop.hbase.util.TestByteBufferUtils
Running org.apache.hadoop.hbase.filter.TestNullComparator
Tests run: 3, Failures: 0, Errors: 0, Skipped: 0, Time elapsed: 0.84 sec - in org.apache.hadoop.hbase.filter.TestNullComparator
Running org.apache.hadoop.hbase.filter.TestFilter
Tests run: 21, Failures: 0, Errors: 0, Skipped: 0, Time elapsed: 11.613 sec - in org.apache.hadoop.hbase.filter.TestFilter
Running org.apache.hadoop.hbase.filter.TestInclusiveStopFilter
Tests run: 2, Failures: 0, Errors: 0, Skipped: 0, Time elapsed: 0.69 sec - in org.apache.hadoop.hbase.filter.TestInclusiveStopFilter
Running org.apache.hadoop.hbase.filter.TestDependentColumnFilter
Tests run: 4, Failures: 0, Errors: 0, Skipped: 0, Time elapsed: 4.791 sec - in org.apache.hadoop.hbase.filter.TestDependentColumnFilter
Running org.apache.hadoop.hbase.filter.TestParseFilter
Tests run: 34, Failures: 0, Errors: 0, Skipped: 0, Time elapsed: 3.973 sec - in org.apache.hadoop.hbase.filter.TestParseFilter
Running org.apache.hadoop.hbase.filter.TestComparatorSerialization
Tests run: 6, Failures: 0, Errors: 0, Skipped: 0, Time elapsed: 2.39 sec - in org.apache.hadoop.hbase.filter.TestComparatorSerialization
Running org.apache.hadoop.hbase.filter.TestMultipleColumnPrefixFilter
Tests run: 3, Failures: 0, Errors: 0, Skipped: 0, Time elapsed: 11.128 sec - in org.apache.hadoop.hbase.filter.TestMultipleColumnPrefixFilter
Running org.apache.hadoop.hbase.filter.TestColumnPaginationFilter
Tests run: 1, Failures: 0, Errors: 0, Skipped: 0, Time elapsed: 2.096 sec - in org.apache.hadoop.hbase.filter.TestColumnPaginationFilter
Running org.apache.hadoop.hbase.filter.TestRandomRowFilter
Tests run: 2, Failures: 0, Errors: 0, Skipped: 0, Time elapsed: 1.334 sec - in org.apache.hadoop.hbase.filter.TestRandomRowFilter
Running org.apache.hadoop.hbase.filter.TestSingleColumnValueFilter
Tests run: 2, Failures: 0, Errors: 0, Skipped: 0, Time elapsed: 1.974 sec - in org.apache.hadoop.hbase.filter.TestSingleColumnValueFilter
Running org.apache.hadoop.hbase.filter.TestPageFilter
Tests run: 2, Failures: 0, Errors: 0, Skipped: 0, Time elapsed: 0.917 sec - in org.apache.hadoop.hbase.filter.TestPageFilter
Running org.apache.hadoop.hbase.filter.TestFilterSerialization
Tests run: 25, Failures: 0, Errors: 0, Skipped: 0, Time elapsed: 4.77 sec - in org.apache.hadoop.hbase.filter.TestFilterSerialization
Running org.apache.hadoop.hbase.filter.TestInvocationRecordFilter
Tests run: 1, Failures: 0, Errors: 0, Skipped: 0, Time elapsed: 3.233 sec - in org.apache.hadoop.hbase.filter.TestInvocationRecordFilter
Running org.apache.hadoop.hbase.filter.TestFilterList
Tests run: 7, Failures: 0, Errors: 0, Skipped: 0, Time elapsed: 2.61 sec - in org.apache.hadoop.hbase.filter.TestFilterList
Running org.apache.hadoop.hbase.filter.TestFirstKeyValueMatchingQualifiersFilter
Tests run: 1, Failures: 0, Errors: 0, Skipped: 0, Time elapsed: 0.636 sec - in org.apache.hadoop.hbase.filter.TestFirstKeyValueMatchingQualifiersFilter
Running org.apache.hadoop.hbase.filter.TestFuzzyRowFilter
Tests run: 2, Failures: 0, Errors: 0, Skipped: 0, Time elapsed: 0.775 sec - in org.apache.hadoop.hbase.filter.TestFuzzyRowFilter
Running org.apache.hadoop.hbase.filter.TestPrefixFilter
Tests run: 3, Failures: 0, Errors: 0, Skipped: 0, Time elapsed: 0.602 sec - in org.apache.hadoop.hbase.filter.TestPrefixFilter
Running org.apache.hadoop.hbase.filter.TestSingleColumnValueExcludeFilter
Tests run: 1, Failures: 0, Errors: 0, Skipped: 0, Time elapsed: 0.556 sec - in org.apache.hadoop.hbase.filter.TestSingleColumnValueExcludeFilter
Running org.apache.hadoop.hbase.filter.TestBitComparator
Tests run: 6, Failures: 0, Errors: 0, Skipped: 0, Time elapsed: 1.104 sec - in org.apache.hadoop.hbase.filter.TestBitComparator
Running org.apache.hadoop.hbase.filter.TestColumnPrefixFilter
Tests run: 2, Failures: 0, Errors: 0, Skipped: 0, Time elapsed: 8.697 sec - in org.apache.hadoop.hbase.filter.TestColumnPrefixFilter
Running org.apache.hadoop.hbase.TestServerName
Tests run: 6, Failures: 0, Errors: 0, Skipped: 0, Time elapsed: 0.919 sec - in org.apache.hadoop.hbase.TestServerName
Running org.apache.hadoop.hbase.TestPerformanceEvaluation
Tests run: 4, Failures: 0, Errors: 0, Skipped: 1, Time elapsed: 1.105 sec - in org.apache.hadoop.hbase.TestPerformanceEvaluation
Running org.apache.hadoop.hbase.TestServerLoad
Tests run: 2, Failures: 0, Errors: 0, Skipped: 0, Time elapsed: 0.783 sec - in org.apache.hadoop.hbase.TestServerLoad
Running org.apache.hadoop.hbase.client.TestPutDeleteEtcCellIteration
Tests run: 6, Failures: 0, Errors: 0, Skipped: 0, Time elapsed: 1.447 sec - in org.apache.hadoop.hbase.client.TestPutDeleteEtcCellIteration
Running org.apache.hadoop.hbase.client.TestConnectionUtils
Tests run: 1, Failures: 0, Errors: 0, Skipped: 0, Time elapsed: 0.726 sec - in org.apache.hadoop.hbase.client.TestConnectionUtils
Running org.apache.hadoop.hbase.client.TestIntraRowPagination
Tests run: 1, Failures: 0, Errors: 0, Skipped: 0, Time elapsed: 3.402 sec - in org.apache.hadoop.hbase.client.TestIntraRowPagination
Running org.apache.hadoop.hbase.client.TestResult
Tests run: 7, Failures: 0, Errors: 0, Skipped: 0, Time elapsed: 1.153 sec - in org.apache.hadoop.hbase.client.TestResult
Running org.apache.hadoop.hbase.client.TestHBaseAdminNoCluster
Tests run: 1, Failures: 0, Errors: 0, Skipped: 0, Time elapsed: 3.934 sec - in org.apache.hadoop.hbase.client.TestHBaseAdminNoCluster
Running org.apache.hadoop.hbase.protobuf.TestProtobufUtil
Tests run: 7, Failures: 0, Errors: 0, Skipped: 0, Time elapsed: 2.905 sec - in org.apache.hadoop.hbase.protobuf.TestProtobufUtil
Running org.apache.hadoop.hbase.protobuf.TestReplicationProtobuf
Tests run: 1, Failures: 0, Errors: 0, Skipped: 0, Time elapsed: 0.683 sec - in org.apache.hadoop.hbase.protobuf.TestReplicationProtobuf
Running org.apache.hadoop.hbase.procedure.TestProcedureMember
Tests run: 8, Failures: 0, Errors: 0, Skipped: 0, Time elapsed: 1.925 sec - in org.apache.hadoop.hbase.procedure.TestProcedureMember
Running org.apache.hadoop.hbase.procedure.TestProcedureManager
Tests run: 1, Failures: 0, Errors: 0, Skipped: 0, Time elapsed: 1.51 sec - in org.apache.hadoop.hbase.procedure.TestProcedureManager
Running org.apache.hadoop.hbase.procedure.TestProcedure
Tests run: 4, Failures: 0, Errors: 0, Skipped: 0, Time elapsed: 1.736 sec - in org.apache.hadoop.hbase.procedure.TestProcedure
Running org.apache.hadoop.hbase.procedure.TestProcedureCoordinator
Tests run: 7, Failures: 0, Errors: 0, Skipped: 0, Time elapsed: 1.484 sec - in org.apache.hadoop.hbase.procedure.TestProcedureCoordinator
Running org.apache.hadoop.hbase.constraint.TestConstraints
Tests run: 6, Failures: 0, Errors: 0, Skipped: 0, Time elapsed: 2.327 sec - in org.apache.hadoop.hbase.constraint.TestConstraints
Running org.apache.hadoop.hbase.rest.TestGZIPResponseWrapper
Tests run: 4, Failures: 0, Errors: 0, Skipped: 0, Time elapsed: 1.071 sec - in org.apache.hadoop.hbase.rest.TestGZIPResponseWrapper
Running org.apache.hadoop.hbase.rest.client.TestRemoteAdminRetries
Tests run: 7, Failures: 0, Errors: 0, Skipped: 0, Time elapsed: 2.427 sec - in org.apache.hadoop.hbase.rest.client.TestRemoteAdminRetries
Running org.apache.hadoop.hbase.rest.client.TestRemoteHTableRetries
Tests run: 7, Failures: 0, Errors: 0, Skipped: 0, Time elapsed: 2.642 sec - in org.apache.hadoop.hbase.rest.client.TestRemoteHTableRetries
Running org.apache.hadoop.hbase.rest.model.TestVersionModel
Tests run: 6, Failures: 0, Errors: 0, Skipped: 0, Time elapsed: 1.237 sec - in org.apache.hadoop.hbase.rest.model.TestVersionModel
Running org.apache.hadoop.hbase.rest.model.TestStorageClusterVersionModel
Tests run: 6, Failures: 0, Errors: 0, Skipped: 0, Time elapsed: 1.066 sec - in org.apache.hadoop.hbase.rest.model.TestStorageClusterVersionModel
Running org.apache.hadoop.hbase.rest.model.TestColumnSchemaModel
Tests run: 6, Failures: 0, Errors: 0, Skipped: 0, Time elapsed: 1.304 sec - in org.apache.hadoop.hbase.rest.model.TestColumnSchemaModel
Running org.apache.hadoop.hbase.rest.model.TestCellModel
Tests run: 6, Failures: 0, Errors: 0, Skipped: 0, Time elapsed: 1.234 sec - in org.apache.hadoop.hbase.rest.model.TestCellModel
Running org.apache.hadoop.hbase.rest.model.TestTableListModel
Tests run: 6, Failures: 0, Errors: 0, Skipped: 0, Time elapsed: 1.296 sec - in org.apache.hadoop.hbase.rest.model.TestTableListModel
Running org.apache.hadoop.hbase.rest.model.TestStorageClusterStatusModel
Tests run: 6, Failures: 0, Errors: 0, Skipped: 0, Time elapsed: 1.429 sec - in org.apache.hadoop.hbase.rest.model.TestStorageClusterStatusModel
Running org.apache.hadoop.hbase.rest.model.TestScannerModel
Tests run: 6, Failures: 0, Errors: 0, Skipped: 0, Time elapsed: 1.35 sec - in org.apache.hadoop.hbase.rest.model.TestScannerModel
Running org.apache.hadoop.hbase.rest.model.TestTableSchemaModel
Tests run: 6, Failures: 0, Errors: 0, Skipped: 0, Time elapsed: 1.25 sec - in org.apache.hadoop.hbase.rest.model.TestTableSchemaModel
Running org.apache.hadoop.hbase.rest.model.TestTableInfoModel
Tests run: 6, Failures: 0, Errors: 0, Skipped: 0, Time elapsed: 1.294 sec - in org.apache.hadoop.hbase.rest.model.TestTableInfoModel
Running org.apache.hadoop.hbase.rest.model.TestTableRegionModel
Tests run: 8, Failures: 0, Errors: 0, Skipped: 0, Time elapsed: 1.373 sec - in org.apache.hadoop.hbase.rest.model.TestTableRegionModel
Running org.apache.hadoop.hbase.rest.model.TestRowModel
Tests run: 6, Failures: 0, Errors: 0, Skipped: 0, Time elapsed: 1.076 sec - in org.apache.hadoop.hbase.rest.model.TestRowModel
Running org.apache.hadoop.hbase.rest.model.TestCellSetModel
Tests run: 6, Failures: 0, Errors: 0, Skipped: 0, Time elapsed: 1.336 sec - in org.apache.hadoop.hbase.rest.model.TestCellSetModel
Running org.apache.hadoop.hbase.TestHTableDescriptor
Tests run: 11, Failures: 0, Errors: 0, Skipped: 0, Time elapsed: 3.28 sec - in org.apache.hadoop.hbase.TestHTableDescriptor
Running org.apache.hadoop.hbase.snapshot.TestRestoreSnapshotHelper
Tests run: 1, Failures: 0, Errors: 0, Skipped: 0, Time elapsed: 4.69 sec - in org.apache.hadoop.hbase.snapshot.TestRestoreSnapshotHelper
Running org.apache.hadoop.hbase.coprocessor.TestRegionObserverStacking
Tests run: 1, Failures: 0, Errors: 0, Skipped: 0, Time elapsed: 2.961 sec - in org.apache.hadoop.hbase.coprocessor.TestRegionObserverStacking
Running org.apache.hadoop.hbase.coprocessor.TestCoprocessorInterface
Tests run: 2, Failures: 0, Errors: 0, Skipped: 0, Time elapsed: 17.488 sec - in org.apache.hadoop.hbase.coprocessor.TestCoprocessorInterface
Running org.apache.hadoop.hbase.executor.TestExecutorService
Tests run: 1, Failures: 0, Errors: 0, Skipped: 0, Time elapsed: 3.378 sec - in org.apache.hadoop.hbase.executor.TestExecutorService
Running org.apache.hadoop.hbase.zookeeper.TestZooKeeperMainServer
Tests run: 2, Failures: 0, Errors: 0, Skipped: 0, Time elapsed: 2.569 sec - in org.apache.hadoop.hbase.zookeeper.TestZooKeeperMainServer
Running org.apache.hadoop.hbase.zookeeper.TestZKConfig
Tests run: 1, Failures: 0, Errors: 0, Skipped: 0, Time elapsed: 0.783 sec - in org.apache.hadoop.hbase.zookeeper.TestZKConfig
Running org.apache.hadoop.hbase.metrics.TestMetricsHistogram
Tests run: 3, Failures: 0, Errors: 0, Skipped: 0, Time elapsed: 1.701 sec - in org.apache.hadoop.hbase.metrics.TestMetricsHistogram
Running org.apache.hadoop.hbase.TestHColumnDescriptor
Tests run: 3, Failures: 0, Errors: 0, Skipped: 0, Time elapsed: 2.32 sec - in org.apache.hadoop.hbase.TestHColumnDescriptor
Running org.apache.hadoop.hbase.monitoring.TestMemoryBoundedLogMessageBuffer
Tests run: 2, Failures: 0, Errors: 0, Skipped: 0, Time elapsed: 0.793 sec - in org.apache.hadoop.hbase.monitoring.TestMemoryBoundedLogMessageBuffer
Running org.apache.hadoop.hbase.monitoring.TestTaskMonitor
Tests run: 3, Failures: 0, Errors: 0, Skipped: 0, Time elapsed: 1.796 sec - in org.apache.hadoop.hbase.monitoring.TestTaskMonitor

Results :

Tests run: 906, Failures: 0, Errors: 0, Skipped: 7

[INFO] ------------------------------------------------------------------------
[INFO] Reactor Summary:
[INFO] 
[INFO] HBase ............................................. SUCCESS [5.911s]
[INFO] HBase - Common .................................... SUCCESS [2:15.858s]
[INFO] HBase - Protocol .................................. SUCCESS [22.928s]
[INFO] HBase - Client .................................... SUCCESS [1:30.628s]
[INFO] HBase - Hadoop Compatibility ...................... SUCCESS [11.430s]
[INFO] HBase - Hadoop Two Compatibility .................. SUCCESS [15.036s]
[INFO] HBase - Prefix Tree ............................... SUCCESS [23.806s]
[INFO] HBase - Server .................................... FAILURE [25:56.888s]
[INFO] HBase - Testing Util .............................. SKIPPED
[INFO] HBase - Thrift .................................... SKIPPED
[INFO] HBase - Shell ..................................... SKIPPED
[INFO] HBase - Integration Tests ......................... SKIPPED
[INFO] HBase - Examples .................................. SKIPPED
[INFO] HBase - Assembly .................................. SKIPPED
[INFO] ------------------------------------------------------------------------
[INFO] BUILD FAILURE
[INFO] ------------------------------------------------------------------------
[INFO] Total time: 31:04.839s
[INFO] Finished at: Thu Aug 28 12:35:38 UTC 2014
[INFO] Final Memory: 67M/1143M
[INFO] ------------------------------------------------------------------------
[ERROR] Failed to execute goal org.apache.maven.plugins:maven-surefire-plugin:2.17:test (default-test) on project hbase-server: ExecutionException: java.lang.RuntimeException: The forked VM terminated without properly saying goodbye. VM crash or System.exit called?
[ERROR] Command was /bin/sh -c cd <https://builds.apache.org/job/HBase-TRUNK/ws/hbase-server> && /home/jenkins/tools/java/jdk1.7.0_25-32/jre/bin/java -enableassertions -XX:MaxDirectMemorySize=1G -Xmx1900m -XX:MaxPermSize=256m -Djava.security.egd=file:/dev/./urandom -Djava.net.preferIPv4Stack=true -Djava.awt.headless=true -jar <https://builds.apache.org/job/HBase-TRUNK/ws/hbase-server/target/surefire/surefirebooter2351632613565200327.jar> <https://builds.apache.org/job/HBase-TRUNK/ws/hbase-server/target/surefire/surefire5700738989331264744tmp> <https://builds.apache.org/job/HBase-TRUNK/ws/hbase-server/target/surefire/surefire_1827135860700058313927tmp>
[ERROR] -> [Help 1]
[ERROR] 
[ERROR] To see the full stack trace of the errors, re-run Maven with the -e switch.
[ERROR] Re-run Maven using the -X switch to enable full debug logging.
[ERROR] 
[ERROR] For more information about the errors and possible solutions, please read the following articles:
[ERROR] [Help 1] http://cwiki.apache.org/confluence/display/MAVEN/MojoFailureException
[ERROR] 
[ERROR] After correcting the problems, you can resume the build with the command
[ERROR]   mvn <goals> -rf :hbase-server
Build step 'Invoke top-level Maven targets' marked build as failure
Performing Post build task...
Match found for :.* : True
Logical operation result is TRUE
Running script  :   ZOMBIE_TESTS_COUNT=`jps | grep surefirebooter | wc -l`
  if [[ $ZOMBIE_TESTS_COUNT != 0 ]] ; then
    #It seems sometimes the tests are not dying immediately. Let's give them 10s
    echo "Suspicious java process found - waiting 10s to see if there are just slow to stop"
    sleep 10   
    ZOMBIE_TESTS_COUNT=`jps | grep surefirebooter | wc -l`
    if [[ $ZOMBIE_TESTS_COUNT != 0 ]] ; then
      echo "There are $ZOMBIE_TESTS_COUNT zombie tests, they should have been killed by surefire but survived"
      echo "************ BEGIN zombies jstack extract"
      ZB_STACK=`jps | grep surefirebooter | cut -d ' ' -f 1 | xargs -n 1 jstack | grep ".test" | grep "\.java"`
      jps | grep surefirebooter | cut -d ' ' -f 1 | xargs -n 1 jstack
      echo "************ END  zombies jstack extract"
      JIRA_COMMENT="$JIRA_COMMENT

     {color:red}-1 core zombie tests{color}.  There are ${ZOMBIE_TESTS_COUNT} zombie test(s): ${ZB_STACK}"
      BAD=1
      jps | grep surefirebooter | cut -d ' ' -f 1 | xargs kill -9
    else
      echo "We're ok: there is no zombie test, but some tests took some time to stop"
    fi
  else
    echo "We're ok: there is no zombie test"
  fi
[HBase-TRUNK] $ /bin/bash -xe /tmp/hudson5935502231338609910.sh
++ jps
++ grep surefirebooter
++ wc -l
+ ZOMBIE_TESTS_COUNT=0
+ [[ 0 != 0 ]]
+ echo 'We'\''re ok: there is no zombie test'
We're ok: there is no zombie test
POST BUILD TASK : SUCCESS
END OF POST BUILD TASK : 0
Archiving artifacts
Sending artifact delta relative to HBase-TRUNK #5421
Archived 889 artifacts
Archive block size is 32768
Received 8 blocks and 33082056 bytes
Compression is 0.8%
Took 1 min 5 sec
Recording test results
Updating HBASE-9875

Build failed in Jenkins: HBase-TRUNK #5439

Posted by Apache Jenkins Server <je...@builds.apache.org>.
See <https://builds.apache.org/job/HBase-TRUNK/5439/changes>

Changes:

[stack] HBASE-4920 We need a mascot, a totem

[stack] HBASE-4920 We need a mascot, a totem

[stack] Add note on orca adding attribution

------------------------------------------
[...truncated 1611 lines...]
Tests run: 9, Failures: 0, Errors: 0, Skipped: 0, Time elapsed: 13.731 sec - in org.apache.hadoop.hbase.rest.client.TestRemoteTable
Running org.apache.hadoop.hbase.rest.TestTableResource
Running org.apache.hadoop.hbase.rest.TestStatusResource
Running org.apache.hadoop.hbase.rest.TestResourceFilter
Tests run: 1, Failures: 0, Errors: 0, Skipped: 0, Time elapsed: 1.078 sec - in org.apache.hadoop.hbase.rest.TestResourceFilter
Tests run: 2, Failures: 0, Errors: 0, Skipped: 0, Time elapsed: 3.181 sec - in org.apache.hadoop.hbase.rest.TestStatusResource
Tests run: 8, Failures: 0, Errors: 0, Skipped: 0, Time elapsed: 3.472 sec - in org.apache.hadoop.hbase.rest.TestTableResource
Running org.apache.hadoop.hbase.rest.TestScannersWithLabels
Running org.apache.hadoop.hbase.rest.TestSchemaResource
Running org.apache.hadoop.hbase.rest.TestGzipFilter
Tests run: 2, Failures: 0, Errors: 0, Skipped: 0, Time elapsed: 2.994 sec - in org.apache.hadoop.hbase.rest.TestScannersWithLabels
Tests run: 2, Failures: 0, Errors: 0, Skipped: 0, Time elapsed: 3.216 sec - in org.apache.hadoop.hbase.rest.TestGzipFilter
Tests run: 2, Failures: 0, Errors: 0, Skipped: 0, Time elapsed: 4.346 sec - in org.apache.hadoop.hbase.rest.TestSchemaResource
Running org.apache.hadoop.hbase.rest.TestTableScan
Running org.apache.hadoop.hbase.rest.TestDeleteRow
Running org.apache.hadoop.hbase.rest.TestGetAndPutResource
Tests run: 2, Failures: 0, Errors: 0, Skipped: 0, Time elapsed: 5.052 sec - in org.apache.hadoop.hbase.rest.TestDeleteRow
Tests run: 10, Failures: 0, Errors: 0, Skipped: 0, Time elapsed: 11.876 sec - in org.apache.hadoop.hbase.rest.TestTableScan
Running org.apache.hadoop.hbase.rest.TestScannersWithFilters
Running org.apache.hadoop.hbase.rest.TestScannerResource
Tests run: 18, Failures: 0, Errors: 0, Skipped: 0, Time elapsed: 19.771 sec - in org.apache.hadoop.hbase.rest.TestGetAndPutResource
Tests run: 10, Failures: 0, Errors: 0, Skipped: 0, Time elapsed: 6.167 sec - in org.apache.hadoop.hbase.rest.TestScannersWithFilters
Tests run: 5, Failures: 0, Errors: 0, Skipped: 0, Time elapsed: 5.748 sec - in org.apache.hadoop.hbase.rest.TestScannerResource
Running org.apache.hadoop.hbase.security.visibility.TestVisibilityLabelsWithDistributedLogReplay
Running org.apache.hadoop.hbase.security.visibility.TestVisibilityLabelsWithSLGStack
Running org.apache.hadoop.hbase.security.visibility.TestVisibilityLabelsWithDeletes
Running org.apache.hadoop.hbase.rest.TestMultiRowResource
Tests run: 1, Failures: 0, Errors: 0, Skipped: 0, Time elapsed: 1.375 sec - in org.apache.hadoop.hbase.security.visibility.TestVisibilityLabelsWithSLGStack
Tests run: 3, Failures: 0, Errors: 0, Skipped: 0, Time elapsed: 3.194 sec - in org.apache.hadoop.hbase.rest.TestMultiRowResource
Running org.apache.hadoop.hbase.security.visibility.TestEnforcingScanLabelGenerator
Tests run: 1, Failures: 0, Errors: 0, Skipped: 0, Time elapsed: 1.801 sec - in org.apache.hadoop.hbase.security.visibility.TestEnforcingScanLabelGenerator
Running org.apache.hadoop.hbase.security.visibility.TestVisibilityWithCheckAuths
Tests run: 21, Failures: 0, Errors: 0, Skipped: 0, Time elapsed: 15.29 sec - in org.apache.hadoop.hbase.security.visibility.TestVisibilityLabelsWithDistributedLogReplay
Tests run: 2, Failures: 0, Errors: 0, Skipped: 0, Time elapsed: 3.04 sec - in org.apache.hadoop.hbase.security.visibility.TestVisibilityWithCheckAuths
Running org.apache.hadoop.hbase.security.visibility.TestVisibilityLabelsOpWithDifferentUsersNoACL
Running org.apache.hadoop.hbase.security.visibility.TestVisibilityLabelsWithDefaultVisLabelService
Tests run: 1, Failures: 0, Errors: 0, Skipped: 0, Time elapsed: 2.495 sec - in org.apache.hadoop.hbase.security.visibility.TestVisibilityLabelsOpWithDifferentUsersNoACL
Running org.apache.hadoop.hbase.security.visibility.TestVisibilityLabelsWithACL
Tests run: 5, Failures: 0, Errors: 0, Skipped: 0, Time elapsed: 4.642 sec - in org.apache.hadoop.hbase.security.visibility.TestVisibilityLabelsWithACL
Running org.apache.hadoop.hbase.security.visibility.TestVisibilityLabelsWithCustomVisLabService
Tests run: 21, Failures: 0, Errors: 0, Skipped: 0, Time elapsed: 13.454 sec - in org.apache.hadoop.hbase.security.visibility.TestVisibilityLabelsWithDefaultVisLabelService
Tests run: 37, Failures: 0, Errors: 0, Skipped: 0, Time elapsed: 41.236 sec - in org.apache.hadoop.hbase.security.visibility.TestVisibilityLabelsWithDeletes
Running org.apache.hadoop.hbase.security.access.TestAccessController
Tests run: 8, Failures: 0, Errors: 0, Skipped: 0, Time elapsed: 224.48 sec - in org.apache.hadoop.hbase.replication.regionserver.TestReplicationHLogReaderManager
Running org.apache.hadoop.hbase.security.access.TestTablePermissions
Tests run: 19, Failures: 0, Errors: 0, Skipped: 0, Time elapsed: 12.98 sec - in org.apache.hadoop.hbase.security.visibility.TestVisibilityLabelsWithCustomVisLabService
Running org.apache.hadoop.hbase.security.access.TestAccessControlFilter
Running org.apache.hadoop.hbase.security.access.TestCellACLs
Tests run: 1, Failures: 0, Errors: 0, Skipped: 0, Time elapsed: 2.316 sec - in org.apache.hadoop.hbase.security.access.TestAccessControlFilter
Tests run: 2, Failures: 0, Errors: 0, Skipped: 0, Time elapsed: 6.623 sec - in org.apache.hadoop.hbase.security.access.TestCellACLs
Running org.apache.hadoop.hbase.security.access.TestNamespaceCommands
Tests run: 3, Failures: 0, Errors: 0, Skipped: 0, Time elapsed: 2.553 sec - in org.apache.hadoop.hbase.security.access.TestNamespaceCommands
Running org.apache.hadoop.hbase.security.access.TestZKPermissionsWatcher
Tests run: 7, Failures: 0, Errors: 0, Skipped: 0, Time elapsed: 13.842 sec - in org.apache.hadoop.hbase.security.access.TestTablePermissions
Running org.apache.hadoop.hbase.security.token.TestZKSecretWatcher
Tests run: 1, Failures: 0, Errors: 0, Skipped: 0, Time elapsed: 3.514 sec - in org.apache.hadoop.hbase.security.access.TestZKPermissionsWatcher
Running org.apache.hadoop.hbase.security.access.TestScanEarlyTermination
Running org.apache.hadoop.hbase.security.token.TestTokenAuthentication
Tests run: 2, Failures: 0, Errors: 0, Skipped: 0, Time elapsed: 0.432 sec - in org.apache.hadoop.hbase.security.token.TestTokenAuthentication
Running org.apache.hadoop.hbase.TestMetaTableAccessorNoCluster
Running org.apache.hadoop.hbase.security.access.TestCellACLWithMultipleVersions
Tests run: 1, Failures: 0, Errors: 0, Skipped: 0, Time elapsed: 3.441 sec - in org.apache.hadoop.hbase.security.access.TestScanEarlyTermination
Tests run: 2, Failures: 0, Errors: 0, Skipped: 0, Time elapsed: 3.607 sec - in org.apache.hadoop.hbase.TestMetaTableAccessorNoCluster
Running org.apache.hadoop.hbase.TestMetaTableLocator
Tests run: 6, Failures: 0, Errors: 0, Skipped: 0, Time elapsed: 1.814 sec - in org.apache.hadoop.hbase.TestMetaTableLocator
Running org.apache.hadoop.hbase.TestHBaseTestingUtility
Tests run: 1, Failures: 0, Errors: 0, Skipped: 0, Time elapsed: 13.25 sec - in org.apache.hadoop.hbase.security.token.TestZKSecretWatcher
Running org.apache.hadoop.hbase.TestZooKeeper
Running org.apache.hadoop.hbase.snapshot.TestSnapshotDescriptionUtils
Tests run: 2, Failures: 0, Errors: 0, Skipped: 0, Time elapsed: 0.237 sec - in org.apache.hadoop.hbase.snapshot.TestSnapshotDescriptionUtils
Tests run: 8, Failures: 0, Errors: 0, Skipped: 0, Time elapsed: 13.333 sec - in org.apache.hadoop.hbase.security.access.TestCellACLWithMultipleVersions
Running org.apache.hadoop.hbase.snapshot.TestFlushSnapshotFromClient
Running org.apache.hadoop.hbase.snapshot.TestSecureExportSnapshot
Tests run: 7, Failures: 0, Errors: 0, Skipped: 0, Time elapsed: 30.715 sec - in org.apache.hadoop.hbase.TestHBaseTestingUtility
Tests run: 44, Failures: 0, Errors: 0, Skipped: 0, Time elapsed: 83.14 sec - in org.apache.hadoop.hbase.security.access.TestAccessController
Tests run: 9, Failures: 0, Errors: 0, Skipped: 0, Time elapsed: 35.753 sec - in org.apache.hadoop.hbase.snapshot.TestFlushSnapshotFromClient
Running org.apache.hadoop.hbase.snapshot.TestExportSnapshot
Running org.apache.hadoop.hbase.snapshot.TestRestoreFlushSnapshotFromClient
Running org.apache.hadoop.hbase.TestInfoServers
Tests run: 3, Failures: 0, Errors: 0, Skipped: 0, Time elapsed: 2.872 sec - in org.apache.hadoop.hbase.TestInfoServers
Running org.apache.hadoop.hbase.procedure.TestZKProcedureControllers
Tests run: 4, Failures: 0, Errors: 0, Skipped: 0, Time elapsed: 1.864 sec - in org.apache.hadoop.hbase.procedure.TestZKProcedureControllers
Running org.apache.hadoop.hbase.procedure.TestZKProcedure
Tests run: 4, Failures: 0, Errors: 0, Skipped: 0, Time elapsed: 2.942 sec - in org.apache.hadoop.hbase.procedure.TestZKProcedure
Running org.apache.hadoop.hbase.io.hfile.TestCacheOnWrite
Tests run: 5, Failures: 0, Errors: 0, Skipped: 0, Time elapsed: 48.02 sec - in org.apache.hadoop.hbase.snapshot.TestRestoreFlushSnapshotFromClient
Running org.apache.hadoop.hbase.io.hfile.TestForceCacheImportantBlocks
Tests run: 2, Failures: 0, Errors: 0, Skipped: 0, Time elapsed: 23.545 sec - in org.apache.hadoop.hbase.io.hfile.TestForceCacheImportantBlocks
Running org.apache.hadoop.hbase.io.hfile.TestHFileBlock
Tests run: 36, Failures: 0, Errors: 0, Skipped: 0, Time elapsed: 78.471 sec - in org.apache.hadoop.hbase.io.hfile.TestCacheOnWrite
Running org.apache.hadoop.hbase.io.hfile.TestHFileBlockIndex
Tests run: 2, Failures: 0, Errors: 0, Skipped: 0, Time elapsed: 1.313 sec - in org.apache.hadoop.hbase.io.hfile.TestHFileBlockIndex
Running org.apache.hadoop.hbase.io.hfile.TestHFileSeek
Tests run: 1, Failures: 0, Errors: 0, Skipped: 0, Time elapsed: 5.269 sec - in org.apache.hadoop.hbase.io.hfile.TestHFileSeek
Running org.apache.hadoop.hbase.io.hfile.TestScannerSelectionUsingTTL
Tests run: 11, Failures: 0, Errors: 0, Skipped: 0, Time elapsed: 205.405 sec - in org.apache.hadoop.hbase.TestZooKeeper
Running org.apache.hadoop.hbase.io.hfile.TestCacheConfig
Tests run: 6, Failures: 0, Errors: 0, Skipped: 0, Time elapsed: 2.291 sec - in org.apache.hadoop.hbase.io.hfile.TestCacheConfig
Running org.apache.hadoop.hbase.io.encoding.TestDataBlockEncoders
Tests run: 28, Failures: 0, Errors: 0, Skipped: 0, Time elapsed: 95.561 sec - in org.apache.hadoop.hbase.io.hfile.TestHFileBlock
Running org.apache.hadoop.hbase.io.encoding.TestEncodedSeekers
Tests run: 6, Failures: 0, Errors: 0, Skipped: 0, Time elapsed: 63.664 sec - in org.apache.hadoop.hbase.io.hfile.TestScannerSelectionUsingTTL
Running org.apache.hadoop.hbase.io.encoding.TestBufferedDataBlockEncoder
Tests run: 1, Failures: 0, Errors: 0, Skipped: 0, Time elapsed: 25.375 sec - in org.apache.hadoop.hbase.io.encoding.TestBufferedDataBlockEncoder
Running org.apache.hadoop.hbase.io.encoding.TestChangingEncoding
Tests run: 9, Failures: 0, Errors: 0, Skipped: 0, Time elapsed: 297.921 sec - in org.apache.hadoop.hbase.snapshot.TestSecureExportSnapshot
Tests run: 3, Failures: 0, Errors: 0, Skipped: 0, Time elapsed: 49.43 sec - in org.apache.hadoop.hbase.io.encoding.TestChangingEncoding
Running org.apache.hadoop.hbase.io.encoding.TestLoadAndSwitchEncodeOnDisk
Running org.apache.hadoop.hbase.io.encoding.TestPrefixTree
Tests run: 1, Failures: 0, Errors: 0, Skipped: 0, Time elapsed: 1.825 sec - in org.apache.hadoop.hbase.io.encoding.TestPrefixTree
Running org.apache.hadoop.hbase.io.TestFileLink
Tests run: 1, Failures: 0, Errors: 0, Skipped: 0, Time elapsed: 23.203 sec - in org.apache.hadoop.hbase.io.encoding.TestLoadAndSwitchEncodeOnDisk
Tests run: 9, Failures: 0, Errors: 0, Skipped: 0, Time elapsed: 298.042 sec - in org.apache.hadoop.hbase.snapshot.TestExportSnapshot
Tests run: 3, Failures: 0, Errors: 0, Skipped: 0, Time elapsed: 15.736 sec - in org.apache.hadoop.hbase.io.TestFileLink
Tests run: 20, Failures: 0, Errors: 0, Skipped: 0, Time elapsed: 127.864 sec - in org.apache.hadoop.hbase.io.encoding.TestEncodedSeekers
Running org.apache.hadoop.hbase.zookeeper.TestZKLeaderManager
Tests run: 1, Failures: 0, Errors: 0, Skipped: 0, Time elapsed: 0.171 sec - in org.apache.hadoop.hbase.zookeeper.TestZKLeaderManager
Running org.apache.hadoop.hbase.zookeeper.TestZooKeeperNodeTracker
Running org.apache.hadoop.hbase.zookeeper.TestRecoverableZooKeeper
Tests run: 3, Failures: 0, Errors: 0, Skipped: 0, Time elapsed: 1.06 sec - in org.apache.hadoop.hbase.zookeeper.TestZooKeeperNodeTracker
Running org.apache.hadoop.hbase.zookeeper.TestZKTableStateManager
Tests run: 1, Failures: 0, Errors: 0, Skipped: 0, Time elapsed: 1.23 sec - in org.apache.hadoop.hbase.zookeeper.TestRecoverableZooKeeper
Tests run: 1, Failures: 0, Errors: 0, Skipped: 0, Time elapsed: 0.95 sec - in org.apache.hadoop.hbase.zookeeper.TestZKTableStateManager
Running org.apache.hadoop.hbase.zookeeper.TestZKMulti
Tests run: 6, Failures: 0, Errors: 0, Skipped: 0, Time elapsed: 0.333 sec - in org.apache.hadoop.hbase.zookeeper.TestZKMulti
Running org.apache.hadoop.hbase.zookeeper.lock.TestZKInterProcessReadWriteLock
Running org.apache.hadoop.hbase.zookeeper.TestHQuorumPeer
Tests run: 3, Failures: 0, Errors: 0, Skipped: 0, Time elapsed: 1.418 sec - in org.apache.hadoop.hbase.zookeeper.TestHQuorumPeer
Running org.apache.hadoop.hbase.zookeeper.TestZooKeeperACL
Running org.apache.hadoop.hbase.TestIOFencing
Tests run: 6, Failures: 0, Errors: 0, Skipped: 0, Time elapsed: 0.278 sec - in org.apache.hadoop.hbase.zookeeper.TestZooKeeperACL
Running org.apache.hadoop.hbase.constraint.TestConstraint
Running org.apache.hadoop.hbase.backup.TestHFileArchiving
Tests run: 5, Failures: 0, Errors: 0, Skipped: 0, Time elapsed: 5.037 sec - in org.apache.hadoop.hbase.constraint.TestConstraint
Running org.apache.hadoop.hbase.backup.example.TestZooKeeperTableArchiveClient
Tests run: 3, Failures: 0, Errors: 0, Skipped: 0, Time elapsed: 3.783 sec - in org.apache.hadoop.hbase.backup.example.TestZooKeeperTableArchiveClient
Tests run: 6, Failures: 0, Errors: 0, Skipped: 0, Time elapsed: 24.458 sec - in org.apache.hadoop.hbase.zookeeper.lock.TestZKInterProcessReadWriteLock
Running org.apache.hadoop.hbase.ipc.TestProtoBufRpc
Tests run: 1, Failures: 0, Errors: 0, Skipped: 0, Time elapsed: 2.052 sec - in org.apache.hadoop.hbase.ipc.TestProtoBufRpc
Running org.apache.hadoop.hbase.ipc.TestDelayedRpc
Running org.apache.hadoop.hbase.TestHColumnDescriptorDefaultVersions
Tests run: 4, Failures: 0, Errors: 0, Skipped: 0, Time elapsed: 3.913 sec - in org.apache.hadoop.hbase.ipc.TestDelayedRpc
Running org.apache.hadoop.hbase.ipc.TestHBaseClient
Tests run: 1, Failures: 0, Errors: 0, Skipped: 0, Time elapsed: 0.44 sec - in org.apache.hadoop.hbase.ipc.TestHBaseClient
Tests run: 3, Failures: 0, Errors: 0, Skipped: 0, Time elapsed: 10.521 sec - in org.apache.hadoop.hbase.TestHColumnDescriptorDefaultVersions
Running org.apache.hadoop.hbase.TestNamespace
Tests run: 9, Failures: 0, Errors: 0, Skipped: 1, Time elapsed: 5.31 sec - in org.apache.hadoop.hbase.TestNamespace
Tests run: 5, Failures: 0, Errors: 0, Skipped: 0, Time elapsed: 39.383 sec - in org.apache.hadoop.hbase.backup.TestHFileArchiving
Tests run: 28, Failures: 0, Errors: 0, Skipped: 0, Time elapsed: 274.048 sec - in org.apache.hadoop.hbase.io.encoding.TestDataBlockEncoders
Tests run: 2, Failures: 0, Errors: 0, Skipped: 0, Time elapsed: 192.294 sec - in org.apache.hadoop.hbase.TestIOFencing

Results :

Failed tests: 
  TestRegionRebalancing.testRebalanceOnRegionServerNumberChange:131->assertRegionsAreBalanced:221 After 5 attempts, region assignments were not balanced.

Tests run: 2041, Failures: 1, Errors: 0, Skipped: 19

[INFO] ------------------------------------------------------------------------
[INFO] Reactor Summary:
[INFO] 
[INFO] HBase ............................................. SUCCESS [2.739s]
[INFO] HBase - Common .................................... SUCCESS [54.338s]
[INFO] HBase - Protocol .................................. SUCCESS [8.992s]
[INFO] HBase - Client .................................... SUCCESS [1:04.236s]
[INFO] HBase - Hadoop Compatibility ...................... SUCCESS [7.118s]
[INFO] HBase - Hadoop Two Compatibility .................. SUCCESS [5.843s]
[INFO] HBase - Prefix Tree ............................... SUCCESS [8.425s]
[INFO] HBase - Server .................................... FAILURE [1:06:21.976s]
[INFO] HBase - Testing Util .............................. SKIPPED
[INFO] HBase - Thrift .................................... SKIPPED
[INFO] HBase - Shell ..................................... SKIPPED
[INFO] HBase - Integration Tests ......................... SKIPPED
[INFO] HBase - Examples .................................. SKIPPED
[INFO] HBase - Assembly .................................. SKIPPED
[INFO] ------------------------------------------------------------------------
[INFO] BUILD FAILURE
[INFO] ------------------------------------------------------------------------
[INFO] Total time: 1:08:54.392s
[INFO] Finished at: Thu Aug 28 04:15:15 UTC 2014
[INFO] Final Memory: 39M/269M
[INFO] ------------------------------------------------------------------------
[ERROR] Failed to execute goal org.apache.maven.plugins:maven-surefire-plugin:2.17:test (secondPartTestsExecution) on project hbase-server: There are test failures.
[ERROR] 
[ERROR] Please refer to <https://builds.apache.org/job/HBase-TRUNK/ws/hbase-server/target/surefire-reports> for the individual test results.
[ERROR] -> [Help 1]
[ERROR] 
[ERROR] To see the full stack trace of the errors, re-run Maven with the -e switch.
[ERROR] Re-run Maven using the -X switch to enable full debug logging.
[ERROR] 
[ERROR] For more information about the errors and possible solutions, please read the following articles:
[ERROR] [Help 1] http://cwiki.apache.org/confluence/display/MAVEN/MojoFailureException
[ERROR] 
[ERROR] After correcting the problems, you can resume the build with the command
[ERROR]   mvn <goals> -rf :hbase-server
Build step 'Invoke top-level Maven targets' marked build as failure
Performing Post build task...
Match found for :.* : True
Logical operation result is TRUE
Running script  :   ZOMBIE_TESTS_COUNT=`jps | grep surefirebooter | wc -l`
  if [[ $ZOMBIE_TESTS_COUNT != 0 ]] ; then
    #It seems sometimes the tests are not dying immediately. Let's give them 10s
    echo "Suspicious java process found - waiting 10s to see if there are just slow to stop"
    sleep 10   
    ZOMBIE_TESTS_COUNT=`jps | grep surefirebooter | wc -l`
    if [[ $ZOMBIE_TESTS_COUNT != 0 ]] ; then
      echo "There are $ZOMBIE_TESTS_COUNT zombie tests, they should have been killed by surefire but survived"
      echo "************ BEGIN zombies jstack extract"
      ZB_STACK=`jps | grep surefirebooter | cut -d ' ' -f 1 | xargs -n 1 jstack | grep ".test" | grep "\.java"`
      jps | grep surefirebooter | cut -d ' ' -f 1 | xargs -n 1 jstack
      echo "************ END  zombies jstack extract"
      JIRA_COMMENT="$JIRA_COMMENT

     {color:red}-1 core zombie tests{color}.  There are ${ZOMBIE_TESTS_COUNT} zombie test(s): ${ZB_STACK}"
      BAD=1
      jps | grep surefirebooter | cut -d ' ' -f 1 | xargs kill -9
    else
      echo "We're ok: there is no zombie test, but some tests took some time to stop"
    fi
  else
    echo "We're ok: there is no zombie test"
  fi
[HBase-TRUNK] $ /bin/bash -xe /tmp/hudson6293068868302928121.sh
++ jps
++ grep surefirebooter
++ wc -l
+ ZOMBIE_TESTS_COUNT=1
+ [[ 1 != 0 ]]
+ echo 'Suspicious java process found - waiting 10s to see if there are just slow to stop'
Suspicious java process found - waiting 10s to see if there are just slow to stop
+ sleep 10
++ jps
++ grep surefirebooter
++ wc -l
+ ZOMBIE_TESTS_COUNT=0
+ [[ 0 != 0 ]]
+ echo 'We'\''re ok: there is no zombie test, but some tests took some time to stop'
We're ok: there is no zombie test, but some tests took some time to stop
POST BUILD TASK : SUCCESS
END OF POST BUILD TASK : 0
Archiving artifacts
Sending artifact delta relative to HBase-TRUNK #5421
Archived 1786 artifacts
Archive block size is 32768
Received 76 blocks and 557378022 bytes
Compression is 0.4%
Took 2 min 52 sec
Recording test results
Updating HBASE-4920