You are viewing a plain text version of this content. The canonical link for it is here.
Posted to java-dev@axis.apache.org by Apache Jenkins Server <je...@builds.apache.org> on 2012/03/09 11:05:17 UTC
Build failed in Jenkins: axis-trunk #114
See <https://builds.apache.org/job/axis-trunk/114/>
------------------------------------------
[...truncated 8055 lines...]
[INFO] skip non existing resourceDirectory <https://builds.apache.org/job/axis-trunk/ws/axis/integration/src/test/resources>
[INFO] Copying 3 resources
[INFO] --- maven-resources-plugin:2.4.3:testResources (default-testResources) @ integration ---
[INFO]
[INFO] --- maven-compiler-plugin:2.3.2:testCompile (default-testCompile) @ integration ---
[INFO] Compiling 721 source files to <https://builds.apache.org/job/axis-trunk/ws/axis/integration/target/test-classes>
[INFO] [INFO] Tests are skipped.
[INFO] --- maven-surefire-plugin:2.11:test (default-test) @ integration ---
[INFO]
[INFO] --- maven-jar-plugin:2.3.2:jar (default-jar) @ integration ---
[INFO] Building jar: <https://builds.apache.org/job/axis-trunk/ws/axis/integration/target/integration-1.4.1-SNAPSHOT.jar>
[INFO]
[INFO] [INFO] Skipping the assembly in this project because it's not the Execution Root
--- maven-assembly-plugin:2.2.2:single (source-release-assembly) @ integration ---
[INFO]
[INFO] --- maven-antrun-plugin:1.7:run (default) @ integration ---
[INFO] Executing tasks
main:
[INFO] Executed tasks
[JENKINS] Archiving <https://builds.apache.org/job/axis-trunk/ws/axis/integration/pom.xml> to /home/hudson/hudson/jobs/axis-trunk/modules/org.apache.axis$integration/builds/2012-03-09_10-00-38/archive/org.apache.axis/integration/1.4.1-SNAPSHOT/integration-1.4.1-SNAPSHOT.pom
[JENKINS] Archiving <https://builds.apache.org/job/axis-trunk/ws/axis/integration/target/integration-1.4.1-SNAPSHOT.jar> to /home/hudson/hudson/jobs/axis-trunk/modules/org.apache.axis$integration/builds/2012-03-09_10-00-38/archive/org.apache.axis/integration/1.4.1-SNAPSHOT/integration-1.4.1-SNAPSHOT.jar
Mar 9, 2012 10:04:53 AM hudson.maven.ExecutedMojo <init>
WARNING: Failed to getClass for org.apache.maven.plugin.source.SourceJarMojo
[INFO]
[INFO] --- maven-source-plugin:2.1.2:jar (attach-sources) @ integration ---
[INFO] test already added, skipping
[INFO] test/wsdl already added, skipping
[INFO] test/wsdl/arrays3 already added, skipping
[INFO] test/wsdl/arrays3/Address.java already added, skipping
[INFO] test/wsdl/arrays3/Phone.java already added, skipping
[INFO] test/wsdl/arrays3/StateType.java already added, skipping
[INFO] META-INF already added, skipping
[INFO] META-INF/DEPENDENCIES already added, skipping
[INFO] META-INF/NOTICE already added, skipping
[INFO] META-INF/LICENSE already added, skipping
[INFO] Building jar: <https://builds.apache.org/job/axis-trunk/ws/axis/integration/target/integration-1.4.1-SNAPSHOT-sources.jar>
[INFO] test already added, skipping
[INFO] test/wsdl already added, skipping
[INFO] test/wsdl/arrays3 already added, skipping
[INFO] test/wsdl/arrays3/Address.java already added, skipping
[INFO] test/wsdl/arrays3/Phone.java already added, skipping
[INFO] test/wsdl/arrays3/StateType.java already added, skipping
[INFO] META-INF already added, skipping
[INFO] META-INF/DEPENDENCIES already added, skipping
[INFO] META-INF/NOTICE already added, skipping
[INFO] META-INF/LICENSE already added, skipping
[INFO]
[INFO] --- maven-javadoc-plugin:2.5:jar (attach-javadocs) @ integration ---
Loading source files for package test.wsdl.map...
Loading source files for package test.wsdl.document...
Loading source files for package test.wsdl.anytype...
Loading source files for package test.wsdl.gateway...
Loading source files for package test.wsdl.arrays3...
Constructing Javadoc information...
Standard Doclet version 1.5.0_22
Building tree for all the packages and classes...
Generating <https://builds.apache.org/job/axis-trunk/ws/axis/integration/target/apidocs/test/wsdl/map//MapService.html...>
Generating <https://builds.apache.org/job/axis-trunk/ws/axis/integration/target/apidocs/test/wsdl/document//TestService.html...>
Generating <https://builds.apache.org/job/axis-trunk/ws/axis/integration/target/apidocs/test/wsdl/anytype//AnyService.html...>
Generating <https://builds.apache.org/job/axis-trunk/ws/axis/integration/target/apidocs/test/wsdl/gateway//Gateway.html...>
Generating <https://builds.apache.org/job/axis-trunk/ws/axis/integration/target/apidocs/test/wsdl/gateway//MyClass.html...>
Generating <https://builds.apache.org/job/axis-trunk/ws/axis/integration/target/apidocs/test/wsdl/gateway//OutClass.html...>
Generating <https://builds.apache.org/job/axis-trunk/ws/axis/integration/target/apidocs/test/wsdl/arrays3//AddrBookService.html...>
Generating <https://builds.apache.org/job/axis-trunk/ws/axis/integration/target/apidocs/test/wsdl/arrays3//AddrBookServiceImpl.html...>
Generating <https://builds.apache.org/job/axis-trunk/ws/axis/integration/target/apidocs/test/wsdl/arrays3//Address.html...>
Generating <https://builds.apache.org/job/axis-trunk/ws/axis/integration/target/apidocs/test/wsdl/arrays3//Address_Helper.html...>
Generating <https://builds.apache.org/job/axis-trunk/ws/axis/integration/target/apidocs/test/wsdl/arrays3//AddressBookImpl.html...>
Generating <https://builds.apache.org/job/axis-trunk/ws/axis/integration/target/apidocs/test/wsdl/arrays3//Phone.html...>
Generating <https://builds.apache.org/job/axis-trunk/ws/axis/integration/target/apidocs/test/wsdl/arrays3//Phone_Helper.html...>
Generating <https://builds.apache.org/job/axis-trunk/ws/axis/integration/target/apidocs/test/wsdl/arrays3//StateType.html...>
Generating <https://builds.apache.org/job/axis-trunk/ws/axis/integration/target/apidocs/test/wsdl/arrays3//StateType_Helper.html...>
Generating <https://builds.apache.org/job/axis-trunk/ws/axis/integration/target/apidocs/overview-frame.html...>
Generating <https://builds.apache.org/job/axis-trunk/ws/axis/integration/target/apidocs/test/wsdl/anytype//package-frame.html...>
Generating <https://builds.apache.org/job/axis-trunk/ws/axis/integration/target/apidocs/test/wsdl/anytype//package-summary.html...>
Generating <https://builds.apache.org/job/axis-trunk/ws/axis/integration/target/apidocs/test/wsdl/anytype//package-tree.html...>
Generating <https://builds.apache.org/job/axis-trunk/ws/axis/integration/target/apidocs/test/wsdl/arrays3//package-frame.html...>
Generating <https://builds.apache.org/job/axis-trunk/ws/axis/integration/target/apidocs/test/wsdl/arrays3//package-summary.html...>
Generating <https://builds.apache.org/job/axis-trunk/ws/axis/integration/target/apidocs/test/wsdl/arrays3//package-tree.html...>
Generating <https://builds.apache.org/job/axis-trunk/ws/axis/integration/target/apidocs/test/wsdl/document//package-frame.html...>
Generating <https://builds.apache.org/job/axis-trunk/ws/axis/integration/target/apidocs/test/wsdl/document//package-summary.html...>
Generating <https://builds.apache.org/job/axis-trunk/ws/axis/integration/target/apidocs/test/wsdl/document//package-tree.html...>
Generating <https://builds.apache.org/job/axis-trunk/ws/axis/integration/target/apidocs/test/wsdl/gateway//package-frame.html...>
Generating <https://builds.apache.org/job/axis-trunk/ws/axis/integration/target/apidocs/test/wsdl/gateway//package-summary.html...>
Generating <https://builds.apache.org/job/axis-trunk/ws/axis/integration/target/apidocs/test/wsdl/gateway//package-tree.html...>
Generating <https://builds.apache.org/job/axis-trunk/ws/axis/integration/target/apidocs/test/wsdl/map//package-frame.html...>
Generating <https://builds.apache.org/job/axis-trunk/ws/axis/integration/target/apidocs/test/wsdl/map//package-summary.html...>
Generating <https://builds.apache.org/job/axis-trunk/ws/axis/integration/target/apidocs/test/wsdl/map//package-tree.html...>
Generating <https://builds.apache.org/job/axis-trunk/ws/axis/integration/target/apidocs/constant-values.html...>
Generating <https://builds.apache.org/job/axis-trunk/ws/axis/integration/target/apidocs/serialized-form.html...>
Generating <https://builds.apache.org/job/axis-trunk/ws/axis/integration/target/apidocs/test/wsdl/map/class-use//MapService.html...>
Generating <https://builds.apache.org/job/axis-trunk/ws/axis/integration/target/apidocs/test/wsdl/document/class-use//TestService.html...>
Generating <https://builds.apache.org/job/axis-trunk/ws/axis/integration/target/apidocs/test/wsdl/anytype/class-use//AnyService.html...>
Generating <https://builds.apache.org/job/axis-trunk/ws/axis/integration/target/apidocs/test/wsdl/gateway/class-use//MyClass.html...>
Generating <https://builds.apache.org/job/axis-trunk/ws/axis/integration/target/apidocs/test/wsdl/gateway/class-use//Gateway.html...>
Generating <https://builds.apache.org/job/axis-trunk/ws/axis/integration/target/apidocs/test/wsdl/gateway/class-use//OutClass.html...>
Generating <https://builds.apache.org/job/axis-trunk/ws/axis/integration/target/apidocs/test/wsdl/arrays3/class-use//Address_Helper.html...>
Generating <https://builds.apache.org/job/axis-trunk/ws/axis/integration/target/apidocs/test/wsdl/arrays3/class-use//StateType_Helper.html...>
Generating <https://builds.apache.org/job/axis-trunk/ws/axis/integration/target/apidocs/test/wsdl/arrays3/class-use//Phone_Helper.html...>
Generating <https://builds.apache.org/job/axis-trunk/ws/axis/integration/target/apidocs/test/wsdl/arrays3/class-use//Address.html...>
Generating <https://builds.apache.org/job/axis-trunk/ws/axis/integration/target/apidocs/test/wsdl/arrays3/class-use//Phone.html...>
Generating <https://builds.apache.org/job/axis-trunk/ws/axis/integration/target/apidocs/test/wsdl/arrays3/class-use//AddressBookImpl.html...>
Generating <https://builds.apache.org/job/axis-trunk/ws/axis/integration/target/apidocs/test/wsdl/arrays3/class-use//StateType.html...>
Generating <https://builds.apache.org/job/axis-trunk/ws/axis/integration/target/apidocs/test/wsdl/arrays3/class-use//AddrBookServiceImpl.html...>
Generating <https://builds.apache.org/job/axis-trunk/ws/axis/integration/target/apidocs/test/wsdl/arrays3/class-use//AddrBookService.html...>
Generating <https://builds.apache.org/job/axis-trunk/ws/axis/integration/target/apidocs/test/wsdl/anytype//package-use.html...>
Generating <https://builds.apache.org/job/axis-trunk/ws/axis/integration/target/apidocs/test/wsdl/arrays3//package-use.html...>
Generating <https://builds.apache.org/job/axis-trunk/ws/axis/integration/target/apidocs/test/wsdl/document//package-use.html...>
Generating <https://builds.apache.org/job/axis-trunk/ws/axis/integration/target/apidocs/test/wsdl/gateway//package-use.html...>
Generating <https://builds.apache.org/job/axis-trunk/ws/axis/integration/target/apidocs/test/wsdl/map//package-use.html...>
Building index for all the packages and classes...
Generating <https://builds.apache.org/job/axis-trunk/ws/axis/integration/target/apidocs/overview-tree.html...>
Generating <https://builds.apache.org/job/axis-trunk/ws/axis/integration/target/apidocs/index-all.html...>
Generating <https://builds.apache.org/job/axis-trunk/ws/axis/integration/target/apidocs/deprecated-list.html...>
Building index for all classes...
Generating <https://builds.apache.org/job/axis-trunk/ws/axis/integration/target/apidocs/allclasses-frame.html...>
Generating <https://builds.apache.org/job/axis-trunk/ws/axis/integration/target/apidocs/allclasses-noframe.html...>
Generating <https://builds.apache.org/job/axis-trunk/ws/axis/integration/target/apidocs/index.html...>
Generating <https://builds.apache.org/job/axis-trunk/ws/axis/integration/target/apidocs/overview-summary.html...>
Generating <https://builds.apache.org/job/axis-trunk/ws/axis/integration/target/apidocs/help-doc.html...>
Generating <https://builds.apache.org/job/axis-trunk/ws/axis/integration/target/apidocs/stylesheet.css...>
[INFO] Building jar: <https://builds.apache.org/job/axis-trunk/ws/axis/integration/target/integration-1.4.1-SNAPSHOT-javadoc.jar>
[INFO]
[INFO] --- maven-axis-server-plugin:1.4.1-SNAPSHOT:start-server (start-server) @ integration ---
2012-03-09 10:04:55.640:INFO::Logging to STDERR via org.mortbay.log.StdErrLog
2012-03-09 10:04:55.724:INFO::jetty-6.1.26
2012-03-09 10:04:55.755:WARN::failed SocketConnector@0.0.0.0:8080: java.net.BindException: Address already in use
2012-03-09 10:04:55.755:WARN::failed Server@ff057f: java.net.BindException: Address already in use
Exception in thread "main" java.net.BindException: Address already in use
at java.net.PlainSocketImpl.socketBind(Native Method)
at java.net.PlainSocketImpl.bind(PlainSocketImpl.java:359)
at java.net.ServerSocket.bind(ServerSocket.java:319)
at java.net.ServerSocket.<init>(ServerSocket.java:185)
at java.net.ServerSocket.<init>(ServerSocket.java:141)
at org.mortbay.jetty.bio.SocketConnector.newServerSocket(SocketConnector.java:80)
at org.mortbay.jetty.bio.SocketConnector.open(SocketConnector.java:73)
at org.mortbay.jetty.AbstractConnector.doStart(AbstractConnector.java:283)
at org.mortbay.jetty.bio.SocketConnector.doStart(SocketConnector.java:147)
at org.mortbay.component.AbstractLifeCycle.start(AbstractLifeCycle.java:50)
at org.mortbay.jetty.Server.doStart(Server.java:235)
at org.mortbay.component.AbstractLifeCycle.start(AbstractLifeCycle.java:50)
at org.apache.axis.server.standalone.StandaloneAxisServer.main(StandaloneAxisServer.java:135)
[JENKINS] Archiving <https://builds.apache.org/job/axis-trunk/ws/axis/integration/target/integration-1.4.1-SNAPSHOT-sources.jar> to /home/hudson/hudson/jobs/axis-trunk/modules/org.apache.axis$integration/builds/2012-03-09_10-00-38/archive/org.apache.axis/integration/1.4.1-SNAPSHOT/integration-1.4.1-SNAPSHOT-sources.jar
[JENKINS] Archiving <https://builds.apache.org/job/axis-trunk/ws/axis/integration/target/integration-1.4.1-SNAPSHOT-javadoc.jar> to /home/hudson/hudson/jobs/axis-trunk/modules/org.apache.axis$integration/builds/2012-03-09_10-00-38/archive/org.apache.axis/integration/1.4.1-SNAPSHOT/integration-1.4.1-SNAPSHOT-javadoc.jar
[INFO] ------------------------------------------------------------------------
[INFO] Reactor Summary:
[INFO]
[INFO] Axis .............................................. SUCCESS [28.844s]
[INFO] Axis :: SAAJ ...................................... SUCCESS [6.487s]
[INFO] Axis :: JAX-RPC ................................... SUCCESS [5.006s]
[INFO] Axis :: Core ...................................... SUCCESS [1:09.969s]
[INFO] Ant tasks ......................................... SUCCESS [24.349s]
[INFO] Maven plugins ..................................... SUCCESS [1.266s]
[INFO] Maven plugin common classes ....................... SUCCESS [3.545s]
[INFO] wsdl2java plugin .................................. SUCCESS [8.499s]
[INFO] java2wsdl plugin .................................. SUCCESS [5.642s]
[INFO] Axis server plugin ................................ SUCCESS [6.681s]
[INFO] Axis :: Simple server ............................. SUCCESS [4.541s]
[INFO] Castor support .................................... SUCCESS [36.266s]
[INFO] java.net HTTP Transport ........................... SUCCESS [18.718s]
[INFO] JMS support ....................................... SUCCESS [12.047s]
[INFO] Axis :: Integration tests ......................... FAILURE [31.009s]
[INFO] Axis :: WAR ....................................... SKIPPED
[INFO] Samples ........................................... SKIPPED
[INFO] Attachments Sample ................................ SKIPPED
[INFO] Bidbuy Sample ..................................... SKIPPED
[INFO] Echo Sample ....................................... SKIPPED
[INFO] Encoding Sample ................................... SKIPPED
[INFO] Faults Sample ..................................... SKIPPED
[INFO] Handler Sample .................................... SKIPPED
[INFO] JAXM Sample ....................................... SKIPPED
[INFO] Stock Quote Sample ................................ SKIPPED
[INFO] JAX-RPC Sample .................................... SKIPPED
[INFO] Message Sample .................................... SKIPPED
[INFO] Misc Sample ....................................... SKIPPED
[INFO] Transport Sample .................................. SKIPPED
[INFO] Proxy Sample ...................................... SKIPPED
[INFO] Distribution ...................................... SKIPPED
[INFO] ------------------------------------------------------------------------
[INFO] BUILD FAILURE
[INFO] ------------------------------------------------------------------------
[INFO] Total time: 4:33.754s
[INFO] Finished at: Fri Mar 09 10:05:16 GMT 2012
[INFO] Final Memory: 50M/221M
[INFO] ------------------------------------------------------------------------
Waiting for Jenkins to finish collecting data
mavenExecutionResult exceptions not empty
message : Failed to execute goal org.apache.axis:maven-axis-server-plugin:1.4.1-SNAPSHOT:start-server (start-server) on project integration: Failed to start server
cause : Failed to start server
Stack trace :
org.apache.maven.lifecycle.LifecycleExecutionException: Failed to execute goal org.apache.axis:maven-axis-server-plugin:1.4.1-SNAPSHOT:start-server (start-server) on project integration: Failed to start server
at org.apache.maven.lifecycle.internal.MojoExecutor.execute(MojoExecutor.java:213)
at org.apache.maven.lifecycle.internal.MojoExecutor.execute(MojoExecutor.java:153)
at org.apache.maven.lifecycle.internal.MojoExecutor.execute(MojoExecutor.java:145)
at org.apache.maven.lifecycle.internal.LifecycleModuleBuilder.buildProject(LifecycleModuleBuilder.java:84)
at org.apache.maven.lifecycle.internal.LifecycleModuleBuilder.buildProject(LifecycleModuleBuilder.java:59)
at org.apache.maven.lifecycle.internal.LifecycleStarter.singleThreadedBuild(LifecycleStarter.java:183)
at org.apache.maven.lifecycle.internal.LifecycleStarter.execute(LifecycleStarter.java:161)
at org.apache.maven.DefaultMaven.doExecute(DefaultMaven.java:319)
at org.apache.maven.DefaultMaven.execute(DefaultMaven.java:156)
at org.jvnet.hudson.maven3.launcher.Maven3Launcher.main(Maven3Launcher.java:79)
at sun.reflect.NativeMethodAccessorImpl.invoke0(Native Method)
at sun.reflect.NativeMethodAccessorImpl.invoke(NativeMethodAccessorImpl.java:39)
at sun.reflect.DelegatingMethodAccessorImpl.invoke(DelegatingMethodAccessorImpl.java:25)
at java.lang.reflect.Method.invoke(Method.java:592)
at org.codehaus.plexus.classworlds.launcher.Launcher.launchStandard(Launcher.java:329)
at org.codehaus.plexus.classworlds.launcher.Launcher.launch(Launcher.java:239)
at org.jvnet.hudson.maven3.agent.Maven3Main.launch(Maven3Main.java:158)
at hudson.maven.Maven3Builder.call(Maven3Builder.java:104)
at hudson.maven.Maven3Builder.call(Maven3Builder.java:70)
at hudson.remoting.UserRequest.perform(UserRequest.java:118)
at hudson.remoting.UserRequest.perform(UserRequest.java:48)
at hudson.remoting.Request$2.run(Request.java:287)
at hudson.remoting.InterceptingExecutorService$1.call(InterceptingExecutorService.java:72)
at java.util.concurrent.FutureTask$Sync.innerRun(FutureTask.java:269)
at java.util.concurrent.FutureTask.run(FutureTask.java:123)
at java.util.concurrent.ThreadPoolExecutor$Worker.runTask(ThreadPoolExecutor.java:651)
at java.util.concurrent.ThreadPoolExecutor$Worker.run(ThreadPoolExecutor.java:676)
at java.lang.Thread.run(Thread.java:595)
Caused by: org.apache.maven.plugin.MojoFailureException: Failed to start server
at org.apache.axis.maven.server.StartServerMojo.doExecute(StartServerMojo.java:206)
at org.apache.axis.maven.server.AbstractServerMojo.execute(AbstractServerMojo.java:56)
at org.apache.maven.plugin.DefaultBuildPluginManager.executeMojo(DefaultBuildPluginManager.java:101)
at org.apache.maven.lifecycle.internal.MojoExecutor.execute(MojoExecutor.java:209)
... 27 more
Caused by: org.apache.maven.plugin.MojoFailureException: Failed to start server
at org.apache.axis.maven.server.AbstractStartProcessMojo.startJavaProcess(AbstractStartProcessMojo.java:147)
at org.apache.axis.maven.server.StartServerMojo.doExecute(StartServerMojo.java:195)
... 30 more
Caused by: (0)null
at org.apache.axis.transport.http.HTTPSender.readFromSocket(HTTPSender.java:744)
at org.apache.axis.transport.http.HTTPSender.invoke(HTTPSender.java:144)
at org.apache.axis.strategies.InvocationStrategy.visit(InvocationStrategy.java:32)
at org.apache.axis.SimpleChain.doVisiting(SimpleChain.java:118)
at org.apache.axis.SimpleChain.invoke(SimpleChain.java:83)
at org.apache.axis.client.AxisClient.invoke(AxisClient.java:165)
at org.apache.axis.client.Call.invokeEngine(Call.java:2784)
at org.apache.axis.client.Call.invoke(Call.java:2767)
at org.apache.axis.client.Call.invoke(Call.java:2443)
at org.apache.axis.client.Call.invoke(Call.java:2366)
at org.apache.axis.client.Call.invoke(Call.java:1812)
at org.apache.axis.maven.server.AxisServerStartAction.execute(AxisServerStartAction.java:52)
at org.apache.axis.maven.server.DefaultProcessManager.startProcess(DefaultProcessManager.java:47)
at org.apache.axis.maven.server.AbstractStartProcessMojo.startJavaProcess(AbstractStartProcessMojo.java:140)
... 31 more
Sending e-mails to: java-dev@axis.apache.org
channel stopped
---------------------------------------------------------------------
To unsubscribe, e-mail: java-dev-unsubscribe@axis.apache.org
For additional commands, e-mail: java-dev-help@axis.apache.org
Jenkins build is back to normal : axis-trunk #117
Posted by Apache Jenkins Server <je...@builds.apache.org>.
See <https://builds.apache.org/job/axis-trunk/117/changes>
---------------------------------------------------------------------
To unsubscribe, e-mail: java-dev-unsubscribe@axis.apache.org
For additional commands, e-mail: java-dev-help@axis.apache.org
Build failed in Jenkins: axis-trunk #116
Posted by Apache Jenkins Server <je...@builds.apache.org>.
See <https://builds.apache.org/job/axis-trunk/116/changes>
Changes:
[veithen] Simplified site generation and implemented a workaround for DOXIA-373.
------------------------------------------
[...truncated 5189 lines...]
[INFO] [INFO] Copying 3 resources
[INFO] --- maven-resources-plugin:2.4.3:testResources (default-testResources) @ integration ---
[INFO]
[INFO] --- maven-compiler-plugin:2.3.2:testCompile (default-testCompile) @ integration ---
[INFO] Compiling 721 source files to <https://builds.apache.org/job/axis-trunk/ws/axis/integration/target/test-classes>
[INFO] [INFO] Tests are skipped.
[INFO] --- maven-surefire-plugin:2.11:test (default-test) @ integration ---
[INFO]
[INFO] --- maven-jar-plugin:2.3.2:jar (default-jar) @ integration ---
[INFO] Building jar: <https://builds.apache.org/job/axis-trunk/ws/axis/integration/target/integration-1.4.1-SNAPSHOT.jar>
[INFO]
[INFO] --- maven-assembly-plugin:2.2.2:single (source-release-assembly) @ integration ---
[INFO] Skipping the assembly in this project because it's not the Execution Root
[INFO]
[INFO] --- maven-antrun-plugin:1.7:run (default) @ integration ---
[INFO] Executing tasks
main:
[INFO] Executed tasks
[JENKINS] Archiving <https://builds.apache.org/job/axis-trunk/ws/axis/integration/pom.xml> to /home/hudson/hudson/jobs/axis-trunk/modules/org.apache.axis$integration/builds/2012-03-09_11-20-31/archive/org.apache.axis/integration/1.4.1-SNAPSHOT/integration-1.4.1-SNAPSHOT.pom
[JENKINS] Archiving <https://builds.apache.org/job/axis-trunk/ws/axis/integration/target/integration-1.4.1-SNAPSHOT.jar> to /home/hudson/hudson/jobs/axis-trunk/modules/org.apache.axis$integration/builds/2012-03-09_11-20-31/archive/org.apache.axis/integration/1.4.1-SNAPSHOT/integration-1.4.1-SNAPSHOT.jar
Mar 9, 2012 11:23:45 AM hudson.maven.ExecutedMojo <init>
WARNING: Failed to getClass for org.apache.maven.plugin.source.SourceJarMojo
[INFO]
[INFO] --- maven-source-plugin:2.1.2:jar (attach-sources) @ integration ---
[INFO] test already added, skipping
[INFO] test/wsdl already added, skipping
[INFO] test/wsdl/arrays3 already added, skipping
[INFO] test/wsdl/arrays3/Address.java already added, skipping
[INFO] test/wsdl/arrays3/Phone.java already added, skipping
[INFO] test/wsdl/arrays3/StateType.java already added, skipping
[INFO] META-INF already added, skipping
[INFO] META-INF/DEPENDENCIES already added, skipping
[INFO] META-INF/NOTICE already added, skipping
[INFO] META-INF/LICENSE already added, skipping
[INFO] Building jar: <https://builds.apache.org/job/axis-trunk/ws/axis/integration/target/integration-1.4.1-SNAPSHOT-sources.jar>
[INFO] test already added, skipping
[INFO] test/wsdl already added, skipping
[INFO] test/wsdl/arrays3 already added, skipping
[INFO] test/wsdl/arrays3/Address.java already added, skipping
[INFO] test/wsdl/arrays3/Phone.java already added, skipping
[INFO] test/wsdl/arrays3/StateType.java already added, skipping
[INFO] META-INF already added, skipping
[INFO] META-INF/DEPENDENCIES already added, skipping
[INFO] META-INF/NOTICE already added, skipping
[INFO] META-INF/LICENSE already added, skipping
[INFO]
[INFO] --- maven-javadoc-plugin:2.5:jar (attach-javadocs) @ integration ---
Loading source files for package test.wsdl.map...
Loading source files for package test.wsdl.document...
Loading source files for package test.wsdl.anytype...
Loading source files for package test.wsdl.gateway...
Loading source files for package test.wsdl.arrays3...
Constructing Javadoc information...
Standard Doclet version 1.5.0_22
Building tree for all the packages and classes...
Generating <https://builds.apache.org/job/axis-trunk/ws/axis/integration/target/apidocs/test/wsdl/map//MapService.html...>
Generating <https://builds.apache.org/job/axis-trunk/ws/axis/integration/target/apidocs/test/wsdl/document//TestService.html...>
Generating <https://builds.apache.org/job/axis-trunk/ws/axis/integration/target/apidocs/test/wsdl/anytype//AnyService.html...>
Generating <https://builds.apache.org/job/axis-trunk/ws/axis/integration/target/apidocs/test/wsdl/gateway//Gateway.html...>
Generating <https://builds.apache.org/job/axis-trunk/ws/axis/integration/target/apidocs/test/wsdl/gateway//MyClass.html...>
Generating <https://builds.apache.org/job/axis-trunk/ws/axis/integration/target/apidocs/test/wsdl/gateway//OutClass.html...>
Generating <https://builds.apache.org/job/axis-trunk/ws/axis/integration/target/apidocs/test/wsdl/arrays3//AddrBookService.html...>
Generating <https://builds.apache.org/job/axis-trunk/ws/axis/integration/target/apidocs/test/wsdl/arrays3//AddrBookServiceImpl.html...>
Generating <https://builds.apache.org/job/axis-trunk/ws/axis/integration/target/apidocs/test/wsdl/arrays3//Address.html...>
Generating <https://builds.apache.org/job/axis-trunk/ws/axis/integration/target/apidocs/test/wsdl/arrays3//Address_Helper.html...>
Generating <https://builds.apache.org/job/axis-trunk/ws/axis/integration/target/apidocs/test/wsdl/arrays3//AddressBookImpl.html...>
Generating <https://builds.apache.org/job/axis-trunk/ws/axis/integration/target/apidocs/test/wsdl/arrays3//Phone.html...>
Generating <https://builds.apache.org/job/axis-trunk/ws/axis/integration/target/apidocs/test/wsdl/arrays3//Phone_Helper.html...>
Generating <https://builds.apache.org/job/axis-trunk/ws/axis/integration/target/apidocs/test/wsdl/arrays3//StateType.html...>
Generating <https://builds.apache.org/job/axis-trunk/ws/axis/integration/target/apidocs/test/wsdl/arrays3//StateType_Helper.html...>
Generating <https://builds.apache.org/job/axis-trunk/ws/axis/integration/target/apidocs/overview-frame.html...>
Generating <https://builds.apache.org/job/axis-trunk/ws/axis/integration/target/apidocs/test/wsdl/anytype//package-frame.html...>
Generating <https://builds.apache.org/job/axis-trunk/ws/axis/integration/target/apidocs/test/wsdl/anytype//package-summary.html...>
Generating <https://builds.apache.org/job/axis-trunk/ws/axis/integration/target/apidocs/test/wsdl/anytype//package-tree.html...>
Generating <https://builds.apache.org/job/axis-trunk/ws/axis/integration/target/apidocs/test/wsdl/arrays3//package-frame.html...>
Generating <https://builds.apache.org/job/axis-trunk/ws/axis/integration/target/apidocs/test/wsdl/arrays3//package-summary.html...>
Generating <https://builds.apache.org/job/axis-trunk/ws/axis/integration/target/apidocs/test/wsdl/arrays3//package-tree.html...>
Generating <https://builds.apache.org/job/axis-trunk/ws/axis/integration/target/apidocs/test/wsdl/document//package-frame.html...>
Generating <https://builds.apache.org/job/axis-trunk/ws/axis/integration/target/apidocs/test/wsdl/document//package-summary.html...>
Generating <https://builds.apache.org/job/axis-trunk/ws/axis/integration/target/apidocs/test/wsdl/document//package-tree.html...>
Generating <https://builds.apache.org/job/axis-trunk/ws/axis/integration/target/apidocs/test/wsdl/gateway//package-frame.html...>
Generating <https://builds.apache.org/job/axis-trunk/ws/axis/integration/target/apidocs/test/wsdl/gateway//package-summary.html...>
Generating <https://builds.apache.org/job/axis-trunk/ws/axis/integration/target/apidocs/test/wsdl/gateway//package-tree.html...>
Generating <https://builds.apache.org/job/axis-trunk/ws/axis/integration/target/apidocs/test/wsdl/map//package-frame.html...>
Generating <https://builds.apache.org/job/axis-trunk/ws/axis/integration/target/apidocs/test/wsdl/map//package-summary.html...>
Generating <https://builds.apache.org/job/axis-trunk/ws/axis/integration/target/apidocs/test/wsdl/map//package-tree.html...>
Generating <https://builds.apache.org/job/axis-trunk/ws/axis/integration/target/apidocs/constant-values.html...>
Generating <https://builds.apache.org/job/axis-trunk/ws/axis/integration/target/apidocs/serialized-form.html...>
Generating <https://builds.apache.org/job/axis-trunk/ws/axis/integration/target/apidocs/test/wsdl/map/class-use//MapService.html...>
Generating <https://builds.apache.org/job/axis-trunk/ws/axis/integration/target/apidocs/test/wsdl/document/class-use//TestService.html...>
Generating <https://builds.apache.org/job/axis-trunk/ws/axis/integration/target/apidocs/test/wsdl/anytype/class-use//AnyService.html...>
Generating <https://builds.apache.org/job/axis-trunk/ws/axis/integration/target/apidocs/test/wsdl/gateway/class-use//MyClass.html...>
Generating <https://builds.apache.org/job/axis-trunk/ws/axis/integration/target/apidocs/test/wsdl/gateway/class-use//Gateway.html...>
Generating <https://builds.apache.org/job/axis-trunk/ws/axis/integration/target/apidocs/test/wsdl/gateway/class-use//OutClass.html...>
Generating <https://builds.apache.org/job/axis-trunk/ws/axis/integration/target/apidocs/test/wsdl/arrays3/class-use//Address_Helper.html...>
Generating <https://builds.apache.org/job/axis-trunk/ws/axis/integration/target/apidocs/test/wsdl/arrays3/class-use//StateType_Helper.html...>
Generating <https://builds.apache.org/job/axis-trunk/ws/axis/integration/target/apidocs/test/wsdl/arrays3/class-use//Phone_Helper.html...>
Generating <https://builds.apache.org/job/axis-trunk/ws/axis/integration/target/apidocs/test/wsdl/arrays3/class-use//Address.html...>
Generating <https://builds.apache.org/job/axis-trunk/ws/axis/integration/target/apidocs/test/wsdl/arrays3/class-use//Phone.html...>
Generating <https://builds.apache.org/job/axis-trunk/ws/axis/integration/target/apidocs/test/wsdl/arrays3/class-use//AddressBookImpl.html...>
Generating <https://builds.apache.org/job/axis-trunk/ws/axis/integration/target/apidocs/test/wsdl/arrays3/class-use//StateType.html...>
Generating <https://builds.apache.org/job/axis-trunk/ws/axis/integration/target/apidocs/test/wsdl/arrays3/class-use//AddrBookServiceImpl.html...>
Generating <https://builds.apache.org/job/axis-trunk/ws/axis/integration/target/apidocs/test/wsdl/arrays3/class-use//AddrBookService.html...>
Generating <https://builds.apache.org/job/axis-trunk/ws/axis/integration/target/apidocs/test/wsdl/anytype//package-use.html...>
Generating <https://builds.apache.org/job/axis-trunk/ws/axis/integration/target/apidocs/test/wsdl/arrays3//package-use.html...>
Generating <https://builds.apache.org/job/axis-trunk/ws/axis/integration/target/apidocs/test/wsdl/document//package-use.html...>
Generating <https://builds.apache.org/job/axis-trunk/ws/axis/integration/target/apidocs/test/wsdl/gateway//package-use.html...>
Generating <https://builds.apache.org/job/axis-trunk/ws/axis/integration/target/apidocs/test/wsdl/map//package-use.html...>
Building index for all the packages and classes...
Generating <https://builds.apache.org/job/axis-trunk/ws/axis/integration/target/apidocs/overview-tree.html...>
Generating <https://builds.apache.org/job/axis-trunk/ws/axis/integration/target/apidocs/index-all.html...>
Generating <https://builds.apache.org/job/axis-trunk/ws/axis/integration/target/apidocs/deprecated-list.html...>
Building index for all classes...
Generating <https://builds.apache.org/job/axis-trunk/ws/axis/integration/target/apidocs/allclasses-frame.html...>
Generating <https://builds.apache.org/job/axis-trunk/ws/axis/integration/target/apidocs/allclasses-noframe.html...>
Generating <https://builds.apache.org/job/axis-trunk/ws/axis/integration/target/apidocs/index.html...>
Generating <https://builds.apache.org/job/axis-trunk/ws/axis/integration/target/apidocs/overview-summary.html...>
Generating <https://builds.apache.org/job/axis-trunk/ws/axis/integration/target/apidocs/help-doc.html...>
Generating <https://builds.apache.org/job/axis-trunk/ws/axis/integration/target/apidocs/stylesheet.css...>
[INFO] Building jar: <https://builds.apache.org/job/axis-trunk/ws/axis/integration/target/integration-1.4.1-SNAPSHOT-javadoc.jar>
[INFO]
[INFO] --- maven-axis-server-plugin:1.4.1-SNAPSHOT:start-server (start-server) @ integration ---
2012-03-09 11:23:47.956:INFO::Logging to STDERR via org.mortbay.log.StdErrLog
2012-03-09 11:23:48.091:INFO::jetty-6.1.26
2012-03-09 11:23:48.122:WARN::failed SocketConnector@0.0.0.0:8080: java.net.BindException: Address already in use
2012-03-09 11:23:48.123:WARN::failed Server@1d332b: java.net.BindException: Address already in use
Exception in thread "main" java.net.BindException: Address already in use
at java.net.PlainSocketImpl.socketBind(Native Method)
at java.net.PlainSocketImpl.bind(PlainSocketImpl.java:359)
at java.net.ServerSocket.bind(ServerSocket.java:319)
at java.net.ServerSocket.<init>(ServerSocket.java:185)
at java.net.ServerSocket.<init>(ServerSocket.java:141)
at org.mortbay.jetty.bio.SocketConnector.newServerSocket(SocketConnector.java:80)
at org.mortbay.jetty.bio.SocketConnector.open(SocketConnector.java:73)
at org.mortbay.jetty.AbstractConnector.doStart(AbstractConnector.java:283)
at org.mortbay.jetty.bio.SocketConnector.doStart(SocketConnector.java:147)
at org.mortbay.component.AbstractLifeCycle.start(AbstractLifeCycle.java:50)
at org.mortbay.jetty.Server.doStart(Server.java:235)
at org.mortbay.component.AbstractLifeCycle.start(AbstractLifeCycle.java:50)
at org.apache.axis.server.standalone.StandaloneAxisServer.main(StandaloneAxisServer.java:135)
[JENKINS] Archiving <https://builds.apache.org/job/axis-trunk/ws/axis/integration/target/integration-1.4.1-SNAPSHOT-sources.jar> to /home/hudson/hudson/jobs/axis-trunk/modules/org.apache.axis$integration/builds/2012-03-09_11-20-31/archive/org.apache.axis/integration/1.4.1-SNAPSHOT/integration-1.4.1-SNAPSHOT-sources.jar
[JENKINS] Archiving <https://builds.apache.org/job/axis-trunk/ws/axis/integration/target/integration-1.4.1-SNAPSHOT-javadoc.jar> to /home/hudson/hudson/jobs/axis-trunk/modules/org.apache.axis$integration/builds/2012-03-09_11-20-31/archive/org.apache.axis/integration/1.4.1-SNAPSHOT/integration-1.4.1-SNAPSHOT-javadoc.jar
[INFO] ------------------------------------------------------------------------
[INFO] Reactor Summary:
[INFO]
[INFO] Axis .............................................. SUCCESS [23.341s]
[INFO] Axis :: SAAJ ...................................... SUCCESS [5.197s]
[INFO] Axis :: JAX-RPC ................................... SUCCESS [5.045s]
[INFO] Axis :: Core ...................................... SUCCESS [1:02.462s]
[INFO] Ant tasks ......................................... SUCCESS [11.462s]
[INFO] Maven plugins ..................................... SUCCESS [1.262s]
[INFO] Maven plugin common classes ....................... SUCCESS [3.367s]
[INFO] wsdl2java plugin .................................. SUCCESS [7.456s]
[INFO] java2wsdl plugin .................................. SUCCESS [6.098s]
[INFO] Axis server plugin ................................ SUCCESS [7.257s]
[INFO] Axis :: Simple server ............................. SUCCESS [4.262s]
[INFO] Castor support .................................... SUCCESS [9.072s]
[INFO] java.net HTTP Transport ........................... SUCCESS [15.669s]
[INFO] JMS support ....................................... SUCCESS [9.015s]
[INFO] Axis :: Integration tests ......................... FAILURE [31.530s]
[INFO] Axis :: WAR ....................................... SKIPPED
[INFO] Samples ........................................... SKIPPED
[INFO] Attachments Sample ................................ SKIPPED
[INFO] Bidbuy Sample ..................................... SKIPPED
[INFO] Echo Sample ....................................... SKIPPED
[INFO] Encoding Sample ................................... SKIPPED
[INFO] Faults Sample ..................................... SKIPPED
[INFO] Handler Sample .................................... SKIPPED
[INFO] JAXM Sample ....................................... SKIPPED
[INFO] Stock Quote Sample ................................ SKIPPED
[INFO] JAX-RPC Sample .................................... SKIPPED
[INFO] Message Sample .................................... SKIPPED
[INFO] Misc Sample ....................................... SKIPPED
[INFO] Transport Sample .................................. SKIPPED
[INFO] Proxy Sample ...................................... SKIPPED
[INFO] Distribution ...................................... SKIPPED
[INFO] ------------------------------------------------------------------------
[INFO] BUILD FAILURE
[INFO] ------------------------------------------------------------------------
[INFO] Total time: 3:33.318s
[INFO] Finished at: Fri Mar 09 11:24:08 GMT 2012
[INFO] Final Memory: 57M/223M
[INFO] ------------------------------------------------------------------------
Waiting for Jenkins to finish collecting data
mavenExecutionResult exceptions not empty
message : Failed to execute goal org.apache.axis:maven-axis-server-plugin:1.4.1-SNAPSHOT:start-server (start-server) on project integration: Failed to start server
cause : Failed to start server
Stack trace :
org.apache.maven.lifecycle.LifecycleExecutionException: Failed to execute goal org.apache.axis:maven-axis-server-plugin:1.4.1-SNAPSHOT:start-server (start-server) on project integration: Failed to start server
at org.apache.maven.lifecycle.internal.MojoExecutor.execute(MojoExecutor.java:213)
at org.apache.maven.lifecycle.internal.MojoExecutor.execute(MojoExecutor.java:153)
at org.apache.maven.lifecycle.internal.MojoExecutor.execute(MojoExecutor.java:145)
at org.apache.maven.lifecycle.internal.LifecycleModuleBuilder.buildProject(LifecycleModuleBuilder.java:84)
at org.apache.maven.lifecycle.internal.LifecycleModuleBuilder.buildProject(LifecycleModuleBuilder.java:59)
at org.apache.maven.lifecycle.internal.LifecycleStarter.singleThreadedBuild(LifecycleStarter.java:183)
at org.apache.maven.lifecycle.internal.LifecycleStarter.execute(LifecycleStarter.java:161)
at org.apache.maven.DefaultMaven.doExecute(DefaultMaven.java:319)
at org.apache.maven.DefaultMaven.execute(DefaultMaven.java:156)
at org.jvnet.hudson.maven3.launcher.Maven3Launcher.main(Maven3Launcher.java:79)
at sun.reflect.NativeMethodAccessorImpl.invoke0(Native Method)
at sun.reflect.NativeMethodAccessorImpl.invoke(NativeMethodAccessorImpl.java:39)
at sun.reflect.DelegatingMethodAccessorImpl.invoke(DelegatingMethodAccessorImpl.java:25)
at java.lang.reflect.Method.invoke(Method.java:592)
at org.codehaus.plexus.classworlds.launcher.Launcher.launchStandard(Launcher.java:329)
at org.codehaus.plexus.classworlds.launcher.Launcher.launch(Launcher.java:239)
at org.jvnet.hudson.maven3.agent.Maven3Main.launch(Maven3Main.java:158)
at hudson.maven.Maven3Builder.call(Maven3Builder.java:104)
at hudson.maven.Maven3Builder.call(Maven3Builder.java:70)
at hudson.remoting.UserRequest.perform(UserRequest.java:118)
at hudson.remoting.UserRequest.perform(UserRequest.java:48)
at hudson.remoting.Request$2.run(Request.java:287)
at hudson.remoting.InterceptingExecutorService$1.call(InterceptingExecutorService.java:72)
at java.util.concurrent.FutureTask$Sync.innerRun(FutureTask.java:269)
at java.util.concurrent.FutureTask.run(FutureTask.java:123)
at java.util.concurrent.ThreadPoolExecutor$Worker.runTask(ThreadPoolExecutor.java:651)
at java.util.concurrent.ThreadPoolExecutor$Worker.run(ThreadPoolExecutor.java:676)
at java.lang.Thread.run(Thread.java:595)
Caused by: org.apache.maven.plugin.MojoFailureException: Failed to start server
at org.apache.axis.maven.server.StartServerMojo.doExecute(StartServerMojo.java:206)
at org.apache.axis.maven.server.AbstractServerMojo.execute(AbstractServerMojo.java:56)
at org.apache.maven.plugin.DefaultBuildPluginManager.executeMojo(DefaultBuildPluginManager.java:101)
at org.apache.maven.lifecycle.internal.MojoExecutor.execute(MojoExecutor.java:209)
... 27 more
Caused by: org.apache.maven.plugin.MojoFailureException: Failed to start server
at org.apache.axis.maven.server.AbstractStartProcessMojo.startJavaProcess(AbstractStartProcessMojo.java:147)
at org.apache.axis.maven.server.StartServerMojo.doExecute(StartServerMojo.java:195)
... 30 more
Caused by: (0)null
at org.apache.axis.transport.http.HTTPSender.readFromSocket(HTTPSender.java:744)
at org.apache.axis.transport.http.HTTPSender.invoke(HTTPSender.java:144)
at org.apache.axis.strategies.InvocationStrategy.visit(InvocationStrategy.java:32)
at org.apache.axis.SimpleChain.doVisiting(SimpleChain.java:118)
at org.apache.axis.SimpleChain.invoke(SimpleChain.java:83)
at org.apache.axis.client.AxisClient.invoke(AxisClient.java:165)
at org.apache.axis.client.Call.invokeEngine(Call.java:2784)
at org.apache.axis.client.Call.invoke(Call.java:2767)
at org.apache.axis.client.Call.invoke(Call.java:2443)
at org.apache.axis.client.Call.invoke(Call.java:2366)
at org.apache.axis.client.Call.invoke(Call.java:1812)
at org.apache.axis.maven.server.AxisServerStartAction.execute(AxisServerStartAction.java:52)
at org.apache.axis.maven.server.DefaultProcessManager.startProcess(DefaultProcessManager.java:47)
at org.apache.axis.maven.server.AbstractStartProcessMojo.startJavaProcess(AbstractStartProcessMojo.java:140)
... 31 more
Sending e-mails to: java-dev@axis.apache.org andreas.veithen@gmail.com
Sending e-mails to: java-dev@axis.apache.org
channel stopped
---------------------------------------------------------------------
To unsubscribe, e-mail: java-dev-unsubscribe@axis.apache.org
For additional commands, e-mail: java-dev-help@axis.apache.org
Build failed in Jenkins: axis-trunk #115
Posted by Apache Jenkins Server <je...@builds.apache.org>.
See <https://builds.apache.org/job/axis-trunk/115/changes>
Changes:
[veithen] Added a file that was missing in r1298772.
------------------------------------------
[...truncated 4672 lines...]
[INFO] org/apache already added, skipping
[INFO] org/apache/axis already added, skipping
[INFO] org/apache/axis/transport already added, skipping
[INFO] org/apache/axis/transport/http already added, skipping
[INFO] org/apache/axis/transport/http/javanet already added, skipping
[INFO] META-INF already added, skipping
[INFO] META-INF/DEPENDENCIES already added, skipping
[INFO] META-INF/NOTICE already added, skipping
[INFO] META-INF/LICENSE already added, skipping
[INFO] Building jar: <https://builds.apache.org/job/axis-trunk/ws/axis/axis-rt-transports-http-javanet/target/axis-rt-transports-http-javanet-1.4.1-SNAPSHOT-sources.jar>
[INFO] org already added, skipping
[INFO] org/apache already added, skipping
[INFO] org/apache/axis already added, skipping
[INFO] org/apache/axis/transport already added, skipping
[INFO] org/apache/axis/transport/http already added, skipping
[INFO] org/apache/axis/transport/http/javanet already added, skipping
[INFO] META-INF already added, skipping
[INFO] META-INF/DEPENDENCIES already added, skipping
[INFO] META-INF/NOTICE already added, skipping
[INFO] META-INF/LICENSE already added, skipping
[INFO]
[INFO] --- maven-javadoc-plugin:2.5:jar (attach-javadocs) @ axis-rt-transports-http-javanet ---
Loading source files for package org.apache.axis.transport.http.javanet...
Constructing Javadoc information...
Standard Doclet version 1.5.0_22
Building tree for all the packages and classes...
Generating <https://builds.apache.org/job/axis-trunk/ws/axis/axis-rt-transports-http-javanet/target/apidocs/org/apache/axis/transport/http/javanet//JavaNetHTTPSender.html...>
Generating <https://builds.apache.org/job/axis-trunk/ws/axis/axis-rt-transports-http-javanet/target/apidocs/org/apache/axis/transport/http/javanet//Messages.html...>
Generating <https://builds.apache.org/job/axis-trunk/ws/axis/axis-rt-transports-http-javanet/target/apidocs/org/apache/axis/transport/http/javanet//package-frame.html...>
Generating <https://builds.apache.org/job/axis-trunk/ws/axis/axis-rt-transports-http-javanet/target/apidocs/org/apache/axis/transport/http/javanet//package-summary.html...>
Generating <https://builds.apache.org/job/axis-trunk/ws/axis/axis-rt-transports-http-javanet/target/apidocs/org/apache/axis/transport/http/javanet//package-tree.html...>
Generating <https://builds.apache.org/job/axis-trunk/ws/axis/axis-rt-transports-http-javanet/target/apidocs/constant-values.html...>
Generating <https://builds.apache.org/job/axis-trunk/ws/axis/axis-rt-transports-http-javanet/target/apidocs/serialized-form.html...>
Generating <https://builds.apache.org/job/axis-trunk/ws/axis/axis-rt-transports-http-javanet/target/apidocs/org/apache/axis/transport/http/javanet/class-use//Messages.html...>
Generating <https://builds.apache.org/job/axis-trunk/ws/axis/axis-rt-transports-http-javanet/target/apidocs/org/apache/axis/transport/http/javanet/class-use//JavaNetHTTPSender.html...>
Generating <https://builds.apache.org/job/axis-trunk/ws/axis/axis-rt-transports-http-javanet/target/apidocs/org/apache/axis/transport/http/javanet//package-use.html...>
Building index for all the packages and classes...
Generating <https://builds.apache.org/job/axis-trunk/ws/axis/axis-rt-transports-http-javanet/target/apidocs/overview-tree.html...>
Generating <https://builds.apache.org/job/axis-trunk/ws/axis/axis-rt-transports-http-javanet/target/apidocs/index-all.html...>
Generating <https://builds.apache.org/job/axis-trunk/ws/axis/axis-rt-transports-http-javanet/target/apidocs/deprecated-list.html...>
Building index for all classes...
Generating <https://builds.apache.org/job/axis-trunk/ws/axis/axis-rt-transports-http-javanet/target/apidocs/allclasses-frame.html...>
Generating <https://builds.apache.org/job/axis-trunk/ws/axis/axis-rt-transports-http-javanet/target/apidocs/allclasses-noframe.html...>
Generating <https://builds.apache.org/job/axis-trunk/ws/axis/axis-rt-transports-http-javanet/target/apidocs/index.html...>
Generating <https://builds.apache.org/job/axis-trunk/ws/axis/axis-rt-transports-http-javanet/target/apidocs/help-doc.html...>
Generating <https://builds.apache.org/job/axis-trunk/ws/axis/axis-rt-transports-http-javanet/target/apidocs/stylesheet.css...>
[INFO] Building jar: <https://builds.apache.org/job/axis-trunk/ws/axis/axis-rt-transports-http-javanet/target/axis-rt-transports-http-javanet-1.4.1-SNAPSHOT-javadoc.jar>
[INFO]
[INFO] --- build-helper-maven-plugin:1.7:reserve-network-port (reserve-network-port) @ axis-rt-transports-http-javanet ---
[INFO] Reserved port 57937 for testPort
[INFO]
[INFO] --- maven-axis-server-plugin:1.4.1-SNAPSHOT:start-server (start-server) @ axis-rt-transports-http-javanet ---
2012-03-09 11:04:56.341:INFO::Logging to STDERR via org.mortbay.log.StdErrLog
2012-03-09 11:04:56.426:INFO::jetty-6.1.26
2012-03-09 11:04:56.457:INFO::Started SocketConnector@0.0.0.0:57937
Mar 9, 2012 11:04:56 AM org.apache.axis.configuration.EngineConfigurationFactoryServlet getServerEngineConfig
SEVERE: Unable to find config file. Creating new servlet engine config file: /WEB-INF/server-config.wsdd
[INFO] Server ready on port 57937: Apache Axis version: 1.4.1-SNAPSHOT Built on Mar 09, 2012 (11:02:35 GMT)
[INFO] Processed <https://builds.apache.org/job/axis-trunk/ws/axis/axis-rt-transports-http-javanet/target/work/org/apache/axis/transport/http/javanet/deploy.wsdd>
[INFO]
[INFO] --- maven-failsafe-plugin:2.11:integration-test (default) @ axis-rt-transports-http-javanet ---
[INFO] Failsafe report directory: <https://builds.apache.org/job/axis-trunk/ws/axis/axis-rt-transports-http-javanet/target/failsafe-reports>
-------------------------------------------------------
T E S T S
-------------------------------------------------------
Running org.apache.axis.transport.http.javanet.TestSOAPService
Tests run: 2, Failures: 0, Errors: 0, Skipped: 0, Time elapsed: 0.442 sec
Running org.apache.axis.transport.http.javanet.TestErrors
Tests run: 1, Failures: 0, Errors: 0, Skipped: 0, Time elapsed: 0.002 sec
Results :
Tests run: 3, Failures: 0, Errors: 0, Skipped: 0
[WARNING] File encoding has not been set, using platform encoding ANSI_X3.4-1968, i.e. build is platform dependent!
[JENKINS] Recording test results
[INFO]
[INFO] --- maven-axis-server-plugin:1.4.1-SNAPSHOT:stop-all (stop-server) @ axis-rt-transports-http-javanet ---
Mar 9, 2012 11:04:58 AM org.apache.axis.utils.Admin processWSDD
SEVERE: Administration service requested to quit, quitting.
2012-03-09 11:04:58.286:INFO::Graceful shutdown SocketConnector@0.0.0.0:57937
2012-03-09 11:04:58.286:INFO::Graceful shutdown org.mortbay.jetty.servlet.Context@94af2f{/axis,file:/x1/jenkins/jenkins-slave/workspace/axis-trunk/axis/axis-rt-transports-http-javanet/target/axis-server/57937/;}
2012-03-09 11:04:59.286:INFO::Stopped SocketConnector@0.0.0.0:57937
[INFO] Server on port 57937 stopped
[INFO]
[INFO] --- maven-gpg-plugin:1.1:sign (default) @ axis-rt-transports-http-javanet ---
[INFO] Failsafe report directory: <https://builds.apache.org/job/axis-trunk/ws/axis/axis-rt-transports-http-javanet/target/failsafe-reports>
[WARNING] File encoding has not been set, using platform encoding ANSI_X3.4-1968, i.e. build is platform dependent!
[INFO]
[INFO] --- maven-failsafe-plugin:2.11:verify (default) @ axis-rt-transports-http-javanet ---
[INFO] [INFO] Installing <https://builds.apache.org/job/axis-trunk/ws/axis/axis-rt-transports-http-javanet/target/axis-rt-transports-http-javanet-1.4.1-SNAPSHOT.jar> to /home/jenkins/jenkins-slave/maven-repositories/1/org/apache/axis/axis-rt-transports-http-javanet/1.4.1-SNAPSHOT/axis-rt-transports-http-javanet-1.4.1-SNAPSHOT.jar
[INFO] Installing <https://builds.apache.org/job/axis-trunk/ws/axis/axis-rt-transports-http-javanet/pom.xml> to /home/jenkins/jenkins-slave/maven-repositories/1/org/apache/axis/axis-rt-transports-http-javanet/1.4.1-SNAPSHOT/axis-rt-transports-http-javanet-1.4.1-SNAPSHOT.pom
[INFO] [INFO] Installing <https://builds.apache.org/job/axis-trunk/ws/axis/axis-rt-transports-http-javanet/target/axis-rt-transports-http-javanet-1.4.1-SNAPSHOT-sources.jar> to /home/jenkins/jenkins-slave/maven-repositories/1/org/apache/axis/axis-rt-transports-http-javanet/1.4.1-SNAPSHOT/axis-rt-transports-http-javanet-1.4.1-SNAPSHOT-sources.jar
--- maven-install-plugin:2.3.1:install (default-install) @ axis-rt-transports-http-javanet ---
[INFO] Installing <https://builds.apache.org/job/axis-trunk/ws/axis/axis-rt-transports-http-javanet/target/axis-rt-transports-http-javanet-1.4.1-SNAPSHOT-javadoc.jar> to /home/jenkins/jenkins-slave/maven-repositories/1/org/apache/axis/axis-rt-transports-http-javanet/1.4.1-SNAPSHOT/axis-rt-transports-http-javanet-1.4.1-SNAPSHOT-javadoc.jar
[INFO] Downloading: https://repository.apache.org/content/repositories/snapshots/org/apache/axis/axis-rt-transports-http-javanet/1.4.1-SNAPSHOT/maven-metadata.xml
[INFO] --- maven-deploy-plugin:2.5:deploy (default-deploy) @ axis-rt-transports-http-javanet ---
Downloaded: https://repository.apache.org/content/repositories/snapshots/org/apache/axis/axis-rt-transports-http-javanet/1.4.1-SNAPSHOT/maven-metadata.xml (2 KB at 22.6 KB/sec)
Uploading: https://repository.apache.org/content/repositories/snapshots/org/apache/axis/axis-rt-transports-http-javanet/1.4.1-SNAPSHOT/axis-rt-transports-http-javanet-1.4.1-20120309.110459-3.jar
Uploaded: https://repository.apache.org/content/repositories/snapshots/org/apache/axis/axis-rt-transports-http-javanet/1.4.1-SNAPSHOT/axis-rt-transports-http-javanet-1.4.1-20120309.110459-3.jar (15 KB at 173.5 KB/sec)
Uploading: https://repository.apache.org/content/repositories/snapshots/org/apache/axis/axis-rt-transports-http-javanet/1.4.1-SNAPSHOT/axis-rt-transports-http-javanet-1.4.1-20120309.110459-3.pom
Uploaded: https://repository.apache.org/content/repositories/snapshots/org/apache/axis/axis-rt-transports-http-javanet/1.4.1-SNAPSHOT/axis-rt-transports-http-javanet-1.4.1-20120309.110459-3.pom (8 KB at 98.9 KB/sec)
Downloading: https://repository.apache.org/content/repositories/snapshots/org/apache/axis/axis-rt-transports-http-javanet/maven-metadata.xml
Downloaded: https://repository.apache.org/content/repositories/snapshots/org/apache/axis/axis-rt-transports-http-javanet/maven-metadata.xml (306 B at 13.0 KB/sec)
Uploading: https://repository.apache.org/content/repositories/snapshots/org/apache/axis/axis-rt-transports-http-javanet/1.4.1-SNAPSHOT/maven-metadata.xml
Uploaded: https://repository.apache.org/content/repositories/snapshots/org/apache/axis/axis-rt-transports-http-javanet/1.4.1-SNAPSHOT/maven-metadata.xml (2 KB at 11.0 KB/sec)
Uploading: https://repository.apache.org/content/repositories/snapshots/org/apache/axis/axis-rt-transports-http-javanet/maven-metadata.xml
Uploaded: https://repository.apache.org/content/repositories/snapshots/org/apache/axis/axis-rt-transports-http-javanet/maven-metadata.xml (306 B at 4.0 KB/sec)
Uploading: https://repository.apache.org/content/repositories/snapshots/org/apache/axis/axis-rt-transports-http-javanet/1.4.1-SNAPSHOT/axis-rt-transports-http-javanet-1.4.1-20120309.110459-3-sources.jar
Uploaded: https://repository.apache.org/content/repositories/snapshots/org/apache/axis/axis-rt-transports-http-javanet/1.4.1-SNAPSHOT/axis-rt-transports-http-javanet-1.4.1-20120309.110459-3-sources.jar (11 KB at 120.8 KB/sec)
Uploading: https://repository.apache.org/content/repositories/snapshots/org/apache/axis/axis-rt-transports-http-javanet/1.4.1-SNAPSHOT/maven-metadata.xml
Uploaded: https://repository.apache.org/content/repositories/snapshots/org/apache/axis/axis-rt-transports-http-javanet/1.4.1-SNAPSHOT/maven-metadata.xml (2 KB at 18.4 KB/sec)
Uploading: https://repository.apache.org/content/repositories/snapshots/org/apache/axis/axis-rt-transports-http-javanet/1.4.1-SNAPSHOT/axis-rt-transports-http-javanet-1.4.1-20120309.110459-3-javadoc.jar
Uploaded: https://repository.apache.org/content/repositories/snapshots/org/apache/axis/axis-rt-transports-http-javanet/1.4.1-SNAPSHOT/axis-rt-transports-http-javanet-1.4.1-20120309.110459-3-javadoc.jar (34 KB at 412.2 KB/sec)
Uploading: https://repository.apache.org/content/repositories/snapshots/org/apache/axis/axis-rt-transports-http-javanet/1.4.1-SNAPSHOT/maven-metadata.xml
Uploaded: https://repository.apache.org/content/repositories/snapshots/org/apache/axis/axis-rt-transports-http-javanet/1.4.1-SNAPSHOT/maven-metadata.xml (2 KB at 26.6 KB/sec)
[INFO]
[INFO] --- maven-site-plugin:3.0:site (default-site) @ axis-rt-transports-http-javanet ---[INFO] configuring report plugin org.apache.maven.plugins:maven-project-info-reports-plugin:2.4
[INFO] Parent project loaded from repository: org.apache:apache:pom:9
[INFO] Relativizing decoration links with respect to project URL: http://axis.apache.org/axis/java/axis-rt-transports-http-javanet/
[INFO] Rendering site with org.apache.maven.skins:maven-fluido-skin:jar:1.0 skin.
[INFO] Skipped "About" report, file "index.html" already exists for the English version.
[JENKINS] Archiving site from <https://builds.apache.org/job/axis-trunk/ws/axis/axis-rt-transports-http-javanet/target/site> to /home/hudson/hudson/jobs/axis-trunk/site/axis-rt-transports-http-javanet
[JENKINS] Archiving <https://builds.apache.org/job/axis-trunk/ws/axis/axis-rt-transports-http-javanet/pom.xml> to /home/hudson/hudson/jobs/axis-trunk/modules/org.apache.axis$axis-rt-transports-http-javanet/builds/2012-03-09_11-01-31/archive/org.apache.axis/axis-rt-transports-http-javanet/1.4.1-SNAPSHOT/axis-rt-transports-http-javanet-1.4.1-SNAPSHOT.pom
[JENKINS] Archiving <https://builds.apache.org/job/axis-trunk/ws/axis/axis-rt-transports-http-javanet/target/axis-rt-transports-http-javanet-1.4.1-SNAPSHOT.jar> to /home/hudson/hudson/jobs/axis-trunk/modules/org.apache.axis$axis-rt-transports-http-javanet/builds/2012-03-09_11-01-31/archive/org.apache.axis/axis-rt-transports-http-javanet/1.4.1-20120309.110459-3/axis-rt-transports-http-javanet-1.4.1-20120309.110459-3.jar
[JENKINS] Archiving <https://builds.apache.org/job/axis-trunk/ws/axis/axis-rt-transports-http-javanet/target/axis-rt-transports-http-javanet-1.4.1-SNAPSHOT-sources.jar> to /home/hudson/hudson/jobs/axis-trunk/modules/org.apache.axis$axis-rt-transports-http-javanet/builds/2012-03-09_11-01-31/archive/org.apache.axis/axis-rt-transports-http-javanet/1.4.1-20120309.110459-3/axis-rt-transports-http-javanet-1.4.1-20120309.110459-3-sources.jar
[JENKINS] Archiving <https://builds.apache.org/job/axis-trunk/ws/axis/axis-rt-transports-http-javanet/target/axis-rt-transports-http-javanet-1.4.1-SNAPSHOT-javadoc.jar> to /home/hudson/hudson/jobs/axis-trunk/modules/org.apache.axis$axis-rt-transports-http-javanet/builds/2012-03-09_11-01-31/archive/org.apache.axis/axis-rt-transports-http-javanet/1.4.1-20120309.110459-3/axis-rt-transports-http-javanet-1.4.1-20120309.110459-3-javadoc.jar
[INFO] ------------------------------------------------------------------------
[INFO] Reactor Summary:
[INFO]
[INFO] Axis .............................................. SUCCESS [28.403s]
[INFO] Axis :: SAAJ ...................................... SUCCESS [7.636s]
[INFO] Axis :: JAX-RPC ................................... SUCCESS [5.375s]
[INFO] Axis :: Core ...................................... SUCCESS [1:19.518s]
[INFO] Ant tasks ......................................... SUCCESS [14.518s]
[INFO] Maven plugins ..................................... SUCCESS [1.224s]
[INFO] Maven plugin common classes ....................... SUCCESS [3.505s]
[INFO] wsdl2java plugin .................................. SUCCESS [8.424s]
[INFO] java2wsdl plugin .................................. SUCCESS [5.391s]
[INFO] Axis server plugin ................................ SUCCESS [6.371s]
[INFO] Axis :: Simple server ............................. SUCCESS [4.401s]
[INFO] Castor support .................................... SUCCESS [20.666s]
[INFO] java.net HTTP Transport ........................... FAILURE [10.760s]
[INFO] JMS support ....................................... SKIPPED
[INFO] Axis :: Integration tests ......................... SKIPPED
[INFO] Axis :: WAR ....................................... SKIPPED
[INFO] Samples ........................................... SKIPPED
[INFO] Attachments Sample ................................ SKIPPED
[INFO] Bidbuy Sample ..................................... SKIPPED
[INFO] Echo Sample ....................................... SKIPPED
[INFO] Encoding Sample ................................... SKIPPED
[INFO] Faults Sample ..................................... SKIPPED
[INFO] Handler Sample .................................... SKIPPED
[INFO] JAXM Sample ....................................... SKIPPED
[INFO] Stock Quote Sample ................................ SKIPPED
[INFO] JAX-RPC Sample .................................... SKIPPED
[INFO] Message Sample .................................... SKIPPED
[INFO] Misc Sample ....................................... SKIPPED
[INFO] Transport Sample .................................. SKIPPED
[INFO] Proxy Sample ...................................... SKIPPED
[INFO] Distribution ...................................... SKIPPED
[INFO] ------------------------------------------------------------------------
[INFO] BUILD FAILURE
[INFO] ------------------------------------------------------------------------
[INFO] Total time: 3:26.456s
[INFO] Finished at: Fri Mar 09 11:05:01 GMT 2012
[INFO] Final Memory: 53M/199M
[INFO] ------------------------------------------------------------------------
Waiting for Jenkins to finish collecting data
mavenExecutionResult exceptions not empty
message : Failed to execute goal org.apache.maven.plugins:maven-site-plugin:3.0:site (default-site) on project axis-rt-transports-http-javanet: Error during page generation
cause : Error during page generation
Stack trace :
org.apache.maven.lifecycle.LifecycleExecutionException: Failed to execute goal org.apache.maven.plugins:maven-site-plugin:3.0:site (default-site) on project axis-rt-transports-http-javanet: Error during page generation
at org.apache.maven.lifecycle.internal.MojoExecutor.execute(MojoExecutor.java:217)
at org.apache.maven.lifecycle.internal.MojoExecutor.execute(MojoExecutor.java:153)
at org.apache.maven.lifecycle.internal.MojoExecutor.execute(MojoExecutor.java:145)
at org.apache.maven.lifecycle.internal.LifecycleModuleBuilder.buildProject(LifecycleModuleBuilder.java:84)
at org.apache.maven.lifecycle.internal.LifecycleModuleBuilder.buildProject(LifecycleModuleBuilder.java:59)
at org.apache.maven.lifecycle.internal.LifecycleStarter.singleThreadedBuild(LifecycleStarter.java:183)
at org.apache.maven.lifecycle.internal.LifecycleStarter.execute(LifecycleStarter.java:161)
at org.apache.maven.DefaultMaven.doExecute(DefaultMaven.java:319)
at org.apache.maven.DefaultMaven.execute(DefaultMaven.java:156)
at org.jvnet.hudson.maven3.launcher.Maven3Launcher.main(Maven3Launcher.java:79)
at sun.reflect.NativeMethodAccessorImpl.invoke0(Native Method)
at sun.reflect.NativeMethodAccessorImpl.invoke(NativeMethodAccessorImpl.java:39)
at sun.reflect.DelegatingMethodAccessorImpl.invoke(DelegatingMethodAccessorImpl.java:25)
at java.lang.reflect.Method.invoke(Method.java:592)
at org.codehaus.plexus.classworlds.launcher.Launcher.launchStandard(Launcher.java:329)
at org.codehaus.plexus.classworlds.launcher.Launcher.launch(Launcher.java:239)
at org.jvnet.hudson.maven3.agent.Maven3Main.launch(Maven3Main.java:158)
at hudson.maven.Maven3Builder.call(Maven3Builder.java:104)
at hudson.maven.Maven3Builder.call(Maven3Builder.java:70)
at hudson.remoting.UserRequest.perform(UserRequest.java:118)
at hudson.remoting.UserRequest.perform(UserRequest.java:48)
at hudson.remoting.Request$2.run(Request.java:287)
at hudson.remoting.InterceptingExecutorService$1.call(InterceptingExecutorService.java:72)
at java.util.concurrent.FutureTask$Sync.innerRun(FutureTask.java:269)
at java.util.concurrent.FutureTask.run(FutureTask.java:123)
at java.util.concurrent.ThreadPoolExecutor$Worker.runTask(ThreadPoolExecutor.java:651)
at java.util.concurrent.ThreadPoolExecutor$Worker.run(ThreadPoolExecutor.java:676)
at java.lang.Thread.run(Thread.java:595)
Caused by: org.apache.maven.plugin.MojoExecutionException: Error during page generation
at org.apache.maven.plugins.site.SiteMojo.execute(SiteMojo.java:143)
at org.apache.maven.plugin.DefaultBuildPluginManager.executeMojo(DefaultBuildPluginManager.java:101)
at org.apache.maven.lifecycle.internal.MojoExecutor.execute(MojoExecutor.java:209)
... 27 more
Caused by: org.apache.maven.doxia.siterenderer.RendererException: Error parsing '<https://builds.apache.org/job/axis-trunk/ws/axis/axis-rt-transports-http-javanet/src/site/apt/index.apt.vm'>: line [43] Unable to execute macro in the APT document
at org.apache.maven.doxia.siterenderer.DefaultSiteRenderer.renderDocument(DefaultSiteRenderer.java:407)
at org.apache.maven.doxia.siterenderer.DoxiaDocumentRenderer.renderDocument(DoxiaDocumentRenderer.java:53)
at org.apache.maven.doxia.siterenderer.DefaultSiteRenderer.renderModule(DefaultSiteRenderer.java:317)
at org.apache.maven.doxia.siterenderer.DefaultSiteRenderer.render(DefaultSiteRenderer.java:134)
at org.apache.maven.plugins.site.SiteMojo.renderLocale(SiteMojo.java:175)
at org.apache.maven.plugins.site.SiteMojo.execute(SiteMojo.java:138)
... 29 more
Caused by: org.apache.maven.doxia.module.apt.AptParseException: Unable to execute macro in the APT document
at org.apache.maven.doxia.module.apt.AptParser.parse(AptParser.java:233)
at org.apache.maven.doxia.DefaultDoxia.parse(DefaultDoxia.java:63)
at org.apache.maven.doxia.siterenderer.DefaultSiteRenderer.renderDocument(DefaultSiteRenderer.java:399)
... 34 more
Caused by: org.apache.maven.doxia.module.apt.AptParseException: Unable to execute macro in the APT document
at org.apache.maven.doxia.module.apt.AptParser$MacroBlock.traverse(AptParser.java:2922)
at org.apache.maven.doxia.module.apt.AptParser.traverseSectionBlocks(AptParser.java:861)
at org.apache.maven.doxia.module.apt.AptParser.traverseBody(AptParser.java:753)
at org.apache.maven.doxia.module.apt.AptParser.parse(AptParser.java:228)
... 36 more
Caused by: org.apache.maven.doxia.macro.MacroExecutionException: Error reading snippet
at org.apache.maven.doxia.macro.snippet.SnippetMacro.execute(SnippetMacro.java:122)
at org.apache.maven.doxia.parser.AbstractParser.executeMacro(AbstractParser.java:120)
at org.apache.maven.doxia.module.apt.AptParser$MacroBlock.traverse(AptParser.java:2918)
... 39 more
Caused by: java.io.FileNotFoundException: /x1/jenkins/jenkins-slave/workspace/axis-trunk/axis/src/test/resources/client-config.wsdd (No such file or directory)
at java.io.FileInputStream.open(Native Method)
at java.io.FileInputStream.<init>(FileInputStream.java:106)
at java.io.FileInputStream.<init>(FileInputStream.java:66)
at sun.net.www.protocol.file.FileURLConnection.connect(FileURLConnection.java:70)
at sun.net.www.protocol.file.FileURLConnection.getInputStream(FileURLConnection.java:161)
at java.net.URL.openStream(URL.java:1007)
at org.apache.maven.doxia.macro.snippet.SnippetReader.readLines(SnippetReader.java:123)
at org.apache.maven.doxia.macro.snippet.SnippetReader.readSnippet(SnippetReader.java:65)
at org.apache.maven.doxia.macro.snippet.SnippetMacro.getSnippet(SnippetMacro.java:165)
at org.apache.maven.doxia.macro.snippet.SnippetMacro.execute(SnippetMacro.java:118)
... 41 more
Sending e-mails to: java-dev@axis.apache.org andreas.veithen@gmail.com
channel stopped
---------------------------------------------------------------------
To unsubscribe, e-mail: java-dev-unsubscribe@axis.apache.org
For additional commands, e-mail: java-dev-help@axis.apache.org