You are viewing a plain text version of this content. The canonical link for it is here.
Posted to commits@sling.apache.org by Apache Jenkins Server <je...@builds.apache.org> on 2017/05/15 14:39:37 UTC

Build failed in Jenkins: sling-launchpad-builder-1.8 #10560

See <https://builds.apache.org/job/sling-launchpad-builder-1.8/10560/display/redirect?page=changes>

Changes:

[asanso] Release Apache Sling Authentication Service 1.3.26

------------------------------------------
Started by an SCM change
[EnvInject] - Loading node environment variables.
Building remotely on ubuntu-4 (ubuntu trusty) in workspace <https://builds.apache.org/job/sling-launchpad-builder-1.8/ws/>
Updating https://svn.apache.org/repos/asf/sling/trunk/launchpad/builder at revision '2017-05-15T14:39:13.496 +0000'
U         src/main/provisioning/sling.txt
At revision 1795216

Parsing POMs
Established TCP socket on 60359
maven33-agent.jar already up to date
maven33-interceptor.jar already up to date
maven3-interceptor-commons.jar already up to date
[sling-launchpad-builder-1.8] $ /home/jenkins/tools/java/latest1.8/bin/java -Xmx2g -Xms256m -cp /home/jenkins/jenkins-slave/maven33-agent.jar:/home/jenkins/tools/maven/apache-maven-3.3.9/boot/plexus-classworlds-2.5.2.jar:/home/jenkins/tools/maven/apache-maven-3.3.9/conf/logging jenkins.maven3.agent.Maven33Main /home/jenkins/tools/maven/apache-maven-3.3.9 /home/jenkins/jenkins-slave/slave.jar /home/jenkins/jenkins-slave/maven33-interceptor.jar /home/jenkins/jenkins-slave/maven3-interceptor-commons.jar 60359
<===[JENKINS REMOTING CAPACITY]===>   channel started
Executing Maven:  -B -f <https://builds.apache.org/job/sling-launchpad-builder-1.8/ws/pom.xml> -Dmaven.repo.local=/home/jenkins/jenkins-slave/maven-repositories/0 -U clean deploy
[INFO] Scanning for projects...
[INFO] Extended Maven classpath (scope 'provided') by the dependencies extracted from the Sling model.
[INFO]                                                                         
[INFO] ------------------------------------------------------------------------
[INFO] Building Apache Sling Launchpad Application Builder 9-SNAPSHOT
[INFO] ------------------------------------------------------------------------
[INFO] Downloading: http://repository.apache.org/snapshots/org/apache/sling/org.apache.sling.commons.log/5.0.1-SNAPSHOT/maven-metadata.xml
[INFO] Downloaded: http://repository.apache.org/snapshots/org/apache/sling/org.apache.sling.commons.log/5.0.1-SNAPSHOT/maven-metadata.xml (1008 B at 2.1 KB/sec)
[INFO] Downloading: https://repo.maven.apache.org/maven2/org/apache/sling/org.apache.sling.auth.core/1.3.26/org.apache.sling.auth.core-1.3.26.pom
[WARNING] The POM for org.apache.sling:org.apache.sling.auth.core:jar:1.3.26 is missing, no dependency information available
[INFO] Downloading: http://repository.apache.org/snapshots/org/apache/sling/org.apache.sling.engine/2.6.7-SNAPSHOT/maven-metadata.xml
[INFO] Downloaded: http://repository.apache.org/snapshots/org/apache/sling/org.apache.sling.engine/2.6.7-SNAPSHOT/maven-metadata.xml (1003 B at 2.8 KB/sec)
[INFO] Downloading: http://repository.apache.org/snapshots/org/apache/sling/org.apache.sling.launchpad.content/2.0.9-SNAPSHOT/maven-metadata.xml
[INFO] Downloaded: http://repository.apache.org/snapshots/org/apache/sling/org.apache.sling.launchpad.content/2.0.9-SNAPSHOT/maven-metadata.xml (2 KB at 2.4 KB/sec)
[INFO] Downloading: https://repo.maven.apache.org/maven2/org/apache/sling/org.apache.sling.models.impl/1.4.2/org.apache.sling.models.impl-1.4.2.pom
[INFO] Downloaded: https://repo.maven.apache.org/maven2/org/apache/sling/org.apache.sling.models.impl/1.4.2/org.apache.sling.models.impl-1.4.2.pom (9 KB at 92.6 KB/sec)
[INFO] Downloading: http://repository.apache.org/snapshots/org/apache/sling/org.apache.sling.extensions.webconsolebranding/1.0.1-SNAPSHOT/maven-metadata.xml
[INFO] Downloaded: http://repository.apache.org/snapshots/org/apache/sling/org.apache.sling.extensions.webconsolebranding/1.0.1-SNAPSHOT/maven-metadata.xml (2 KB at 2.7 KB/sec)
[INFO] Downloading: http://repository.apache.org/snapshots/org/apache/sling/org.apache.sling.jcr.base/3.0.1-SNAPSHOT/maven-metadata.xml
[INFO] Downloaded: http://repository.apache.org/snapshots/org/apache/sling/org.apache.sling.jcr.base/3.0.1-SNAPSHOT/maven-metadata.xml (1005 B at 2.5 KB/sec)
[INFO] Downloading: https://repo.maven.apache.org/maven2/org/apache/sling/org.apache.sling.auth.core/1.3.26/org.apache.sling.auth.core-1.3.26.jar
[INFO] Downloading: https://repo.maven.apache.org/maven2/org/apache/sling/org.apache.sling.models.impl/1.4.2/org.apache.sling.models.impl-1.4.2.jar
[INFO] Downloaded: https://repo.maven.apache.org/maven2/org/apache/sling/org.apache.sling.models.impl/1.4.2/org.apache.sling.models.impl-1.4.2.jar (355 KB at 2788.2 KB/sec)
[JENKINS] Archiving disabled
[JENKINS] Archiving disabled[INFO] ------------------------------------------------------------------------
[INFO] BUILD FAILURE
[INFO] ------------------------------------------------------------------------
[INFO] Total time: 7.281 s
[INFO] Finished at: 2017-05-15T14:39:29+00:00

[INFO] Final Memory: 26M/349M
[INFO] ------------------------------------------------------------------------
Waiting for Jenkins to finish collecting data
[ERROR] Failed to execute goal on project org.apache.sling.launchpad: Could not resolve dependencies for project org.apache.sling:org.apache.sling.launchpad:slingstart:9-SNAPSHOT: Could not find artifact org.apache.sling:org.apache.sling.auth.core:jar:1.3.26 in central (https://repo.maven.apache.org/maven2) -> [Help 1]
[ERROR] 
[ERROR] To see the full stack trace of the errors, re-run Maven with the -e switch.
[ERROR] Re-run Maven using the -X switch to enable full debug logging.
[ERROR] 
[ERROR] For more information about the errors and possible solutions, please read the following articles:
[ERROR] [Help 1] http://cwiki.apache.org/confluence/display/MAVEN/DependencyResolutionException
channel stopped
Archiving artifacts
Recording test results
ERROR: Step ?Publish JUnit test result report? failed: Test reports were found but none of them are new. Did tests run? 
For example, <https://builds.apache.org/job/sling-launchpad-builder-1.8/ws/target/failsafe-reports/TEST-org.apache.sling.launchpad.SmokeIT.xml> is 3 hr 42 min old



Jenkins build is back to normal : sling-launchpad-builder-1.8 #10561

Posted by Apache Jenkins Server <je...@builds.apache.org>.
See <https://builds.apache.org/job/sling-launchpad-builder-1.8/10561/display/redirect?page=changes>