You are viewing a plain text version of this content. The canonical link for it is here.
Posted to builds@cassandra.apache.org by Apache Jenkins Server <je...@builds.apache.org> on 2023/10/19 05:56:31 UTC
Build complete: Cassandra-5.0 #71 [UNSTABLE] e45c1092f91edd63591f562b2120ea6a5fd3edd5
-------------------------------------------------------------------------------
Build Cassandra-5.0 #71 Still Unstable
URL: https://ci-cassandra.apache.org/job/Cassandra-5.0/71/
-------------------------------------------------------------------------------
Changes:
[Stefan Miklosovic] Implement the logic in bin/stop-server
[Stefan Miklosovic] Add versions into Deprecated annotation
[Caleb Rackliffe] Correctly remove Index.Group from IndexRegistry
-------------------------------------------------------------------------------
Failed Tests:
13 tests failed.
FAILED: dtest-novnode.snapshot_test.TestArchiveCommitlog.test_dont_archive_commitlog
FAILED: dtest-novnode.cqlsh_tests.test_cqlsh_copy.TestCqlshCopy.test_bulk_round_trip_blogposts
FAILED: dtest-novnode.snapshot_test.TestArchiveCommitlog.test_archive_commitlog_point_in_time
FAILED: dtest-novnode.cqlsh_tests.test_cqlsh_copy.TestCqlshCopy.test_bulk_round_trip_blogposts_with_max_connections
FAILED: dtest-novnode.disk_balance_test.TestDiskBalance.test_disk_balance_stress
FAILED: dtest-novnode.disk_balance_test.TestDiskBalance.test_disk_balance_after_boundary_change_stcs
FAILED: dtest-novnode.disk_balance_test.TestDiskBalance.test_disk_balance_after_boundary_change_lcs
FAILED: dtest-upgrade.upgrade_tests.upgrade_through_versions_test.TestUpgrade_current_4_0_x_To_indev_5_0_x.test_bootstrap_multidc
FAILED: dtest.replace_address_test.TestReplaceAddress.test_unsafe_replace
FAILED: dtest.snapshot_test.TestArchiveCommitlog.test_archive_commitlog_point_in_time_ln
FAILED: dtest.snapshot_test.TestArchiveCommitlog.test_archive_commitlog_restore_skip_by_position
FAILED: org.apache.cassandra.index.sasi.disk.OnDiskIndexTest.testSparseMode-cdc.jdk11.arch=x86_64.python2.7
FAILED: org.apache.cassandra.db.commitlog.CommitLogSegmentManagerCDCTest.testReplayLogic-compression.jdk17.arch=x86_64.python2.7
-------------------------------------------------------------------------------
For complete test report and logs see https://nightlies.apache.org/cassandra/Cassandra-5.0/71/