You are viewing a plain text version of this content. The canonical link for it is here.
Posted to dev@kafka.apache.org by "Guozhang Wang (JIRA)" <ji...@apache.org> on 2014/09/05 00:30:24 UTC

[jira] [Commented] (KAFKA-334) Some tests fail when building on a Windows box

    [ https://issues.apache.org/jira/browse/KAFKA-334?page=com.atlassian.jira.plugin.system.issuetabpanels:comment-tabpanel&focusedCommentId=14122105#comment-14122105 ] 

Guozhang Wang commented on KAFKA-334:
-------------------------------------

Moving the fix to post 0.8.2 for now.

> Some tests fail when building on a Windows box
> ----------------------------------------------
>
>                 Key: KAFKA-334
>                 URL: https://issues.apache.org/jira/browse/KAFKA-334
>             Project: Kafka
>          Issue Type: Bug
>          Components: core
>    Affects Versions: 0.7
>         Environment: Windows 7 - reproduces under command shell, cygwin, and MINGW32 (Git Bash)
>            Reporter: Roman Garcia
>            Priority: Minor
>              Labels: build-failure, test-fail
>             Fix For: 0.9.0
>
>
> Trying to create a ZIP distro from sources failed.
> On Win7. On cygwin, command shell and git bash.
> Tried with incubator-src download from ASF download page, as well as fresh checkout from latest trunk (r1329547).
> Once I tried the same on a Linux box, everything was working ok.
> svn co http://svn.apache.org/repos/asf/incubator/kafka/trunk kafka-0.7.0
> ./sbt update (OK)
> ./sbt package (OK)
> ./sbt release-zip (FAIL)
> Tests failing:
> [error] Error running kafka.integration.LazyInitProducerTest: Test FAILED
> [error] Error running kafka.zk.ZKLoadBalanceTest: Test FAILED
> [error] Error running kafka.javaapi.producer.ProducerTest: Test FAILED
> [error] Error running kafka.producer.ProducerTest: Test FAILED
> [error] Error running test: One or more subtasks failed
> [error] Error running doc: Scaladoc generation failed
> Stacks:
> [error] Test Failed: testZKSendWithDeadBroker
> junit.framework.AssertionFailedError: Message set should have another message
>         at junit.framework.Assert.fail(Assert.java:47)
>         at junit.framework.Assert.assertTrue(Assert.java:20)
>         at kafka.javaapi.producer.ProducerTest.testZKSendWithDeadBroker(ProducerTest.scala:448)
> [error] Test Failed: testZKSendToNewTopic
> junit.framework.AssertionFailedError: Message set should have 1 message
>         at junit.framework.Assert.fail(Assert.java:47)
>         at junit.framework.Assert.assertTrue(Assert.java:20)
>         at kafka.javaapi.producer.ProducerTest.testZKSendToNewTopic(ProducerTest.scala:416)
> [error] Test Failed: testLoadBalance(kafka.zk.ZKLoadBalanceTest)
> junit.framework.AssertionFailedError: expected:<5> but was:<0>
>         at junit.framework.Assert.fail(Assert.java:47)
>         at junit.framework.Assert.failNotEquals(Assert.java:277)
>         at junit.framework.Assert.assertEquals(Assert.java:64)
>         at junit.framework.Assert.assertEquals(Assert.java:195)
>         at junit.framework.Assert.assertEquals(Assert.java:201)
>         at kafka.zk.ZKLoadBalanceTest.checkSetEqual(ZKLoadBalanceTest.scala:121)
>         at kafka.zk.ZKLoadBalanceTest.testLoadBalance(ZKLoadBalanceTest.scala:89)
> [error] Test Failed: testPartitionedSendToNewTopic
> java.lang.AssertionError:
>   Unexpected method call send("test-topic1", 0, ByteBufferMessageSet(MessageAndOffset(message(magic = 1, attributes = 0, crc = 2326977762, payload = java.nio.HeapByteBuffer[pos=0 lim=5 cap=5]),15), )):
>     close(): expected: 1, actual: 0
>         at org.easymock.internal.MockInvocationHandler.invoke(MockInvocationHandler.java:45)
>         at org.easymock.internal.ObjectMethodsFilter.invoke(ObjectMethodsFilter.java:73)
>         at org.easymock.internal.ClassProxyFactory$MockMethodInterceptor.intercept(ClassProxyFactory.java:92)
>         at kafka.producer.SyncProducer$$EnhancerByCGLIB$$4385e618.send(<generated>)
>         at kafka.producer.ProducerPool$$anonfun$send$1.apply$mcVI$sp(ProducerPool.scala:114)
>         at kafka.producer.ProducerPool$$anonfun$send$1.apply(ProducerPool.scala:100)
>         at kafka.producer.ProducerPool$$anonfun$send$1.apply(ProducerPool.scala:100)
>         at scala.collection.mutable.ResizableArray$class.foreach(ResizableArray.scala:57)
>         at scala.collection.mutable.ArrayBuffer.foreach(ArrayBuffer.scala:43)
>         at kafka.producer.ProducerPool.send(ProducerPool.scala:100)
>         at kafka.producer.Producer.zkSend(Producer.scala:137)
>         at kafka.producer.Producer.send(Producer.scala:99)
>         at kafka.producer.ProducerTest.testPartitionedSendToNewTopic(ProducerTest.scala:576)
> [error] Test Failed: testZKSendToNewTopic
> junit.framework.AssertionFailedError: Message set should have 1 message
>         at junit.framework.Assert.fail(Assert.java:47)
>         at junit.framework.Assert.assertTrue(Assert.java:20)
>         at kafka.producer.ProducerTest.testZKSendToNewTopic(ProducerTest.scala:429)



--
This message was sent by Atlassian JIRA
(v6.3.4#6332)