You are viewing a plain text version of this content. The canonical link for it is here.
Posted to kerby@directory.apache.org by Apache Jenkins Server <je...@builds.apache.org> on 2026/10/07 10:14:43 UTC
Build failed in Jenkins: Directory » dir-kerby-jdk8 #410
See <https://ci-builds.apache.org/job/Directory/job/dir-kerby-jdk8/410/display/redirect?page=changes>
Changes:
[github] Bump github/codeql-action/init from 4.37.6 to 4.37.9
[github] Bump github/codeql-action/analyze from 4.37.6 to 4.37.9
[github] Bump github/codeql-action/upload-sarif from 4.37.6 to 4.37.9
[github] Bump actions/setup-java from 5.7.0 to 6.0.0
[github] Bump github/codeql-action/autobuild from 4.37.6 to 4.37.9
[Colm O hEigeartaigh] Adding group for codeql
[Colm O hEigeartaigh] Updating codeql versions
------------------------------------------
[...truncated 357.74 KiB...]
[INFO] --- surefire:3.5.6:test (default-test) @ kerb-crypto ---
[INFO] Using auto detected provider org.apache.maven.surefire.junitplatform.JUnitPlatformProvider
[INFO]
[INFO] -------------------------------------------------------
[INFO] T E S T S
[INFO] -------------------------------------------------------
[INFO] Running org.apache.kerby.kerberos.kerb.crypto.PrfTest
[INFO] Tests run: 10, Failures: 0, Errors: 0, Skipped: 0, Time elapsed: 0.573 s -- in org.apache.kerby.kerberos.kerb.crypto.PrfTest
[INFO] Running org.apache.kerby.kerberos.kerb.crypto.String2keyTest
[INFO] Tests run: 41, Failures: 0, Errors: 0, Skipped: 0, Time elapsed: 0.485 s -- in org.apache.kerby.kerberos.kerb.crypto.String2keyTest
[INFO] Running org.apache.kerby.kerberos.kerb.crypto.dh.DhGroupTest
[INFO] Tests run: 2, Failures: 0, Errors: 0, Skipped: 0, Time elapsed: 0.078 s -- in org.apache.kerby.kerberos.kerb.crypto.dh.DhGroupTest
[INFO] Running org.apache.kerby.kerberos.kerb.crypto.dh.OctetString2KeyTest
[INFO] Tests run: 4, Failures: 0, Errors: 0, Skipped: 0, Time elapsed: 0.100 s -- in org.apache.kerby.kerberos.kerb.crypto.dh.OctetString2KeyTest
[INFO] Running org.apache.kerby.kerberos.kerb.crypto.dh.DhKeyAgreementTest
[INFO] Tests run: 3, Failures: 0, Errors: 0, Skipped: 0, Time elapsed: 0.281 s -- in org.apache.kerby.kerberos.kerb.crypto.dh.DhKeyAgreementTest
[INFO] Running org.apache.kerby.kerberos.kerb.crypto.DesKeyMakerTest
[WARNING] Tests run: 1, Failures: 0, Errors: 0, Skipped: 1, Time elapsed: 0.051 s -- in org.apache.kerby.kerberos.kerb.crypto.DesKeyMakerTest
[INFO] Running org.apache.kerby.kerberos.kerb.crypto.CheckSumTest
SLF4J: Failed to load class "org.slf4j.impl.StaticLoggerBinder".
SLF4J: Defaulting to no-operation (NOP) logger implementation
SLF4J: See http://www.slf4j.org/codes.html#StaticLoggerBinder for further details.
[INFO] Tests run: 1, Failures: 0, Errors: 0, Skipped: 0, Time elapsed: 0.162 s -- in org.apache.kerby.kerberos.kerb.crypto.CheckSumTest
[INFO] Running org.apache.kerby.kerberos.kerb.crypto.DecryptionTest
[INFO] Tests run: 50, Failures: 0, Errors: 0, Skipped: 0, Time elapsed: 0.412 s -- in org.apache.kerby.kerberos.kerb.crypto.DecryptionTest
[INFO] Running org.apache.kerby.kerberos.kerb.crypto.FastUtilTest
[INFO] Tests run: 10, Failures: 0, Errors: 0, Skipped: 0, Time elapsed: 0.806 s -- in org.apache.kerby.kerberos.kerb.crypto.FastUtilTest
[INFO] Running org.apache.kerby.kerberos.kerb.crypto.CheckSumsTest
[INFO] Tests run: 13, Failures: 0, Errors: 0, Skipped: 0, Time elapsed: 0.259 s -- in org.apache.kerby.kerberos.kerb.crypto.CheckSumsTest
[INFO] Running org.apache.kerby.kerberos.kerb.crypto.Crc32Test
[INFO] Tests run: 1, Failures: 0, Errors: 0, Skipped: 0, Time elapsed: 0.139 s -- in org.apache.kerby.kerberos.kerb.crypto.Crc32Test
[INFO] Running org.apache.kerby.kerberos.kerb.crypto.CamelliaEncTest
[INFO] Tests run: 1, Failures: 0, Errors: 0, Skipped: 0, Time elapsed: 0.165 s -- in org.apache.kerby.kerberos.kerb.crypto.CamelliaEncTest
[INFO] Running org.apache.kerby.kerberos.kerb.crypto.CmacTest
[INFO] Tests run: 1, Failures: 0, Errors: 0, Skipped: 0, Time elapsed: 0.147 s -- in org.apache.kerby.kerberos.kerb.crypto.CmacTest
[INFO] Running org.apache.kerby.kerberos.kerb.crypto.KeyDeriveTest
[INFO] Tests run: 15, Failures: 0, Errors: 0, Skipped: 0, Time elapsed: 0.212 s -- in org.apache.kerby.kerberos.kerb.crypto.KeyDeriveTest
[INFO]
[INFO] Results:
[INFO]
[INFO] Tests run: 153, Failures: 0, Errors: 0, Skipped: 1
[INFO]
[INFO]
[INFO] --- surefire:3.5.6:test (default) @ kerb-crypto ---
[INFO] Skipping execution of surefire because it has already been run for this configuration
[INFO]
[INFO] --- jar:3.5.0:jar (default-jar) @ kerb-crypto ---
[INFO] Building jar: <https://ci-builds.apache.org/job/Directory/job/dir-kerby-jdk8/ws/kerby-kerb/kerb-crypto/target/kerb-crypto-2.1.3-SNAPSHOT.jar>
[INFO]
[INFO] --- cyclonedx:2.9.3:makeAggregateBom (make-bom) @ kerb-crypto ---
[INFO] CycloneDX: Resolving Dependencies
[INFO] CycloneDX: Creating BOM version 1.6 with 5 component(s)
[INFO] CycloneDX: Writing and validating BOM (XML): <https://ci-builds.apache.org/job/Directory/job/dir-kerby-jdk8/ws/kerby-kerb/kerb-crypto/target/kerb-crypto-2.1.3-SNAPSHOT-bom.xml>
[INFO] attaching as kerb-crypto-2.1.3-SNAPSHOT-cyclonedx.xml
[INFO] CycloneDX: Writing and validating BOM (JSON): <https://ci-builds.apache.org/job/Directory/job/dir-kerby-jdk8/ws/kerby-kerb/kerb-crypto/target/kerb-crypto-2.1.3-SNAPSHOT-bom.json>
[INFO] attaching as kerb-crypto-2.1.3-SNAPSHOT-cyclonedx.json
[INFO]
[INFO] --- modernizer:2.9.0:modernizer (modernizer-check) @ kerb-crypto ---
[INFO]
[INFO] --- install:3.1.4:install (default-install) @ kerb-crypto ---
[INFO] Installing <https://ci-builds.apache.org/job/Directory/job/dir-kerby-jdk8/ws/kerby-kerb/kerb-crypto/pom.xml> to /home/jenkins/.m2/repository/org/apache/kerby/kerb-crypto/2.1.3-SNAPSHOT/kerb-crypto-2.1.3-SNAPSHOT.pom
[INFO] Installing <https://ci-builds.apache.org/job/Directory/job/dir-kerby-jdk8/ws/kerby-kerb/kerb-crypto/target/kerb-crypto-2.1.3-SNAPSHOT.jar> to /home/jenkins/.m2/repository/org/apache/kerby/kerb-crypto/2.1.3-SNAPSHOT/kerb-crypto-2.1.3-SNAPSHOT.jar
[INFO] Installing <https://ci-builds.apache.org/job/Directory/job/dir-kerby-jdk8/ws/kerby-kerb/kerb-crypto/target/kerb-crypto-2.1.3-SNAPSHOT-bom.xml> to /home/jenkins/.m2/repository/org/apache/kerby/kerb-crypto/2.1.3-SNAPSHOT/kerb-crypto-2.1.3-SNAPSHOT-cyclonedx.xml
[INFO] Installing <https://ci-builds.apache.org/job/Directory/job/dir-kerby-jdk8/ws/kerby-kerb/kerb-crypto/target/kerb-crypto-2.1.3-SNAPSHOT-bom.json> to /home/jenkins/.m2/repository/org/apache/kerby/kerb-crypto/2.1.3-SNAPSHOT/kerb-crypto-2.1.3-SNAPSHOT-cyclonedx.json
[INFO]
[INFO] --- deploy:3.1.4:deploy (default-deploy) @ kerb-crypto ---
Downloading from apache.snapshots.https: https://repository.apache.org/content/repositories/snapshots/org/apache/kerby/kerb-crypto/2.1.3-SNAPSHOT/maven-metadata.xml
Progress (1): 1.2 kB Downloaded from apache.snapshots.https: https://repository.apache.org/content/repositories/snapshots/org/apache/kerby/kerb-crypto/2.1.3-SNAPSHOT/maven-metadata.xml (1.2 kB at 2.3 kB/s)
Uploading to apache.snapshots.https: https://repository.apache.org/content/repositories/snapshots/org/apache/kerby/kerb-crypto/2.1.3-SNAPSHOT/kerb-crypto-2.1.3-20261007.101124-11.pom
Progress (1): 1.7 kB Uploaded to apache.snapshots.https: https://repository.apache.org/content/repositories/snapshots/org/apache/kerby/kerb-crypto/2.1.3-SNAPSHOT/kerb-crypto-2.1.3-20261007.101124-11.pom (1.7 kB at 1.6 kB/s)
Uploading to apache.snapshots.https: https://repository.apache.org/content/repositories/snapshots/org/apache/kerby/kerb-crypto/2.1.3-SNAPSHOT/kerb-crypto-2.1.3-20261007.101124-11.jar
Uploading to apache.snapshots.https: https://repository.apache.org/content/repositories/snapshots/org/apache/kerby/kerb-crypto/2.1.3-SNAPSHOT/kerb-crypto-2.1.3-20261007.101124-11-cyclonedx.xml
Uploading to apache.snapshots.https: https://repository.apache.org/content/repositories/snapshots/org/apache/kerby/kerb-crypto/2.1.3-SNAPSHOT/kerb-crypto-2.1.3-20261007.101124-11-cyclonedx.json
Progress (1): 33/115 kBProgress (1): 66/115 kBProgress (1): 98/115 kBProgress (1): 115 kB Progress (2): 115 kB | 14 kBProgress (3): 115 kB | 14 kB | 13 kB Uploaded to apache.snapshots.https: https://repository.apache.org/content/repositories/snapshots/org/apache/kerby/kerb-crypto/2.1.3-SNAPSHOT/kerb-crypto-2.1.3-20261007.101124-11-cyclonedx.json (14 kB at 9.4 kB/s)
Uploaded to apache.snapshots.https: https://repository.apache.org/content/repositories/snapshots/org/apache/kerby/kerb-crypto/2.1.3-SNAPSHOT/kerb-crypto-2.1.3-20261007.101124-11-cyclonedx.xml (13 kB at 8.7 kB/s)
Uploaded to apache.snapshots.https: https://repository.apache.org/content/repositories/snapshots/org/apache/kerby/kerb-crypto/2.1.3-SNAPSHOT/kerb-crypto-2.1.3-20261007.101124-11.jar (115 kB at 75 kB/s)
Downloading from apache.snapshots.https: https://repository.apache.org/content/repositories/snapshots/org/apache/kerby/kerb-crypto/maven-metadata.xml
Progress (1): 431 B Downloaded from apache.snapshots.https: https://repository.apache.org/content/repositories/snapshots/org/apache/kerby/kerb-crypto/maven-metadata.xml (431 B at 1.3 kB/s)
Uploading to apache.snapshots.https: https://repository.apache.org/content/repositories/snapshots/org/apache/kerby/kerb-crypto/2.1.3-SNAPSHOT/maven-metadata.xml
Progress (1): 1.2 kB Uploaded to apache.snapshots.https: https://repository.apache.org/content/repositories/snapshots/org/apache/kerby/kerb-crypto/2.1.3-SNAPSHOT/maven-metadata.xml (1.2 kB at 1.2 kB/s)
Uploading to apache.snapshots.https: https://repository.apache.org/content/repositories/snapshots/org/apache/kerby/kerb-crypto/maven-metadata.xml
Progress (1): 431 B Uploaded to apache.snapshots.https: https://repository.apache.org/content/repositories/snapshots/org/apache/kerby/kerb-crypto/maven-metadata.xml (431 B at 416 B/s)
[INFO]
[INFO] --------------------< org.apache.kerby:kerb-common >--------------------
[INFO] Building Kerby-kerb Common 2.1.3-SNAPSHOT [13/44]
[INFO] from kerby-kerb/kerb-common/pom.xml
[INFO] --------------------------------[ jar ]---------------------------------
[WARNING] Parameter 'encoding' is unknown for plugin 'maven-checkstyle-plugin:3.6.0:check (validate)'
[INFO]
[INFO] --- clean:3.5.0:clean (default-clean) @ kerb-common ---
[INFO]
[INFO] --- enforcer:3.6.3:enforce (enforce-maven-version) @ kerb-common ---
[INFO]
[INFO] --- enforcer:3.6.3:enforce (enforce-java-version) @ kerb-common ---
[INFO]
[INFO] >>> pmd:3.15.0:check (validate) > :pmd @ kerb-common >>>
[INFO]
[INFO] --- pmd:3.15.0:pmd (pmd) @ kerb-common ---
[INFO] PMD version: 6.38.0
[WARNING] The RuleSet rulesets/java/basic.xml has been deprecated and will be removed in PMD 7.0.0
[WARNING] The RuleSet rulesets/java/unusedcode.xml has been deprecated and will be removed in PMD 7.0.0
[WARNING] The RuleSet rulesets/java/imports.xml has been deprecated and will be removed in PMD 7.0.0
[WARNING] The RuleSet rulesets/java/braces.xml has been deprecated and will be removed in PMD 7.0.0
[WARNING] The RuleSet rulesets/java/empty.xml has been deprecated and will be removed in PMD 7.0.0
[WARNING] The RuleSet rulesets/java/migrating.xml has been deprecated and will be removed in PMD 7.0.0
[WARNING] The RuleSet rulesets/java/unnecessary.xml has been deprecated and will be removed in PMD 7.0.0
[INFO]
[INFO] <<< pmd:3.15.0:check (validate) < :pmd @ kerb-common <<<
[INFO]
[INFO]
[INFO] --- pmd:3.15.0:check (validate) @ kerb-common ---
[INFO] PMD version: 6.38.0
[INFO]
[INFO]
[INFO] --- checkstyle:3.6.0:check (validate) @ kerb-common ---
[INFO] You have 0 Checkstyle violations.
[INFO]
[INFO] --- remote-resources:3.3.0:process (process-resource-bundles) @ kerb-common ---
[INFO] Preparing remote bundle org.apache.apache.resources:apache-jar-resource-bundle:1.8
[INFO] Copying 3 resources from 1 bundle.
[INFO]
[INFO] --- resources:3.5.0:resources (default-resources) @ kerb-common ---
[INFO] skip non existing resourceDirectory <https://ci-builds.apache.org/job/Directory/job/dir-kerby-jdk8/ws/kerby-kerb/kerb-common/src/main/resources>
[INFO] Copying 3 resources from target/maven-shared-archive-resources to target/classes
[INFO]
[INFO] --- compiler:3.15.0:compile (default-compile) @ kerb-common ---
[INFO] Recompiling the module because of changed dependency.
[INFO] Compiling 41 source files with javac [debug target 8] to target/classes
[INFO] <https://ci-builds.apache.org/job/Directory/job/dir-kerby-jdk8/ws/kerby-kerb/kerb-common/src/main/java/org/apache/kerby/kerberos/kerb/common/Krb5Parser.java>: <https://ci-builds.apache.org/job/Directory/job/dir-kerby-jdk8/ws/kerby-kerb/kerb-common/src/main/java/org/apache/kerby/kerberos/kerb/common/Krb5Parser.java> uses unchecked or unsafe operations.
[INFO] <https://ci-builds.apache.org/job/Directory/job/dir-kerby-jdk8/ws/kerby-kerb/kerb-common/src/main/java/org/apache/kerby/kerberos/kerb/common/Krb5Parser.java>: Recompile with -Xlint:unchecked for details.
[INFO]
[INFO] --- resources:3.5.0:testResources (default-testResources) @ kerb-common ---
[INFO] Copying 6 resources from src/test/resources to target/test-classes
[INFO] Copying 3 resources from target/maven-shared-archive-resources to target/test-classes
[INFO]
[INFO] --- compiler:3.15.0:testCompile (default-testCompile) @ kerb-common ---
[INFO] Recompiling the module because of changed dependency.
[INFO] Compiling 2 source files with javac [debug target 8] to target/test-classes
[INFO] <https://ci-builds.apache.org/job/Directory/job/dir-kerby-jdk8/ws/kerby-kerb/kerb-common/src/test/java/org/apache/kerby/kerberos/kerb/Krb5ParserTest.java>: <https://ci-builds.apache.org/job/Directory/job/dir-kerby-jdk8/ws/kerby-kerb/kerb-common/src/test/java/org/apache/kerby/kerberos/kerb/Krb5ParserTest.java> uses unchecked or unsafe operations.
[INFO] <https://ci-builds.apache.org/job/Directory/job/dir-kerby-jdk8/ws/kerby-kerb/kerb-common/src/test/java/org/apache/kerby/kerberos/kerb/Krb5ParserTest.java>: Recompile with -Xlint:unchecked for details.
[INFO]
[INFO] --- surefire:3.5.6:test (default-test) @ kerb-common ---
[INFO] Using auto detected provider org.apache.maven.surefire.junitplatform.JUnitPlatformProvider
[INFO]
[INFO] -------------------------------------------------------
[INFO] T E S T S
[INFO] -------------------------------------------------------
[INFO] Running org.apache.kerby.kerberos.kerb.CryptoTest
SLF4J: Failed to load class "org.slf4j.impl.StaticLoggerBinder".
SLF4J: Defaulting to no-operation (NOP) logger implementation
SLF4J: See http://www.slf4j.org/codes.html#StaticLoggerBinder for further details.
[ERROR] Tests run: 1, Failures: 0, Errors: 1, Skipped: 0, Time elapsed: 0.250 s <<< FAILURE! -- in org.apache.kerby.kerberos.kerb.CryptoTest
[ERROR] org.apache.kerby.kerberos.kerb.CryptoTest.testCertificateLoading -- Time elapsed: 0.214 s <<< ERROR!
java.security.cert.CertPathValidatorException: validity check failed
at sun.security.provider.certpath.PKIXMasterCertPathValidator.validate(PKIXMasterCertPathValidator.java:135)
at sun.security.provider.certpath.PKIXCertPathValidator.validate(PKIXCertPathValidator.java:220)
at sun.security.provider.certpath.PKIXCertPathValidator.validate(PKIXCertPathValidator.java:140)
at sun.security.provider.certpath.PKIXCertPathValidator.engineValidate(PKIXCertPathValidator.java:79)
at java.security.cert.CertPathValidator.validate(CertPathValidator.java:292)
at org.apache.kerby.kerberos.kerb.CryptoTest.testCertificateLoading(CryptoTest.java:78)
at java.lang.reflect.Method.invoke(Method.java:498)
at java.util.ArrayList.forEach(ArrayList.java:1259)
at java.util.ArrayList.forEach(ArrayList.java:1259)
Caused by: java.security.cert.CertificateExpiredException: NotAfter: Sun Sep 27 14:51:33 UTC 2026
at sun.security.x509.CertificateValidity.valid(CertificateValidity.java:277)
at sun.security.x509.X509CertImpl.checkValidity(X509CertImpl.java:677)
at sun.security.provider.certpath.BasicChecker.verifyValidity(BasicChecker.java:190)
at sun.security.provider.certpath.BasicChecker.check(BasicChecker.java:144)
at sun.security.provider.certpath.PKIXMasterCertPathValidator.validate(PKIXMasterCertPathValidator.java:125)
... 8 more
[INFO] Running org.apache.kerby.kerberos.kerb.Krb5ParserTest
[INFO] Tests run: 1, Failures: 0, Errors: 0, Skipped: 0, Time elapsed: 0.174 s -- in org.apache.kerby.kerberos.kerb.Krb5ParserTest
[INFO]
[INFO] Results:
[INFO]
[ERROR] Errors:
[ERROR] CryptoTest.testCertificateLoading:78 » CertPathValidator validity check failed
[INFO]
[ERROR] Tests run: 2, Failures: 0, Errors: 1, Skipped: 0
[INFO]
[INFO] ------------------------------------------------------------------------
[INFO] Reactor Summary for Apache Kerby Project 2.1.3-SNAPSHOT:
[INFO]
[INFO] Apache Kerby Project ............................... SUCCESS [ 44.414 s]
[INFO] Apache Kerby BOM ................................... SUCCESS [ 5.073 s]
[INFO] Apache Directory Kerby Parent pom .................. SUCCESS [ 5.417 s]
[INFO] Kerby-common Project ............................... SUCCESS [ 5.077 s]
[INFO] Kerby ASN1 Project ................................. SUCCESS [ 31.143 s]
[INFO] Kerby Config ....................................... SUCCESS [ 10.282 s]
[INFO] Kerby Util ......................................... SUCCESS [ 10.452 s]
[INFO] Kerby XDR Project .................................. SUCCESS [ 15.280 s]
[INFO] Kerby PKIX Project ................................. SUCCESS [ 14.139 s]
[INFO] Kerby-kerb Project ................................. SUCCESS [ 5.015 s]
[INFO] Kerby-kerb core .................................... SUCCESS [ 21.758 s]
[INFO] Kerby-kerb Crypto .................................. SUCCESS [ 25.486 s]
[INFO] Kerby-kerb Common .................................. FAILURE [ 4.303 s]
[INFO] Kerby-kerb Util .................................... SKIPPED
[INFO] Kerby-kerb Identity ................................ SKIPPED
[INFO] Kerby-kerb Identity Test ........................... SKIPPED
[INFO] Kerby providers .................................... SKIPPED
[INFO] Token provider ..................................... SKIPPED
[INFO] Kerby-kerb Client .................................. SKIPPED
[INFO] Kerby-kerb Server .................................. SKIPPED
[INFO] Kerby-kerb Admin ................................... SKIPPED
[INFO] Kerb Simple Kdc .................................... SKIPPED
[INFO] Kerby-kerb server all .............................. SKIPPED
[INFO] Kerby KDC Server ................................... SKIPPED
[INFO] Kerb Kdc Test ...................................... SKIPPED
[INFO] Kerb Integration Test .............................. SKIPPED
[INFO] Kerby Backend ...................................... SKIPPED
[INFO] Zookeeper identity backend ......................... SKIPPED
[INFO] Kerby-kerb Admin Server ............................ SKIPPED
[INFO] Kerby-kerb client api all .......................... SKIPPED
[INFO] Kerby-kerb GssAPI .................................. SKIPPED
[INFO] Kerb Integration GSS Test .......................... SKIPPED
[INFO] Json identity backend .............................. SKIPPED
[INFO] Kerby Kdc Test ..................................... SKIPPED
[INFO] Ldap identity backend .............................. SKIPPED
[INFO] Mavibot based backend .............................. SKIPPED
[INFO] MySQL identity backend ............................. SKIPPED
[INFO] Kerby benchmark .................................... SKIPPED
[INFO] Kdc Tool Project ................................... SKIPPED
[INFO] Client Tool ........................................ SKIPPED
[INFO] KDC Tool ........................................... SKIPPED
[INFO] Kerby Distribution ................................. SKIPPED
[INFO] KDC Dist ........................................... SKIPPED
[INFO] Tool Dist .......................................... SKIPPED
[INFO] ------------------------------------------------------------------------
[INFO] BUILD FAILURE
[INFO] ------------------------------------------------------------------------
[INFO] Total time: 03:18 min
[INFO] Finished at: 2026-10-07T10:14:42Z
[INFO] ------------------------------------------------------------------------
[ERROR] Failed to execute goal org.apache.maven.plugins:maven-surefire-plugin:3.5.6:test (default-test) on project kerb-common:
[ERROR]
[ERROR] See <https://ci-builds.apache.org/job/Directory/job/dir-kerby-jdk8/ws/kerby-kerb/kerb-common/target/surefire-reports> for the individual test results.
[ERROR] See dump files (if any exist) [date].dump, [date]-jvmRun[N].dump and [date].dumpstream.
[ERROR] -> [Help 1]
[ERROR]
[ERROR] To see the full stack trace of the errors, re-run Maven with the -e switch.
[ERROR] Re-run Maven using the -X switch to enable full debug logging.
[ERROR]
[ERROR] For more information about the errors and possible solutions, please read the following articles:
[ERROR] [Help 1] http://cwiki.apache.org/confluence/display/MAVEN/MojoFailureException
[ERROR]
[ERROR] After correcting the problems, you can resume the build with the command
[ERROR] mvn <args> -rf :kerb-common
Build step 'Invoke top-level Maven targets' marked build as failure
---------------------------------------------------------------------
To unsubscribe, e-mail: kerby-unsubscribe@directory.apache.org
For additional commands, e-mail: kerby-help@directory.apache.org
Jenkins build is back to normal : Directory » dir-kerby-jdk8 #411
Posted by Apache Jenkins Server <je...@builds.apache.org>.
See <https://ci-builds.apache.org/job/Directory/job/dir-kerby-jdk8/411/display/redirect?page=changes>
---------------------------------------------------------------------
To unsubscribe, e-mail: kerby-unsubscribe@directory.apache.org
For additional commands, e-mail: kerby-help@directory.apache.org