You are viewing a plain text version of this content. The canonical link for it is here.
Posted to dev@aurora.apache.org by Apache Jenkins Server <je...@builds.apache.org> on 2016/08/05 18:18:46 UTC
Build failed in Jenkins: Aurora #1574
See <https://builds.apache.org/job/Aurora/1574/changes>
Changes:
[zmanji] Populate the source field of ExecutorInfo.
------------------------------------------
[...truncated 4389 lines...]
from pants.bin.pants_exe import main
ImportError: No module named pants.bin.pants_exe
TestThermosExecutor.test_failing_runner_initialize
self = <test_thermos_executor.TestThermosExecutor object at 0x7fb47f934a10>
[1m def test_failing_runner_initialize(self):[0m
[1m proxy_driver = ProxyDriver()[0m
[1m [0m
[1m with temporary_dir() as td:[0m
[1m te = FastThermosExecutor([0m
[1m> runner_provider=make_provider(td),[0m
[1m sandbox_provider=FailingSandboxProvider())[0m
src/test/python/apache/aurora/executor/test_thermos_executor.py:480:
_ _ _ _ _ _ _ _ _ _ _ _ _ _ _ _ _ _ _ _ _ _ _ _ _
src/test/python/apache/aurora/executor/test_thermos_executor.py:193: in make_provider
[1m pex_location=thermos_runner_path(),[0m
_ _ _ _ _ _ _ _ _ _ _ _ _ _ _ _ _ _ _ _ _ _ _ _ _
build = True
[1m def thermos_runner_path(build=True):[0m
[1m if not build:[0m
[1m return getattr(thermos_runner_path, 'value', None)[0m
[1m [0m
[1m if not hasattr(thermos_runner_path, 'value'):[0m
[1m pex_dir = safe_mkdtemp()[0m
[1m> assert subprocess.call(["./pants", "--pants-distdir=%s" % pex_dir, "binary",[0m
[1m "src/main/python/apache/thermos/runner:thermos_runner"]) == 0[0m
[1m[31mE assert 1 == 0[0m
[1m[31mE + where 1 = <function call at 0x7fb4a3d919b0>(['./pants', '--pants-distdir=/tmp/tmpsANtz2', 'binary', 'src/main/python/apache/thermos/runner:thermos_runner'])[0m
[1m[31mE + where <function call at 0x7fb4a3d919b0> = subprocess.call[0m
src/test/python/apache/aurora/executor/test_thermos_executor.py:185: AssertionError
-------------- Captured stderr call --------------
Traceback (most recent call last):
File "<https://builds.apache.org/job/Aurora/ws/.home/.cache/pants/setup/bootstrap-Linux-x86_64/1.1.0-rc7/bin/pants",> line 7, in <module>
from pants.bin.pants_exe import main
ImportError: No module named pants.bin.pants_exe
TestThermosExecutor.test_failing_runner_initialize_unknown_exception
self = <test_thermos_executor.TestThermosExecutor object at 0x7fb466792690>
[1m def test_failing_runner_initialize_unknown_exception(self):[0m
[1m proxy_driver = ProxyDriver()[0m
[1m [0m
[1m with temporary_dir() as td:[0m
[1m te = FastThermosExecutor([0m
[1m> runner_provider=make_provider(td),[0m
[1m sandbox_provider=FailingSandboxProvider(exception_type=Exception))[0m
src/test/python/apache/aurora/executor/test_thermos_executor.py:493:
_ _ _ _ _ _ _ _ _ _ _ _ _ _ _ _ _ _ _ _ _ _ _ _ _
src/test/python/apache/aurora/executor/test_thermos_executor.py:193: in make_provider
[1m pex_location=thermos_runner_path(),[0m
_ _ _ _ _ _ _ _ _ _ _ _ _ _ _ _ _ _ _ _ _ _ _ _ _
build = True
[1m def thermos_runner_path(build=True):[0m
[1m if not build:[0m
[1m return getattr(thermos_runner_path, 'value', None)[0m
[1m [0m
[1m if not hasattr(thermos_runner_path, 'value'):[0m
[1m pex_dir = safe_mkdtemp()[0m
[1m> assert subprocess.call(["./pants", "--pants-distdir=%s" % pex_dir, "binary",[0m
[1m "src/main/python/apache/thermos/runner:thermos_runner"]) == 0[0m
[1m[31mE assert 1 == 0[0m
[1m[31mE + where 1 = <function call at 0x7fb4a3d919b0>(['./pants', '--pants-distdir=/tmp/tmpjXAnHm', 'binary', 'src/main/python/apache/thermos/runner:thermos_runner'])[0m
[1m[31mE + where <function call at 0x7fb4a3d919b0> = subprocess.call[0m
src/test/python/apache/aurora/executor/test_thermos_executor.py:185: AssertionError
-------------- Captured stderr call --------------
Traceback (most recent call last):
File "<https://builds.apache.org/job/Aurora/ws/.home/.cache/pants/setup/bootstrap-Linux-x86_64/1.1.0-rc7/bin/pants",> line 7, in <module>
from pants.bin.pants_exe import main
ImportError: No module named pants.bin.pants_exe
TestThermosExecutor.test_slow_runner_initialize _
self = <test_thermos_executor.TestThermosExecutor object at 0x7fb47f523a10>
[1m def test_slow_runner_initialize(self):[0m
[1m proxy_driver = ProxyDriver()[0m
[1m [0m
[1m task = make_task(HELLO_WORLD_MTI)[0m
[1m [0m
[1m with temporary_dir() as td:[0m
[1m te = FastThermosExecutor([0m
[1m> runner_provider=make_provider(td),[0m
[1m sandbox_provider=SlowSandboxProvider())[0m
src/test/python/apache/aurora/executor/test_thermos_executor.py:508:
_ _ _ _ _ _ _ _ _ _ _ _ _ _ _ _ _ _ _ _ _ _ _ _ _
src/test/python/apache/aurora/executor/test_thermos_executor.py:193: in make_provider
[1m pex_location=thermos_runner_path(),[0m
_ _ _ _ _ _ _ _ _ _ _ _ _ _ _ _ _ _ _ _ _ _ _ _ _
build = True
[1m def thermos_runner_path(build=True):[0m
[1m if not build:[0m
[1m return getattr(thermos_runner_path, 'value', None)[0m
[1m [0m
[1m if not hasattr(thermos_runner_path, 'value'):[0m
[1m pex_dir = safe_mkdtemp()[0m
[1m> assert subprocess.call(["./pants", "--pants-distdir=%s" % pex_dir, "binary",[0m
[1m "src/main/python/apache/thermos/runner:thermos_runner"]) == 0[0m
[1m[31mE assert 1 == 0[0m
[1m[31mE + where 1 = <function call at 0x7fb4a3d919b0>(['./pants', '--pants-distdir=/tmp/tmpwMYVqz', 'binary', 'src/main/python/apache/thermos/runner:thermos_runner'])[0m
[1m[31mE + where <function call at 0x7fb4a3d919b0> = subprocess.call[0m
src/test/python/apache/aurora/executor/test_thermos_executor.py:185: AssertionError
-------------- Captured stderr call --------------
Traceback (most recent call last):
File "<https://builds.apache.org/job/Aurora/ws/.home/.cache/pants/setup/bootstrap-Linux-x86_64/1.1.0-rc7/bin/pants",> line 7, in <module>
from pants.bin.pants_exe import main
ImportError: No module named pants.bin.pants_exe
TestThermosExecutor.test_killTask_during_runner_initialize
self = <test_thermos_executor.TestThermosExecutor object at 0x7fb47fb816d0>
[1m def test_killTask_during_runner_initialize(self): # noqa[0m
[1m proxy_driver = ProxyDriver()[0m
[1m [0m
[1m task = make_task(HELLO_WORLD_MTI)[0m
[1m [0m
[1m with temporary_dir() as td:[0m
[1m te = FastThermosExecutor([0m
[1m> runner_provider=make_provider(td),[0m
[1m sandbox_provider=SlowSandboxProvider())[0m
src/test/python/apache/aurora/executor/test_thermos_executor.py:527:
_ _ _ _ _ _ _ _ _ _ _ _ _ _ _ _ _ _ _ _ _ _ _ _ _
src/test/python/apache/aurora/executor/test_thermos_executor.py:193: in make_provider
[1m pex_location=thermos_runner_path(),[0m
_ _ _ _ _ _ _ _ _ _ _ _ _ _ _ _ _ _ _ _ _ _ _ _ _
build = True
[1m def thermos_runner_path(build=True):[0m
[1m if not build:[0m
[1m return getattr(thermos_runner_path, 'value', None)[0m
[1m [0m
[1m if not hasattr(thermos_runner_path, 'value'):[0m
[1m pex_dir = safe_mkdtemp()[0m
[1m> assert subprocess.call(["./pants", "--pants-distdir=%s" % pex_dir, "binary",[0m
[1m "src/main/python/apache/thermos/runner:thermos_runner"]) == 0[0m
[1m[31mE assert 1 == 0[0m
[1m[31mE + where 1 = <function call at 0x7fb4a3d919b0>(['./pants', '--pants-distdir=/tmp/tmpCVczc1', 'binary', 'src/main/python/apache/thermos/runner:thermos_runner'])[0m
[1m[31mE + where <function call at 0x7fb4a3d919b0> = subprocess.call[0m
src/test/python/apache/aurora/executor/test_thermos_executor.py:185: AssertionError
-------------- Captured stderr call --------------
Traceback (most recent call last):
File "<https://builds.apache.org/job/Aurora/ws/.home/.cache/pants/setup/bootstrap-Linux-x86_64/1.1.0-rc7/bin/pants",> line 7, in <module>
from pants.bin.pants_exe import main
ImportError: No module named pants.bin.pants_exe
TestThermosExecutor.test_launchTask_deserialization_fail
self = <test_thermos_executor.TestThermosExecutor object at 0x7fb47fb7fa90>
[1m def test_launchTask_deserialization_fail(self): # noqa[0m
[1m proxy_driver = ProxyDriver()[0m
[1m [0m
[1m role = getpass.getuser()[0m
[1m task_info = mesos_pb2.TaskInfo()[0m
[1m task_info.name = task_info.task_id.value = 'broken'[0m
[1m task_info.data = serialize([0m
[1m AssignedTask([0m
[1m task=TaskConfig([0m
[1m job=JobKey(role=role, environment='env', name='name'),[0m
[1m executorConfig=ExecutorConfig(name=AURORA_EXECUTOR_NAME, data='garbage'))))[0m
[1m [0m
[1m te = FastThermosExecutor([0m
[1m> runner_provider=make_provider(safe_mkdtemp()),[0m
[1m sandbox_provider=DefaultTestSandboxProvider())[0m
src/test/python/apache/aurora/executor/test_thermos_executor.py:565:
_ _ _ _ _ _ _ _ _ _ _ _ _ _ _ _ _ _ _ _ _ _ _ _ _
src/test/python/apache/aurora/executor/test_thermos_executor.py:193: in make_provider
[1m pex_location=thermos_runner_path(),[0m
_ _ _ _ _ _ _ _ _ _ _ _ _ _ _ _ _ _ _ _ _ _ _ _ _
build = True
[1m def thermos_runner_path(build=True):[0m
[1m if not build:[0m
[1m return getattr(thermos_runner_path, 'value', None)[0m
[1m [0m
[1m if not hasattr(thermos_runner_path, 'value'):[0m
[1m pex_dir = safe_mkdtemp()[0m
[1m> assert subprocess.call(["./pants", "--pants-distdir=%s" % pex_dir, "binary",[0m
[1m "src/main/python/apache/thermos/runner:thermos_runner"]) == 0[0m
[1m[31mE assert 1 == 0[0m
[1m[31mE + where 1 = <function call at 0x7fb4a3d919b0>(['./pants', '--pants-distdir=/tmp/tmp_27fCA', 'binary', 'src/main/python/apache/thermos/runner:thermos_runner'])[0m
[1m[31mE + where <function call at 0x7fb4a3d919b0> = subprocess.call[0m
src/test/python/apache/aurora/executor/test_thermos_executor.py:185: AssertionError
-------------- Captured stderr call --------------
Traceback (most recent call last):
File "<https://builds.apache.org/job/Aurora/ws/.home/.cache/pants/setup/bootstrap-Linux-x86_64/1.1.0-rc7/bin/pants",> line 7, in <module>
from pants.bin.pants_exe import main
ImportError: No module named pants.bin.pants_exe
_____________ test_waiting_executor ______________
[1m def test_waiting_executor():[0m
[1m proxy_driver = ProxyDriver()[0m
[1m with temporary_dir() as checkpoint_root:[0m
[1m te = AuroraExecutor([0m
[1m> runner_provider=make_provider(checkpoint_root),[0m
[1m sandbox_provider=DefaultTestSandboxProvider())[0m
src/test/python/apache/aurora/executor/test_thermos_executor.py:580:
_ _ _ _ _ _ _ _ _ _ _ _ _ _ _ _ _ _ _ _ _ _ _ _ _
src/test/python/apache/aurora/executor/test_thermos_executor.py:193: in make_provider
[1m pex_location=thermos_runner_path(),[0m
_ _ _ _ _ _ _ _ _ _ _ _ _ _ _ _ _ _ _ _ _ _ _ _ _
build = True
[1m def thermos_runner_path(build=True):[0m
[1m if not build:[0m
[1m return getattr(thermos_runner_path, 'value', None)[0m
[1m [0m
[1m if not hasattr(thermos_runner_path, 'value'):[0m
[1m pex_dir = safe_mkdtemp()[0m
[1m> assert subprocess.call(["./pants", "--pants-distdir=%s" % pex_dir, "binary",[0m
[1m "src/main/python/apache/thermos/runner:thermos_runner"]) == 0[0m
[1m[31mE assert 1 == 0[0m
[1m[31mE + where 1 = <function call at 0x7fb4a3d919b0>(['./pants', '--pants-distdir=/tmp/tmpMbfhMR', 'binary', 'src/main/python/apache/thermos/runner:thermos_runner'])[0m
[1m[31mE + where <function call at 0x7fb4a3d919b0> = subprocess.call[0m
src/test/python/apache/aurora/executor/test_thermos_executor.py:185: AssertionError
-------------- Captured stderr call --------------
Traceback (most recent call last):
File "<https://builds.apache.org/job/Aurora/ws/.home/.cache/pants/setup/bootstrap-Linux-x86_64/1.1.0-rc7/bin/pants",> line 7, in <module>
from pants.bin.pants_exe import main
ImportError: No module named pants.bin.pants_exe
generated xml file: <https://builds.apache.org/job/Aurora/ws/dist/test-results/415337499eb72578eab327a6487c1f5c9452b3d6.xml>
[1m[31m 16 failed, 661 passed, 6 skipped, 1 warnings, 8 error in 157.14 seconds [0m
FAILURE
18:11:29 03:01 [complete][31m
FAILURE[0m
Build step 'Execute shell' marked build as failure
Recording test results
Jenkins build is back to normal : Aurora #1577
Posted by Apache Jenkins Server <je...@builds.apache.org>.
See <https://builds.apache.org/job/Aurora/1577/changes>
Build failed in Jenkins: Aurora #1576
Posted by Apache Jenkins Server <je...@builds.apache.org>.
See <https://builds.apache.org/job/Aurora/1576/changes>
Changes:
[zmanji] Remove unnecessary guice container parameters.
[zmanji] Bump jetty dependency to the latest release.
------------------------------------------
[...truncated 4409 lines...]
from pants.bin.pants_exe import main
ImportError: No module named pants.bin.pants_exe
TestThermosExecutor.test_failing_runner_initialize
self = <test_thermos_executor.TestThermosExecutor object at 0x7fc42b55f4d0>
[1m def test_failing_runner_initialize(self):[0m
[1m proxy_driver = ProxyDriver()[0m
[1m [0m
[1m with temporary_dir() as td:[0m
[1m te = FastThermosExecutor([0m
[1m> runner_provider=make_provider(td),[0m
[1m sandbox_provider=FailingSandboxProvider())[0m
src/test/python/apache/aurora/executor/test_thermos_executor.py:480:
_ _ _ _ _ _ _ _ _ _ _ _ _ _ _ _ _ _ _ _ _ _ _ _ _
src/test/python/apache/aurora/executor/test_thermos_executor.py:193: in make_provider
[1m pex_location=thermos_runner_path(),[0m
_ _ _ _ _ _ _ _ _ _ _ _ _ _ _ _ _ _ _ _ _ _ _ _ _
build = True
[1m def thermos_runner_path(build=True):[0m
[1m if not build:[0m
[1m return getattr(thermos_runner_path, 'value', None)[0m
[1m [0m
[1m if not hasattr(thermos_runner_path, 'value'):[0m
[1m pex_dir = safe_mkdtemp()[0m
[1m> assert subprocess.call(["./pants", "--pants-distdir=%s" % pex_dir, "binary",[0m
[1m "src/main/python/apache/thermos/runner:thermos_runner"]) == 0[0m
[1m[31mE assert 1 == 0[0m
[1m[31mE + where 1 = <function call at 0x7fc4fbfdd9b0>(['./pants', '--pants-distdir=/tmp/tmp5gjUCd', 'binary', 'src/main/python/apache/thermos/runner:thermos_runner'])[0m
[1m[31mE + where <function call at 0x7fc4fbfdd9b0> = subprocess.call[0m
src/test/python/apache/aurora/executor/test_thermos_executor.py:185: AssertionError
-------------- Captured stderr call --------------
Traceback (most recent call last):
File "<https://builds.apache.org/job/Aurora/ws/.home/.cache/pants/setup/bootstrap-Linux-x86_64/1.1.0-rc7/bin/pants",> line 7, in <module>
from pants.bin.pants_exe import main
ImportError: No module named pants.bin.pants_exe
TestThermosExecutor.test_failing_runner_initialize_unknown_exception
self = <test_thermos_executor.TestThermosExecutor object at 0x7fc42b54df90>
[1m def test_failing_runner_initialize_unknown_exception(self):[0m
[1m proxy_driver = ProxyDriver()[0m
[1m [0m
[1m with temporary_dir() as td:[0m
[1m te = FastThermosExecutor([0m
[1m> runner_provider=make_provider(td),[0m
[1m sandbox_provider=FailingSandboxProvider(exception_type=Exception))[0m
src/test/python/apache/aurora/executor/test_thermos_executor.py:493:
_ _ _ _ _ _ _ _ _ _ _ _ _ _ _ _ _ _ _ _ _ _ _ _ _
src/test/python/apache/aurora/executor/test_thermos_executor.py:193: in make_provider
[1m pex_location=thermos_runner_path(),[0m
_ _ _ _ _ _ _ _ _ _ _ _ _ _ _ _ _ _ _ _ _ _ _ _ _
build = True
[1m def thermos_runner_path(build=True):[0m
[1m if not build:[0m
[1m return getattr(thermos_runner_path, 'value', None)[0m
[1m [0m
[1m if not hasattr(thermos_runner_path, 'value'):[0m
[1m pex_dir = safe_mkdtemp()[0m
[1m> assert subprocess.call(["./pants", "--pants-distdir=%s" % pex_dir, "binary",[0m
[1m "src/main/python/apache/thermos/runner:thermos_runner"]) == 0[0m
[1m[31mE assert 1 == 0[0m
[1m[31mE + where 1 = <function call at 0x7fc4fbfdd9b0>(['./pants', '--pants-distdir=/tmp/tmpNOIF13', 'binary', 'src/main/python/apache/thermos/runner:thermos_runner'])[0m
[1m[31mE + where <function call at 0x7fc4fbfdd9b0> = subprocess.call[0m
src/test/python/apache/aurora/executor/test_thermos_executor.py:185: AssertionError
-------------- Captured stderr call --------------
Traceback (most recent call last):
File "<https://builds.apache.org/job/Aurora/ws/.home/.cache/pants/setup/bootstrap-Linux-x86_64/1.1.0-rc7/bin/pants",> line 7, in <module>
from pants.bin.pants_exe import main
ImportError: No module named pants.bin.pants_exe
TestThermosExecutor.test_slow_runner_initialize _
self = <test_thermos_executor.TestThermosExecutor object at 0x7fc42b55f310>
[1m def test_slow_runner_initialize(self):[0m
[1m proxy_driver = ProxyDriver()[0m
[1m [0m
[1m task = make_task(HELLO_WORLD_MTI)[0m
[1m [0m
[1m with temporary_dir() as td:[0m
[1m te = FastThermosExecutor([0m
[1m> runner_provider=make_provider(td),[0m
[1m sandbox_provider=SlowSandboxProvider())[0m
src/test/python/apache/aurora/executor/test_thermos_executor.py:508:
_ _ _ _ _ _ _ _ _ _ _ _ _ _ _ _ _ _ _ _ _ _ _ _ _
src/test/python/apache/aurora/executor/test_thermos_executor.py:193: in make_provider
[1m pex_location=thermos_runner_path(),[0m
_ _ _ _ _ _ _ _ _ _ _ _ _ _ _ _ _ _ _ _ _ _ _ _ _
build = True
[1m def thermos_runner_path(build=True):[0m
[1m if not build:[0m
[1m return getattr(thermos_runner_path, 'value', None)[0m
[1m [0m
[1m if not hasattr(thermos_runner_path, 'value'):[0m
[1m pex_dir = safe_mkdtemp()[0m
[1m> assert subprocess.call(["./pants", "--pants-distdir=%s" % pex_dir, "binary",[0m
[1m "src/main/python/apache/thermos/runner:thermos_runner"]) == 0[0m
[1m[31mE assert 1 == 0[0m
[1m[31mE + where 1 = <function call at 0x7fc4fbfdd9b0>(['./pants', '--pants-distdir=/tmp/tmp3WIe7a', 'binary', 'src/main/python/apache/thermos/runner:thermos_runner'])[0m
[1m[31mE + where <function call at 0x7fc4fbfdd9b0> = subprocess.call[0m
src/test/python/apache/aurora/executor/test_thermos_executor.py:185: AssertionError
-------------- Captured stderr call --------------
Traceback (most recent call last):
File "<https://builds.apache.org/job/Aurora/ws/.home/.cache/pants/setup/bootstrap-Linux-x86_64/1.1.0-rc7/bin/pants",> line 7, in <module>
from pants.bin.pants_exe import main
ImportError: No module named pants.bin.pants_exe
TestThermosExecutor.test_killTask_during_runner_initialize
self = <test_thermos_executor.TestThermosExecutor object at 0x7fc42b55de90>
[1m def test_killTask_during_runner_initialize(self): # noqa[0m
[1m proxy_driver = ProxyDriver()[0m
[1m [0m
[1m task = make_task(HELLO_WORLD_MTI)[0m
[1m [0m
[1m with temporary_dir() as td:[0m
[1m te = FastThermosExecutor([0m
[1m> runner_provider=make_provider(td),[0m
[1m sandbox_provider=SlowSandboxProvider())[0m
src/test/python/apache/aurora/executor/test_thermos_executor.py:527:
_ _ _ _ _ _ _ _ _ _ _ _ _ _ _ _ _ _ _ _ _ _ _ _ _
src/test/python/apache/aurora/executor/test_thermos_executor.py:193: in make_provider
[1m pex_location=thermos_runner_path(),[0m
_ _ _ _ _ _ _ _ _ _ _ _ _ _ _ _ _ _ _ _ _ _ _ _ _
build = True
[1m def thermos_runner_path(build=True):[0m
[1m if not build:[0m
[1m return getattr(thermos_runner_path, 'value', None)[0m
[1m [0m
[1m if not hasattr(thermos_runner_path, 'value'):[0m
[1m pex_dir = safe_mkdtemp()[0m
[1m> assert subprocess.call(["./pants", "--pants-distdir=%s" % pex_dir, "binary",[0m
[1m "src/main/python/apache/thermos/runner:thermos_runner"]) == 0[0m
[1m[31mE assert 1 == 0[0m
[1m[31mE + where 1 = <function call at 0x7fc4fbfdd9b0>(['./pants', '--pants-distdir=/tmp/tmpxZN3ye', 'binary', 'src/main/python/apache/thermos/runner:thermos_runner'])[0m
[1m[31mE + where <function call at 0x7fc4fbfdd9b0> = subprocess.call[0m
src/test/python/apache/aurora/executor/test_thermos_executor.py:185: AssertionError
-------------- Captured stderr call --------------
Traceback (most recent call last):
File "<https://builds.apache.org/job/Aurora/ws/.home/.cache/pants/setup/bootstrap-Linux-x86_64/1.1.0-rc7/bin/pants",> line 7, in <module>
from pants.bin.pants_exe import main
ImportError: No module named pants.bin.pants_exe
TestThermosExecutor.test_launchTask_deserialization_fail
self = <test_thermos_executor.TestThermosExecutor object at 0x7fc42b598750>
[1m def test_launchTask_deserialization_fail(self): # noqa[0m
[1m proxy_driver = ProxyDriver()[0m
[1m [0m
[1m role = getpass.getuser()[0m
[1m task_info = mesos_pb2.TaskInfo()[0m
[1m task_info.name = task_info.task_id.value = 'broken'[0m
[1m task_info.data = serialize([0m
[1m AssignedTask([0m
[1m task=TaskConfig([0m
[1m job=JobKey(role=role, environment='env', name='name'),[0m
[1m executorConfig=ExecutorConfig(name=AURORA_EXECUTOR_NAME, data='garbage'))))[0m
[1m [0m
[1m te = FastThermosExecutor([0m
[1m> runner_provider=make_provider(safe_mkdtemp()),[0m
[1m sandbox_provider=DefaultTestSandboxProvider())[0m
src/test/python/apache/aurora/executor/test_thermos_executor.py:565:
_ _ _ _ _ _ _ _ _ _ _ _ _ _ _ _ _ _ _ _ _ _ _ _ _
src/test/python/apache/aurora/executor/test_thermos_executor.py:193: in make_provider
[1m pex_location=thermos_runner_path(),[0m
_ _ _ _ _ _ _ _ _ _ _ _ _ _ _ _ _ _ _ _ _ _ _ _ _
build = True
[1m def thermos_runner_path(build=True):[0m
[1m if not build:[0m
[1m return getattr(thermos_runner_path, 'value', None)[0m
[1m [0m
[1m if not hasattr(thermos_runner_path, 'value'):[0m
[1m pex_dir = safe_mkdtemp()[0m
[1m> assert subprocess.call(["./pants", "--pants-distdir=%s" % pex_dir, "binary",[0m
[1m "src/main/python/apache/thermos/runner:thermos_runner"]) == 0[0m
[1m[31mE assert 1 == 0[0m
[1m[31mE + where 1 = <function call at 0x7fc4fbfdd9b0>(['./pants', '--pants-distdir=/tmp/tmp62EUuB', 'binary', 'src/main/python/apache/thermos/runner:thermos_runner'])[0m
[1m[31mE + where <function call at 0x7fc4fbfdd9b0> = subprocess.call[0m
src/test/python/apache/aurora/executor/test_thermos_executor.py:185: AssertionError
-------------- Captured stderr call --------------
Traceback (most recent call last):
File "<https://builds.apache.org/job/Aurora/ws/.home/.cache/pants/setup/bootstrap-Linux-x86_64/1.1.0-rc7/bin/pants",> line 7, in <module>
from pants.bin.pants_exe import main
ImportError: No module named pants.bin.pants_exe
_____________ test_waiting_executor ______________
[1m def test_waiting_executor():[0m
[1m proxy_driver = ProxyDriver()[0m
[1m with temporary_dir() as checkpoint_root:[0m
[1m te = AuroraExecutor([0m
[1m> runner_provider=make_provider(checkpoint_root),[0m
[1m sandbox_provider=DefaultTestSandboxProvider())[0m
src/test/python/apache/aurora/executor/test_thermos_executor.py:580:
_ _ _ _ _ _ _ _ _ _ _ _ _ _ _ _ _ _ _ _ _ _ _ _ _
src/test/python/apache/aurora/executor/test_thermos_executor.py:193: in make_provider
[1m pex_location=thermos_runner_path(),[0m
_ _ _ _ _ _ _ _ _ _ _ _ _ _ _ _ _ _ _ _ _ _ _ _ _
build = True
[1m def thermos_runner_path(build=True):[0m
[1m if not build:[0m
[1m return getattr(thermos_runner_path, 'value', None)[0m
[1m [0m
[1m if not hasattr(thermos_runner_path, 'value'):[0m
[1m pex_dir = safe_mkdtemp()[0m
[1m> assert subprocess.call(["./pants", "--pants-distdir=%s" % pex_dir, "binary",[0m
[1m "src/main/python/apache/thermos/runner:thermos_runner"]) == 0[0m
[1m[31mE assert 1 == 0[0m
[1m[31mE + where 1 = <function call at 0x7fc4fbfdd9b0>(['./pants', '--pants-distdir=/tmp/tmp5kcISL', 'binary', 'src/main/python/apache/thermos/runner:thermos_runner'])[0m
[1m[31mE + where <function call at 0x7fc4fbfdd9b0> = subprocess.call[0m
src/test/python/apache/aurora/executor/test_thermos_executor.py:185: AssertionError
-------------- Captured stderr call --------------
Traceback (most recent call last):
File "<https://builds.apache.org/job/Aurora/ws/.home/.cache/pants/setup/bootstrap-Linux-x86_64/1.1.0-rc7/bin/pants",> line 7, in <module>
from pants.bin.pants_exe import main
ImportError: No module named pants.bin.pants_exe
generated xml file: <https://builds.apache.org/job/Aurora/ws/dist/test-results/415337499eb72578eab327a6487c1f5c9452b3d6.xml>
[1m[31m 16 failed, 661 passed, 6 skipped, 1 warnings, 8 error in 188.40 seconds [0m
FAILURE
18:17:51 03:30 [complete][31m
FAILURE[0m
Build step 'Execute shell' marked build as failure
Recording test results
Build failed in Jenkins: Aurora #1575
Posted by Apache Jenkins Server <je...@builds.apache.org>.
See <https://builds.apache.org/job/Aurora/1575/changes>
Changes:
[zmanji] Fix typo in `RELEASE-NOTES.md`.
------------------------------------------
[...truncated 4388 lines...]
from pants.bin.pants_exe import main
ImportError: No module named pants.bin.pants_exe
TestThermosExecutor.test_failing_runner_initialize
self = <test_thermos_executor.TestThermosExecutor object at 0x7f3dbf718cd0>
[1m def test_failing_runner_initialize(self):[0m
[1m proxy_driver = ProxyDriver()[0m
[1m [0m
[1m with temporary_dir() as td:[0m
[1m te = FastThermosExecutor([0m
[1m> runner_provider=make_provider(td),[0m
[1m sandbox_provider=FailingSandboxProvider())[0m
src/test/python/apache/aurora/executor/test_thermos_executor.py:480:
_ _ _ _ _ _ _ _ _ _ _ _ _ _ _ _ _ _ _ _ _ _ _ _ _
src/test/python/apache/aurora/executor/test_thermos_executor.py:193: in make_provider
[1m pex_location=thermos_runner_path(),[0m
_ _ _ _ _ _ _ _ _ _ _ _ _ _ _ _ _ _ _ _ _ _ _ _ _
build = True
[1m def thermos_runner_path(build=True):[0m
[1m if not build:[0m
[1m return getattr(thermos_runner_path, 'value', None)[0m
[1m [0m
[1m if not hasattr(thermos_runner_path, 'value'):[0m
[1m pex_dir = safe_mkdtemp()[0m
[1m> assert subprocess.call(["./pants", "--pants-distdir=%s" % pex_dir, "binary",[0m
[1m "src/main/python/apache/thermos/runner:thermos_runner"]) == 0[0m
[1m[31mE assert 1 == 0[0m
[1m[31mE + where 1 = <function call at 0x7f3e0e13e9b0>(['./pants', '--pants-distdir=/tmp/user/10021/tmpFapHFB', 'binary', 'src/main/python/apache/thermos/runner:thermos_runner'])[0m
[1m[31mE + where <function call at 0x7f3e0e13e9b0> = subprocess.call[0m
src/test/python/apache/aurora/executor/test_thermos_executor.py:185: AssertionError
-------------- Captured stderr call --------------
Traceback (most recent call last):
File "<https://builds.apache.org/job/Aurora/ws/.home/.cache/pants/setup/bootstrap-Linux-x86_64/1.1.0-rc7/bin/pants",> line 7, in <module>
from pants.bin.pants_exe import main
ImportError: No module named pants.bin.pants_exe
TestThermosExecutor.test_failing_runner_initialize_unknown_exception
self = <test_thermos_executor.TestThermosExecutor object at 0x7f3dbf71dc10>
[1m def test_failing_runner_initialize_unknown_exception(self):[0m
[1m proxy_driver = ProxyDriver()[0m
[1m [0m
[1m with temporary_dir() as td:[0m
[1m te = FastThermosExecutor([0m
[1m> runner_provider=make_provider(td),[0m
[1m sandbox_provider=FailingSandboxProvider(exception_type=Exception))[0m
src/test/python/apache/aurora/executor/test_thermos_executor.py:493:
_ _ _ _ _ _ _ _ _ _ _ _ _ _ _ _ _ _ _ _ _ _ _ _ _
src/test/python/apache/aurora/executor/test_thermos_executor.py:193: in make_provider
[1m pex_location=thermos_runner_path(),[0m
_ _ _ _ _ _ _ _ _ _ _ _ _ _ _ _ _ _ _ _ _ _ _ _ _
build = True
[1m def thermos_runner_path(build=True):[0m
[1m if not build:[0m
[1m return getattr(thermos_runner_path, 'value', None)[0m
[1m [0m
[1m if not hasattr(thermos_runner_path, 'value'):[0m
[1m pex_dir = safe_mkdtemp()[0m
[1m> assert subprocess.call(["./pants", "--pants-distdir=%s" % pex_dir, "binary",[0m
[1m "src/main/python/apache/thermos/runner:thermos_runner"]) == 0[0m
[1m[31mE assert 1 == 0[0m
[1m[31mE + where 1 = <function call at 0x7f3e0e13e9b0>(['./pants', '--pants-distdir=/tmp/user/10021/tmp9NnL6W', 'binary', 'src/main/python/apache/thermos/runner:thermos_runner'])[0m
[1m[31mE + where <function call at 0x7f3e0e13e9b0> = subprocess.call[0m
src/test/python/apache/aurora/executor/test_thermos_executor.py:185: AssertionError
-------------- Captured stderr call --------------
Traceback (most recent call last):
File "<https://builds.apache.org/job/Aurora/ws/.home/.cache/pants/setup/bootstrap-Linux-x86_64/1.1.0-rc7/bin/pants",> line 7, in <module>
from pants.bin.pants_exe import main
ImportError: No module named pants.bin.pants_exe
TestThermosExecutor.test_slow_runner_initialize _
self = <test_thermos_executor.TestThermosExecutor object at 0x7f3dbf868c10>
[1m def test_slow_runner_initialize(self):[0m
[1m proxy_driver = ProxyDriver()[0m
[1m [0m
[1m task = make_task(HELLO_WORLD_MTI)[0m
[1m [0m
[1m with temporary_dir() as td:[0m
[1m te = FastThermosExecutor([0m
[1m> runner_provider=make_provider(td),[0m
[1m sandbox_provider=SlowSandboxProvider())[0m
src/test/python/apache/aurora/executor/test_thermos_executor.py:508:
_ _ _ _ _ _ _ _ _ _ _ _ _ _ _ _ _ _ _ _ _ _ _ _ _
src/test/python/apache/aurora/executor/test_thermos_executor.py:193: in make_provider
[1m pex_location=thermos_runner_path(),[0m
_ _ _ _ _ _ _ _ _ _ _ _ _ _ _ _ _ _ _ _ _ _ _ _ _
build = True
[1m def thermos_runner_path(build=True):[0m
[1m if not build:[0m
[1m return getattr(thermos_runner_path, 'value', None)[0m
[1m [0m
[1m if not hasattr(thermos_runner_path, 'value'):[0m
[1m pex_dir = safe_mkdtemp()[0m
[1m> assert subprocess.call(["./pants", "--pants-distdir=%s" % pex_dir, "binary",[0m
[1m "src/main/python/apache/thermos/runner:thermos_runner"]) == 0[0m
[1m[31mE assert 1 == 0[0m
[1m[31mE + where 1 = <function call at 0x7f3e0e13e9b0>(['./pants', '--pants-distdir=/tmp/user/10021/tmpYUiNmS', 'binary', 'src/main/python/apache/thermos/runner:thermos_runner'])[0m
[1m[31mE + where <function call at 0x7f3e0e13e9b0> = subprocess.call[0m
src/test/python/apache/aurora/executor/test_thermos_executor.py:185: AssertionError
-------------- Captured stderr call --------------
Traceback (most recent call last):
File "<https://builds.apache.org/job/Aurora/ws/.home/.cache/pants/setup/bootstrap-Linux-x86_64/1.1.0-rc7/bin/pants",> line 7, in <module>
from pants.bin.pants_exe import main
ImportError: No module named pants.bin.pants_exe
TestThermosExecutor.test_killTask_during_runner_initialize
self = <test_thermos_executor.TestThermosExecutor object at 0x7f3dbf95ff10>
[1m def test_killTask_during_runner_initialize(self): # noqa[0m
[1m proxy_driver = ProxyDriver()[0m
[1m [0m
[1m task = make_task(HELLO_WORLD_MTI)[0m
[1m [0m
[1m with temporary_dir() as td:[0m
[1m te = FastThermosExecutor([0m
[1m> runner_provider=make_provider(td),[0m
[1m sandbox_provider=SlowSandboxProvider())[0m
src/test/python/apache/aurora/executor/test_thermos_executor.py:527:
_ _ _ _ _ _ _ _ _ _ _ _ _ _ _ _ _ _ _ _ _ _ _ _ _
src/test/python/apache/aurora/executor/test_thermos_executor.py:193: in make_provider
[1m pex_location=thermos_runner_path(),[0m
_ _ _ _ _ _ _ _ _ _ _ _ _ _ _ _ _ _ _ _ _ _ _ _ _
build = True
[1m def thermos_runner_path(build=True):[0m
[1m if not build:[0m
[1m return getattr(thermos_runner_path, 'value', None)[0m
[1m [0m
[1m if not hasattr(thermos_runner_path, 'value'):[0m
[1m pex_dir = safe_mkdtemp()[0m
[1m> assert subprocess.call(["./pants", "--pants-distdir=%s" % pex_dir, "binary",[0m
[1m "src/main/python/apache/thermos/runner:thermos_runner"]) == 0[0m
[1m[31mE assert 1 == 0[0m
[1m[31mE + where 1 = <function call at 0x7f3e0e13e9b0>(['./pants', '--pants-distdir=/tmp/user/10021/tmpmfMagj', 'binary', 'src/main/python/apache/thermos/runner:thermos_runner'])[0m
[1m[31mE + where <function call at 0x7f3e0e13e9b0> = subprocess.call[0m
src/test/python/apache/aurora/executor/test_thermos_executor.py:185: AssertionError
-------------- Captured stderr call --------------
Traceback (most recent call last):
File "<https://builds.apache.org/job/Aurora/ws/.home/.cache/pants/setup/bootstrap-Linux-x86_64/1.1.0-rc7/bin/pants",> line 7, in <module>
from pants.bin.pants_exe import main
ImportError: No module named pants.bin.pants_exe
TestThermosExecutor.test_launchTask_deserialization_fail
self = <test_thermos_executor.TestThermosExecutor object at 0x7f3dbf6d6510>
[1m def test_launchTask_deserialization_fail(self): # noqa[0m
[1m proxy_driver = ProxyDriver()[0m
[1m [0m
[1m role = getpass.getuser()[0m
[1m task_info = mesos_pb2.TaskInfo()[0m
[1m task_info.name = task_info.task_id.value = 'broken'[0m
[1m task_info.data = serialize([0m
[1m AssignedTask([0m
[1m task=TaskConfig([0m
[1m job=JobKey(role=role, environment='env', name='name'),[0m
[1m executorConfig=ExecutorConfig(name=AURORA_EXECUTOR_NAME, data='garbage'))))[0m
[1m [0m
[1m te = FastThermosExecutor([0m
[1m> runner_provider=make_provider(safe_mkdtemp()),[0m
[1m sandbox_provider=DefaultTestSandboxProvider())[0m
src/test/python/apache/aurora/executor/test_thermos_executor.py:565:
_ _ _ _ _ _ _ _ _ _ _ _ _ _ _ _ _ _ _ _ _ _ _ _ _
src/test/python/apache/aurora/executor/test_thermos_executor.py:193: in make_provider
[1m pex_location=thermos_runner_path(),[0m
_ _ _ _ _ _ _ _ _ _ _ _ _ _ _ _ _ _ _ _ _ _ _ _ _
build = True
[1m def thermos_runner_path(build=True):[0m
[1m if not build:[0m
[1m return getattr(thermos_runner_path, 'value', None)[0m
[1m [0m
[1m if not hasattr(thermos_runner_path, 'value'):[0m
[1m pex_dir = safe_mkdtemp()[0m
[1m> assert subprocess.call(["./pants", "--pants-distdir=%s" % pex_dir, "binary",[0m
[1m "src/main/python/apache/thermos/runner:thermos_runner"]) == 0[0m
[1m[31mE assert 1 == 0[0m
[1m[31mE + where 1 = <function call at 0x7f3e0e13e9b0>(['./pants', '--pants-distdir=/tmp/user/10021/tmpiHloko', 'binary', 'src/main/python/apache/thermos/runner:thermos_runner'])[0m
[1m[31mE + where <function call at 0x7f3e0e13e9b0> = subprocess.call[0m
src/test/python/apache/aurora/executor/test_thermos_executor.py:185: AssertionError
-------------- Captured stderr call --------------
Traceback (most recent call last):
File "<https://builds.apache.org/job/Aurora/ws/.home/.cache/pants/setup/bootstrap-Linux-x86_64/1.1.0-rc7/bin/pants",> line 7, in <module>
from pants.bin.pants_exe import main
ImportError: No module named pants.bin.pants_exe
_____________ test_waiting_executor ______________
[1m def test_waiting_executor():[0m
[1m proxy_driver = ProxyDriver()[0m
[1m with temporary_dir() as checkpoint_root:[0m
[1m te = AuroraExecutor([0m
[1m> runner_provider=make_provider(checkpoint_root),[0m
[1m sandbox_provider=DefaultTestSandboxProvider())[0m
src/test/python/apache/aurora/executor/test_thermos_executor.py:580:
_ _ _ _ _ _ _ _ _ _ _ _ _ _ _ _ _ _ _ _ _ _ _ _ _
src/test/python/apache/aurora/executor/test_thermos_executor.py:193: in make_provider
[1m pex_location=thermos_runner_path(),[0m
_ _ _ _ _ _ _ _ _ _ _ _ _ _ _ _ _ _ _ _ _ _ _ _ _
build = True
[1m def thermos_runner_path(build=True):[0m
[1m if not build:[0m
[1m return getattr(thermos_runner_path, 'value', None)[0m
[1m [0m
[1m if not hasattr(thermos_runner_path, 'value'):[0m
[1m pex_dir = safe_mkdtemp()[0m
[1m> assert subprocess.call(["./pants", "--pants-distdir=%s" % pex_dir, "binary",[0m
[1m "src/main/python/apache/thermos/runner:thermos_runner"]) == 0[0m
[1m[31mE assert 1 == 0[0m
[1m[31mE + where 1 = <function call at 0x7f3e0e13e9b0>(['./pants', '--pants-distdir=/tmp/user/10021/tmpJlZfbi', 'binary', 'src/main/python/apache/thermos/runner:thermos_runner'])[0m
[1m[31mE + where <function call at 0x7f3e0e13e9b0> = subprocess.call[0m
src/test/python/apache/aurora/executor/test_thermos_executor.py:185: AssertionError
-------------- Captured stderr call --------------
Traceback (most recent call last):
File "<https://builds.apache.org/job/Aurora/ws/.home/.cache/pants/setup/bootstrap-Linux-x86_64/1.1.0-rc7/bin/pants",> line 7, in <module>
from pants.bin.pants_exe import main
ImportError: No module named pants.bin.pants_exe
generated xml file: <https://builds.apache.org/job/Aurora/ws/dist/test-results/415337499eb72578eab327a6487c1f5c9452b3d6.xml>
[1m[31m 16 failed, 661 passed, 6 skipped, 1 warnings, 8 error in 190.44 seconds [0m
FAILURE
19:04:06 03:39 [complete][31m
FAILURE[0m
Build step 'Execute shell' marked build as failure
Recording test results