You are viewing a plain text version of this content. The canonical link for it is here.
Posted to builds@cassandra.apache.org by Apache Jenkins Server <je...@builds.apache.org> on 2026/07/24 16:37:12 UTC
Build complete: Cassandra-6.0 #81 [UNSTABLE] 4066139d3f74df96b746e5f605d4a9137b16a171
-------------------------------------------------------------------------------
Build Cassandra-6.0 #81 Still unstable
URL: https://ci-cassandra.apache.org/job/Cassandra-6.0/81/
-------------------------------------------------------------------------------
Changes:
No changes
-------------------------------------------------------------------------------
Failed Tests:
38 tests failed.
FAILED: dtest-latest.disk_balance_test.TestDiskBalance.Tests / dtest-latest jdk11 49/64 / test_disk_balance_after_boundary_change_lcs
FAILED: dtest-latest.disk_balance_test.TestDiskBalance.Tests / dtest-latest jdk11 49/64 / test_disk_balance_after_boundary_change_lcs
FAILED: dtest-latest.repair_tests.incremental_repair_test.TestIncRepair.Tests / dtest-latest jdk17 33/64 / test_sstable_marking
FAILED: dtest-novnode.materialized_views_test.TestMaterializedViews.Tests / dtest-novnode jdk11 23/64 / test_complex_mv_select_statements
FAILED: dtest-novnode.pushed_notifications_test.TestPushedNotifications.Tests / dtest-novnode jdk11 56/64 / test_move_single_node_localhost
FAILED: dtest-upgrade-novnode.upgrade_tests.cql_tests.TestCQLNodes2RF1_Upgrade_indev_4_0_x_To_indev_6_0_x.Tests / dtest-upgrade-novnode jdk11 107/160 / test_large_clustering_in
FAILED: dtest-upgrade-novnode.upgrade_tests.cql_tests.TestCQLNodes2RF1_Upgrade_indev_4_0_x_To_indev_6_0_x.Tests / dtest-upgrade-novnode jdk11 108/160 / test_timeuuid
FAILED: dtest-upgrade-novnode.upgrade_tests.cql_tests.TestCQLNodes2RF1_Upgrade_indev_4_1_x_To_indev_6_0_x.Tests / dtest-upgrade-novnode jdk11 107/160 / test_NPE_during_select_with_token
FAILED: dtest-upgrade-novnode.upgrade_tests.cql_tests.TestCQLNodes2RF1_Upgrade_indev_4_1_x_To_indev_6_0_x.Tests / dtest-upgrade-novnode jdk11 104/160 / test_conversion_functions
FAILED: dtest-upgrade-novnode.upgrade_tests.cql_tests.TestCQLNodes2RF1_Upgrade_indev_4_1_x_To_indev_6_0_x.Tests / dtest-upgrade-novnode jdk11 97/160 / test_float_with_exponent
FAILED: dtest-upgrade-novnode.upgrade_tests.cql_tests.TestCQLNodes2RF1_Upgrade_indev_5_0_x_To_indev_6_0_x.Tests / dtest-upgrade-novnode jdk11 109/160 / test_function_with_null
FAILED: dtest-upgrade-novnode.upgrade_tests.cql_tests.TestCQLNodes2RF1_Upgrade_indev_5_0_x_To_indev_6_0_x.Tests / dtest-upgrade-novnode jdk11 104/160 / test_nonpure_function_collection
FAILED: dtest-upgrade-novnode.upgrade_tests.cql_tests.TestCQLNodes2RF1_Upgrade_indev_5_0_x_To_indev_6_0_x.Tests / dtest-upgrade-novnode jdk11 107/160 / test_select_distinct
FAILED: dtest-upgrade-novnode.upgrade_tests.cql_tests.TestCQLNodes2RF1_Upgrade_indev_5_0_x_To_indev_6_0_x.Tests / dtest-upgrade-novnode jdk11 108/160 / test_select_distinct_with_deletions
FAILED: dtest-upgrade-novnode.upgrade_tests.cql_tests.TestCQLNodes3RF3_Upgrade_indev_4_0_x_To_indev_6_0_x.Tests / dtest-upgrade-novnode jdk11 109/160 / test_blobAs_functions
FAILED: dtest-upgrade-novnode.upgrade_tests.cql_tests.TestCQLNodes3RF3_Upgrade_indev_4_1_x_To_indev_6_0_x.Tests / dtest-upgrade-novnode jdk11 109/160 / test_materialized_view_simple
FAILED: dtest-upgrade-novnode.upgrade_tests.paging_test.TestPagingWithDeletionsNodes2RF1_Upgrade_indev_4_0_x_To_indev_6_0_x.Tests / dtest-upgrade-novnode jdk11 102/160 / test_single_cell_deletions
FAILED: dtest-upgrade-novnode.upgrade_tests.paging_test.TestPagingWithDeletionsNodes2RF1_Upgrade_indev_4_0_x_To_indev_6_0_x.Tests / dtest-upgrade-novnode jdk11 104/160 / test_ttl_deletions
FAILED: dtest-upgrade-novnode.upgrade_tests.paging_test.TestPagingWithDeletionsNodes2RF1_Upgrade_indev_4_1_x_To_indev_6_0_x.Tests / dtest-upgrade-novnode jdk11 107/160 / test_multiple_partition_deletions
FAILED: dtest-upgrade-novnode.upgrade_tests.paging_test.TestPagingWithDeletionsNodes2RF1_Upgrade_indev_4_1_x_To_indev_6_0_x.Tests / dtest-upgrade-novnode jdk11 108/160 / test_single_row_deletions
FAILED: dtest-upgrade-novnode.upgrade_tests.paging_test.TestPagingWithModifiersNodes3RF3_Upgrade_indev_4_1_x_To_indev_6_0_x.Tests / dtest-upgrade-novnode jdk11 102/160 / test_with_allow_filtering
FAILED: dtest-upgrade-novnode.upgrade_tests.paging_test.TestPagingWithModifiersNodes3RF3_Upgrade_indev_5_0_x_To_indev_6_0_x.Tests / dtest-upgrade-novnode jdk11 104/160 / test_with_order_by_reversed
FAILED: dtest-upgrade.upgrade_tests.cql_tests.TestCQLNodes2RF1_Upgrade_indev_4_0_x_To_indev_6_0_x.Tests / dtest-upgrade jdk11 108/160 / test_indexes_composite
FAILED: dtest-upgrade.upgrade_tests.cql_tests.TestCQLNodes2RF1_Upgrade_indev_5_0_x_To_indev_6_0_x.Tests / dtest-upgrade jdk11 108/160 / test_add_deletion_info_in_unsorted_column
FAILED: dtest-upgrade.upgrade_tests.cql_tests.TestCQLNodes3RF3_Upgrade_indev_4_0_x_To_indev_6_0_x.Tests / dtest-upgrade jdk11 112/160 / test_list
FAILED: dtest-upgrade.upgrade_tests.cql_tests.TestCQLNodes3RF3_Upgrade_indev_4_1_x_To_indev_6_0_x.Tests / dtest-upgrade jdk11 112/160 / test_range_with_deletes
FAILED: org.apache.cassandra.distributed.test.accord.AccordRecoverFromAvailabilityLossTest.Tests / jvm-dtest jdk11 9/16 / replaceWithAvailabilityLossTest-_jdk11_x86_64
FAILED: org.apache.cassandra.distributed.test.accord.InteropAccordCQLTest.Tests / jvm-dtest jdk17 16/16 / testCASSimulatorLite-_jdk17_x86_64
FAILED: org.apache.cassandra.distributed.test.cql3.PaxosV1MultiNodeTableWalkTest.Tests / jvm-dtest jdk17 4/16 / test-_jdk17_x86_64
FAILED: org.apache.cassandra.service.accord.journal.AccordJournalBurnTest.Tests / jvm-dtest jdk11 16/16 / testOne-_jdk11_x86_64
FAILED: org.apache.cassandra.simulator.test.TrivialSimulationTest.Tests / simulator-dtest jdk11 2/2 / trivialTest-_jdk11_x86_64
FAILED: org.apache.cassandra.distributed.test.accord.InteropAccordCQLTest.Tests / jvm-dtest jdk21 16/16 / testCASSimulatorLite-_jdk21_x86_64
FAILED: org.apache.cassandra.simulator.test.EpochStressTest.Tests / simulator-dtest jdk11 2/2 / manyEpochsAndAccordConverges-_jdk11_x86_64
FAILED: org.apache.cassandra.simulator.test.SingleNodeSingleTableASTTest.Tests / simulator-dtest jdk11 1/2 / accordFull-_jdk11_x86_64
FAILED: org.apache.cassandra.simulator.test.SingleNodeSingleTableASTTest.Tests / simulator-dtest jdk11 1/2 / accordMixedReads-_jdk11_x86_64
FAILED: org.apache.cassandra.simulator.test.AccordHarrySimulationTest.Tests / simulator-dtest jdk11 2/2 / test-_jdk11_x86_64
FAILED: org.apache.cassandra.simulator.test.ShortPaxosSimulationTest.Tests / simulator-dtest jdk11 2/2 / selfReconcileTest-cassandra.testtag_IS_UNDEFINED
FAILED: org.apache.cassandra.fuzz.sai.MultiNodeSAITest.Tests / jvm-dtest jdk17 2/16 / indexOnlySaiTest-cassandra.testtag_IS_UNDEFINED
-------------------------------------------------------------------------------
For complete test report and logs see https://nightlies.apache.org/cassandra/Cassandra-6.0/81/