You are viewing a plain text version of this content. The canonical link for it is here.
Posted to builds@beam.apache.org by Apache Jenkins Server <je...@builds.apache.org> on 2023/05/26 19:22:19 UTC
beam_LoadTests_Go_SideInput_Flink_Batch - Build # 884 - Aborted!
beam_LoadTests_Go_SideInput_Flink_Batch - Build # 884 - Aborted:
Check console output at https://ci-beam.apache.org/job/beam_LoadTests_Go_SideInput_Flink_Batch/884/ to view the results.
Jenkins build is back to normal : beam_LoadTests_Go_SideInput_Flink_Batch #904
Posted by Apache Jenkins Server <je...@builds.apache.org>.
See <https://ci-beam.apache.org/job/beam_LoadTests_Go_SideInput_Flink_Batch/904/display/redirect>
---------------------------------------------------------------------
To unsubscribe, e-mail: builds-unsubscribe@beam.apache.org
For additional commands, e-mail: builds-help@beam.apache.org
beam_LoadTests_Go_SideInput_Flink_Batch - Build # 903 - Aborted!
Posted by Apache Jenkins Server <je...@builds.apache.org>.
beam_LoadTests_Go_SideInput_Flink_Batch - Build # 903 - Aborted:
Check console output at https://ci-beam.apache.org/job/beam_LoadTests_Go_SideInput_Flink_Batch/903/ to view the results.
beam_LoadTests_Go_SideInput_Flink_Batch - Build # 902 - Aborted!
Posted by Apache Jenkins Server <je...@builds.apache.org>.
beam_LoadTests_Go_SideInput_Flink_Batch - Build # 902 - Aborted:
Check console output at https://ci-beam.apache.org/job/beam_LoadTests_Go_SideInput_Flink_Batch/902/ to view the results.
beam_LoadTests_Go_SideInput_Flink_Batch - Build # 901 - Aborted!
Posted by Apache Jenkins Server <je...@builds.apache.org>.
beam_LoadTests_Go_SideInput_Flink_Batch - Build # 901 - Aborted:
Check console output at https://ci-beam.apache.org/job/beam_LoadTests_Go_SideInput_Flink_Batch/901/ to view the results.
beam_LoadTests_Go_SideInput_Flink_Batch - Build # 900 - Aborted!
Posted by Apache Jenkins Server <je...@builds.apache.org>.
beam_LoadTests_Go_SideInput_Flink_Batch - Build # 900 - Aborted:
Check console output at https://ci-beam.apache.org/job/beam_LoadTests_Go_SideInput_Flink_Batch/900/ to view the results.
beam_LoadTests_Go_SideInput_Flink_Batch - Build # 899 - Aborted!
Posted by Apache Jenkins Server <je...@builds.apache.org>.
beam_LoadTests_Go_SideInput_Flink_Batch - Build # 899 - Aborted:
Check console output at https://ci-beam.apache.org/job/beam_LoadTests_Go_SideInput_Flink_Batch/899/ to view the results.
beam_LoadTests_Go_SideInput_Flink_Batch - Build # 898 - Aborted!
Posted by Apache Jenkins Server <je...@builds.apache.org>.
beam_LoadTests_Go_SideInput_Flink_Batch - Build # 898 - Aborted:
Check console output at https://ci-beam.apache.org/job/beam_LoadTests_Go_SideInput_Flink_Batch/898/ to view the results.
Build failed in Jenkins: beam_LoadTests_Go_SideInput_Flink_Batch #897
Posted by Apache Jenkins Server <je...@builds.apache.org>.
See <https://ci-beam.apache.org/job/beam_LoadTests_Go_SideInput_Flink_Batch/897/display/redirect>
Changes:
------------------------------------------
[...truncated 41.92 KB...]
at scala.PartialFunction.applyOrElse(PartialFunction.scala:127)
at scala.PartialFunction.applyOrElse$(PartialFunction.scala:126)
at akka.japi.pf.UnitCaseStatement.applyOrElse(CaseStatements.scala:20)
at scala.PartialFunction$OrElse.applyOrElse(PartialFunction.scala:175)
at scala.PartialFunction$OrElse.applyOrElse(PartialFunction.scala:176)
at scala.PartialFunction$OrElse.applyOrElse(PartialFunction.scala:176)
at akka.actor.Actor.aroundReceive(Actor.scala:537)
at akka.actor.Actor.aroundReceive$(Actor.scala:535)
at akka.actor.AbstractActor.aroundReceive(AbstractActor.scala:220)
at akka.actor.ActorCell.receiveMessage(ActorCell.scala:580)
at akka.actor.ActorCell.invoke(ActorCell.scala:548)
at akka.dispatch.Mailbox.processMailbox(Mailbox.scala:270)
at akka.dispatch.Mailbox.run(Mailbox.scala:231)
at akka.dispatch.Mailbox.exec(Mailbox.scala:243)
at java.util.concurrent.ForkJoinTask.doExec(ForkJoinTask.java:290)
at java.util.concurrent.ForkJoinPool$WorkQueue.topLevelExec(ForkJoinPool.java:1020)
at java.util.concurrent.ForkJoinPool.scan(ForkJoinPool.java:1656)
at java.util.concurrent.ForkJoinPool.runWorker(ForkJoinPool.java:1594)
at java.util.concurrent.ForkJoinWorkerThread.run(ForkJoinWorkerThread.java:183)
Caused by: java.util.concurrent.ExecutionException: java.lang.RuntimeException: Error received from SDK harness for instruction 5: process bundle failed for instruction 5 using plan 1-5 : panic: datamgr.go [{5 fn/write/n3:0}]: error flushing buffer of length 3999992
caused by:
rpc error: code = Unknown desc =
Full error:
while executing Process for Plan[1-5]:
2: DataSink[S[fn/write/n3:0@localhost:40455]] Coder:W;fn/wire/n3:0<KV;c2<bytes;c0,bytes;c0>>!GWC
3: PCollection[n3] Out:[2]
4: SDF.ProcessSizedElementsAndRestrictions[synthetic.sourceFn] UID:4 Out:[2]
1: DataSource[S[fn/read/n2/SplitAndSize0:0@localhost:40455], local_output] Out:4 Coder:W;fn/wire/n2/SplitAndSize0:0<KV;c3/SplitAndSize0<KV;c3/PairWithRestriction0<R;c3[synthetic.SourceConfig],KV;c7<offsetrange.Restriction[offsetrange.Restriction;c4];c5,bool;c6>>,double;DoubleCoder0>>!GWC
caused by:
panic: datamgr.go [{5 fn/write/n3:0}]: error flushing buffer of length 3999992
caused by:
rpc error: code = Unknown desc = goroutine 42 [running]:
runtime/debug.Stack()
/home/jenkins/sdk/go1.20.4/src/runtime/debug/stack.go:24 +0x65
github.com/apache/beam/sdks/v2/go/pkg/beam/core/runtime/exec.callNoPanic.func1()
<https://ci-beam.apache.org/job/beam_LoadTests_Go_SideInput_Flink_Batch/ws/src/sdks/go/pkg/beam/core/runtime/exec/util.go>:58 +0xa5
panic({0x145cf00, 0xc00052c440})
/home/jenkins/sdk/go1.20.4/src/runtime/panic.go:884 +0x213
github.com/apache/beam/sdks/v2/go/pkg/beam/register.(*emit2[...]).invoke(0x187f1a0, {0xc000e16230, 0xc0000c06e8?, 0x186c938?}, {0xc000e19800?, 0x384, 0x384})
<https://ci-beam.apache.org/job/beam_LoadTests_Go_SideInput_Flink_Batch/ws/src/sdks/go/pkg/beam/register/emitter.go>:81 +0x22f
github.com/apache/beam/sdks/v2/go/pkg/beam/io/synthetic.(*sourceFn).ProcessElement(0xc0003b8850, 0x7f5a57d09108?, {0x61a80, 0x1, 0x64, 0x384, 0x0, 0x0}, 0xc0003a9278)
<https://ci-beam.apache.org/job/beam_LoadTests_Go_SideInput_Flink_Batch/ws/src/sdks/go/pkg/beam/io/synthetic/source.go>:151 +0x123
github.com/apache/beam/sdks/v2/go/pkg/beam/register.registerDoFn3x1StructWrappersAndFuncs[...].func2.1({0x61a80?, 0x1, 0x64, 0x384, 0x0, 0x0}, 0x0)
<https://ci-beam.apache.org/job/beam_LoadTests_Go_SideInput_Flink_Batch/ws/src/sdks/go/pkg/beam/register/register.go>:3382 +0xb0
github.com/apache/beam/sdks/v2/go/pkg/beam/register.(*caller3x1[...]).Call3x1(0x0?, {0x15315a0?, 0xc0003a9248?}, {0x1589aa0?, 0xc0000a5bc0?}, {0x12ca080?, 0xc0003a9278?})
<https://ci-beam.apache.org/job/beam_LoadTests_Go_SideInput_Flink_Batch/ws/src/sdks/go/pkg/beam/register/register.go>:3371 +0xb6
github.com/apache/beam/sdks/v2/go/pkg/beam/core/runtime/exec.(*invoker).initCall.func13({0x0, 0x0, 0x0, 0x0, 0x0}, {0x233cb10, 0x1, 0x1}, 0x37a0637220?)
<https://ci-beam.apache.org/job/beam_LoadTests_Go_SideInput_Flink_Batch/ws/src/sdks/go/pkg/beam/core/runtime/exec/fn_arity.go>:109 +0xad
github.com/apache/beam/sdks/v2/go/pkg/beam/core/runtime/exec.(*invoker).invokeWithOpts(0xc0000d7680, {0x187da50?, 0xc0003ad380}, {0x0, 0x0, 0x0, 0x0, 0x0}, {0x233cb10, 0x1, ...}, ...)
<https://ci-beam.apache.org/job/beam_LoadTests_Go_SideInput_Flink_Batch/ws/src/sdks/go/pkg/beam/core/runtime/exec/fn.go>:297 +0xfec
github.com/apache/beam/sdks/v2/go/pkg/beam/core/runtime/exec.(*ParDo).invokeProcessFn(0xc0003a77a0, {0x187da50, 0xc0003ad380}, {0x0, 0x0, 0x0, 0x0, 0x0}, {0x233cb10, 0x1, ...}, ...)
<https://ci-beam.apache.org/job/beam_LoadTests_Go_SideInput_Flink_Batch/ws/src/sdks/go/pkg/beam/core/runtime/exec/pardo.go>:508 +0x2b5
github.com/apache/beam/sdks/v2/go/pkg/beam/core/runtime/exec.(*ParDo).processSingleWindow(0xc0003a77a0, 0xc0003d2120)
<https://ci-beam.apache.org/job/beam_LoadTests_Go_SideInput_Flink_Batch/ws/src/sdks/go/pkg/beam/core/runtime/exec/pardo.go>:194 +0x9b
github.com/apache/beam/sdks/v2/go/pkg/beam/core/runtime/exec.(*ProcessSizedElementsAndRestrictions).ProcessElement(0xc0003c4a00, {0x187da50, 0xc0004c6140}, 0xc00022a540, {0x0, 0x0, 0x0})
<https://ci-beam.apache.org/job/beam_LoadTests_Go_SideInput_Flink_Batch/ws/src/sdks/go/pkg/beam/core/runtime/exec/sdf.go>:556 +0x63d
github.com/apache/beam/sdks/v2/go/pkg/beam/core/runtime/exec.(*DataSource).Process.func1(0xc0003a8930, {0xc0000c1340?, 0xc0004b97a0?})
<https://ci-beam.apache.org/job/beam_LoadTests_Go_SideInput_Flink_Batch/ws/src/sdks/go/pkg/beam/core/runtime/exec/datasource.go>:241 +0x21e
github.com/apache/beam/sdks/v2/go/pkg/beam/core/runtime/exec.(*DataSource).process(0xc00038cdc0, {0x187da50, 0xc0004c6140}, 0xc0000c1630, 0xc0000c1610)
<https://ci-beam.apache.org/job/beam_LoadTests_Go_SideInput_Flink_Batch/ws/src/sdks/go/pkg/beam/core/runtime/exec/datasource.go>:147 +0x4f6
github.com/apache/beam/sdks/v2/go/pkg/beam/core/runtime/exec.(*DataSource).Process(0xc00038cdc0, {0x187da50, 0xc0004c6140})
<https://ci-beam.apache.org/job/beam_LoadTests_Go_SideInput_Flink_Batch/ws/src/sdks/go/pkg/beam/core/runtime/exec/datasource.go>:215 +0x226
github.com/apache/beam/sdks/v2/go/pkg/beam/core/runtime/exec.(*Plan).Execute.func2({0x187da50?, 0xc0004c6140?})
<https://ci-beam.apache.org/job/beam_LoadTests_Go_SideInput_Flink_Batch/ws/src/sdks/go/pkg/beam/core/runtime/exec/plan.go>:151 +0x42
github.com/apache/beam/sdks/v2/go/pkg/beam/core/runtime/exec.callNoPanic({0x187da50?, 0xc0004c6140?}, 0x415d50?)
<https://ci-beam.apache.org/job/beam_LoadTests_Go_SideInput_Flink_Batch/ws/src/sdks/go/pkg/beam/core/runtime/exec/util.go>:62 +0x6c
github.com/apache/beam/sdks/v2/go/pkg/beam/core/runtime/exec.(*Plan).Execute(0xc0003a1d40, {0x187da50, 0xc0004c6140}, {0x22e3cc8, 0x1}, {{0x1870550?, 0xc0003ad300?}, {0x18a5d98?, 0xc0003af4d0?}})
<https://ci-beam.apache.org/job/beam_LoadTests_Go_SideInput_Flink_Batch/ws/src/sdks/go/pkg/beam/core/runtime/exec/plan.go>:150 +0x3df
github.com/apache/beam/sdks/v2/go/pkg/beam/core/runtime/harness.(*control).handleInstruction(0xc000346000, {0x187d938?, 0xc00021acc0?}, 0xc00010caa0)
<https://ci-beam.apache.org/job/beam_LoadTests_Go_SideInput_Flink_Batch/ws/src/sdks/go/pkg/beam/core/runtime/harness/harness.go>:408 +0xa53
github.com/apache/beam/sdks/v2/go/pkg/beam/core/runtime/harness.MainWithOptions.func4({0x187d938?, 0xc00021acc0?}, 0x0?)
<https://ci-beam.apache.org/job/beam_LoadTests_Go_SideInput_Flink_Batch/ws/src/sdks/go/pkg/beam/core/runtime/harness/harness.go>:195 +0x7a
created by github.com/apache/beam/sdks/v2/go/pkg/beam/core/runtime/harness.MainWithOptions
<https://ci-beam.apache.org/job/beam_LoadTests_Go_SideInput_Flink_Batch/ws/src/sdks/go/pkg/beam/core/runtime/harness/harness.go>:213 +0xf1d
at java.util.concurrent.CompletableFuture.reportGet(CompletableFuture.java:395)
at java.util.concurrent.CompletableFuture.get(CompletableFuture.java:1999)
at org.apache.beam.sdk.util.MoreFutures.get(MoreFutures.java:61)
at org.apache.beam.runners.fnexecution.control.SdkHarnessClient$BundleProcessor$ActiveBundle.close(SdkHarnessClient.java:522)
at org.apache.beam.runners.fnexecution.control.DefaultJobBundleFactory$SimpleStageBundleFactory$1.close(DefaultJobBundleFactory.java:556)
at org.apache.beam.runners.flink.translation.functions.FlinkExecutableStageFunction.$closeResource(FlinkExecutableStageFunction.java:269)
at org.apache.beam.runners.flink.translation.functions.FlinkExecutableStageFunction.mapPartition(FlinkExecutableStageFunction.java:269)
at org.apache.flink.runtime.operators.MapPartitionDriver.run(MapPartitionDriver.java:113)
at org.apache.flink.runtime.operators.BatchTask.run(BatchTask.java:514)
at org.apache.flink.runtime.operators.BatchTask.invoke(BatchTask.java:357)
at org.apache.flink.runtime.taskmanager.Task.runWithSystemExitMonitoring(Task.java:948)
at org.apache.flink.runtime.taskmanager.Task.restoreAndInvoke(Task.java:927)
at org.apache.flink.runtime.taskmanager.Task.doRun(Task.java:741)
at org.apache.flink.runtime.taskmanager.Task.run(Task.java:563)
at java.lang.Thread.run(Thread.java:829)
Caused by: java.lang.RuntimeException: Error received from SDK harness for instruction 5: process bundle failed for instruction 5 using plan 1-5 : panic: datamgr.go [{5 fn/write/n3:0}]: error flushing buffer of length 3999992
caused by:
rpc error: code = Unknown desc =
Full error:
while executing Process for Plan[1-5]:
2: DataSink[S[fn/write/n3:0@localhost:40455]] Coder:W;fn/wire/n3:0<KV;c2<bytes;c0,bytes;c0>>!GWC
3: PCollection[n3] Out:[2]
4: SDF.ProcessSizedElementsAndRestrictions[synthetic.sourceFn] UID:4 Out:[2]
1: DataSource[S[fn/read/n2/SplitAndSize0:0@localhost:40455], local_output] Out:4 Coder:W;fn/wire/n2/SplitAndSize0:0<KV;c3/SplitAndSize0<KV;c3/PairWithRestriction0<R;c3[synthetic.SourceConfig],KV;c7<offsetrange.Restriction[offsetrange.Restriction;c4];c5,bool;c6>>,double;DoubleCoder0>>!GWC
caused by:
panic: datamgr.go [{5 fn/write/n3:0}]: error flushing buffer of length 3999992
caused by:
rpc error: code = Unknown desc = goroutine 42 [running]:
runtime/debug.Stack()
/home/jenkins/sdk/go1.20.4/src/runtime/debug/stack.go:24 +0x65
github.com/apache/beam/sdks/v2/go/pkg/beam/core/runtime/exec.callNoPanic.func1()
<https://ci-beam.apache.org/job/beam_LoadTests_Go_SideInput_Flink_Batch/ws/src/sdks/go/pkg/beam/core/runtime/exec/util.go>:58 +0xa5
panic({0x145cf00, 0xc00052c440})
/home/jenkins/sdk/go1.20.4/src/runtime/panic.go:884 +0x213
github.com/apache/beam/sdks/v2/go/pkg/beam/register.(*emit2[...]).invoke(0x187f1a0, {0xc000e16230, 0xc0000c06e8?, 0x186c938?}, {0xc000e19800?, 0x384, 0x384})
<https://ci-beam.apache.org/job/beam_LoadTests_Go_SideInput_Flink_Batch/ws/src/sdks/go/pkg/beam/register/emitter.go>:81 +0x22f
github.com/apache/beam/sdks/v2/go/pkg/beam/io/synthetic.(*sourceFn).ProcessElement(0xc0003b8850, 0x7f5a57d09108?, {0x61a80, 0x1, 0x64, 0x384, 0x0, 0x0}, 0xc0003a9278)
<https://ci-beam.apache.org/job/beam_LoadTests_Go_SideInput_Flink_Batch/ws/src/sdks/go/pkg/beam/io/synthetic/source.go>:151 +0x123
github.com/apache/beam/sdks/v2/go/pkg/beam/register.registerDoFn3x1StructWrappersAndFuncs[...].func2.1({0x61a80?, 0x1, 0x64, 0x384, 0x0, 0x0}, 0x0)
<https://ci-beam.apache.org/job/beam_LoadTests_Go_SideInput_Flink_Batch/ws/src/sdks/go/pkg/beam/register/register.go>:3382 +0xb0
github.com/apache/beam/sdks/v2/go/pkg/beam/register.(*caller3x1[...]).Call3x1(0x0?, {0x15315a0?, 0xc0003a9248?}, {0x1589aa0?, 0xc0000a5bc0?}, {0x12ca080?, 0xc0003a9278?})
<https://ci-beam.apache.org/job/beam_LoadTests_Go_SideInput_Flink_Batch/ws/src/sdks/go/pkg/beam/register/register.go>:3371 +0xb6
github.com/apache/beam/sdks/v2/go/pkg/beam/core/runtime/exec.(*invoker).initCall.func13({0x0, 0x0, 0x0, 0x0, 0x0}, {0x233cb10, 0x1, 0x1}, 0x37a0637220?)
<https://ci-beam.apache.org/job/beam_LoadTests_Go_SideInput_Flink_Batch/ws/src/sdks/go/pkg/beam/core/runtime/exec/fn_arity.go>:109 +0xad
github.com/apache/beam/sdks/v2/go/pkg/beam/core/runtime/exec.(*invoker).invokeWithOpts(0xc0000d7680, {0x187da50?, 0xc0003ad380}, {0x0, 0x0, 0x0, 0x0, 0x0}, {0x233cb10, 0x1, ...}, ...)
<https://ci-beam.apache.org/job/beam_LoadTests_Go_SideInput_Flink_Batch/ws/src/sdks/go/pkg/beam/core/runtime/exec/fn.go>:297 +0xfec
github.com/apache/beam/sdks/v2/go/pkg/beam/core/runtime/exec.(*ParDo).invokeProcessFn(0xc0003a77a0, {0x187da50, 0xc0003ad380}, {0x0, 0x0, 0x0, 0x0, 0x0}, {0x233cb10, 0x1, ...}, ...)
<https://ci-beam.apache.org/job/beam_LoadTests_Go_SideInput_Flink_Batch/ws/src/sdks/go/pkg/beam/core/runtime/exec/pardo.go>:508 +0x2b5
github.com/apache/beam/sdks/v2/go/pkg/beam/core/runtime/exec.(*ParDo).processSingleWindow(0xc0003a77a0, 0xc0003d2120)
<https://ci-beam.apache.org/job/beam_LoadTests_Go_SideInput_Flink_Batch/ws/src/sdks/go/pkg/beam/core/runtime/exec/pardo.go>:194 +0x9b
github.com/apache/beam/sdks/v2/go/pkg/beam/core/runtime/exec.(*ProcessSizedElementsAndRestrictions).ProcessElement(0xc0003c4a00, {0x187da50, 0xc0004c6140}, 0xc00022a540, {0x0, 0x0, 0x0})
<https://ci-beam.apache.org/job/beam_LoadTests_Go_SideInput_Flink_Batch/ws/src/sdks/go/pkg/beam/core/runtime/exec/sdf.go>:556 +0x63d
github.com/apache/beam/sdks/v2/go/pkg/beam/core/runtime/exec.(*DataSource).Process.func1(0xc0003a8930, {0xc0000c1340?, 0xc0004b97a0?})
<https://ci-beam.apache.org/job/beam_LoadTests_Go_SideInput_Flink_Batch/ws/src/sdks/go/pkg/beam/core/runtime/exec/datasource.go>:241 +0x21e
github.com/apache/beam/sdks/v2/go/pkg/beam/core/runtime/exec.(*DataSource).process(0xc00038cdc0, {0x187da50, 0xc0004c6140}, 0xc0000c1630, 0xc0000c1610)
<https://ci-beam.apache.org/job/beam_LoadTests_Go_SideInput_Flink_Batch/ws/src/sdks/go/pkg/beam/core/runtime/exec/datasource.go>:147 +0x4f6
github.com/apache/beam/sdks/v2/go/pkg/beam/core/runtime/exec.(*DataSource).Process(0xc00038cdc0, {0x187da50, 0xc0004c6140})
<https://ci-beam.apache.org/job/beam_LoadTests_Go_SideInput_Flink_Batch/ws/src/sdks/go/pkg/beam/core/runtime/exec/datasource.go>:215 +0x226
github.com/apache/beam/sdks/v2/go/pkg/beam/core/runtime/exec.(*Plan).Execute.func2({0x187da50?, 0xc0004c6140?})
<https://ci-beam.apache.org/job/beam_LoadTests_Go_SideInput_Flink_Batch/ws/src/sdks/go/pkg/beam/core/runtime/exec/plan.go>:151 +0x42
github.com/apache/beam/sdks/v2/go/pkg/beam/core/runtime/exec.callNoPanic({0x187da50?, 0xc0004c6140?}, 0x415d50?)
<https://ci-beam.apache.org/job/beam_LoadTests_Go_SideInput_Flink_Batch/ws/src/sdks/go/pkg/beam/core/runtime/exec/util.go>:62 +0x6c
github.com/apache/beam/sdks/v2/go/pkg/beam/core/runtime/exec.(*Plan).Execute(0xc0003a1d40, {0x187da50, 0xc0004c6140}, {0x22e3cc8, 0x1}, {{0x1870550?, 0xc0003ad300?}, {0x18a5d98?, 0xc0003af4d0?}})
<https://ci-beam.apache.org/job/beam_LoadTests_Go_SideInput_Flink_Batch/ws/src/sdks/go/pkg/beam/core/runtime/exec/plan.go>:150 +0x3df
github.com/apache/beam/sdks/v2/go/pkg/beam/core/runtime/harness.(*control).handleInstruction(0xc000346000, {0x187d938?, 0xc00021acc0?}, 0xc00010caa0)
<https://ci-beam.apache.org/job/beam_LoadTests_Go_SideInput_Flink_Batch/ws/src/sdks/go/pkg/beam/core/runtime/harness/harness.go>:408 +0xa53
github.com/apache/beam/sdks/v2/go/pkg/beam/core/runtime/harness.MainWithOptions.func4({0x187d938?, 0xc00021acc0?}, 0x0?)
<https://ci-beam.apache.org/job/beam_LoadTests_Go_SideInput_Flink_Batch/ws/src/sdks/go/pkg/beam/core/runtime/harness/harness.go>:195 +0x7a
created by github.com/apache/beam/sdks/v2/go/pkg/beam/core/runtime/harness.MainWithOptions
<https://ci-beam.apache.org/job/beam_LoadTests_Go_SideInput_Flink_Batch/ws/src/sdks/go/pkg/beam/core/runtime/harness/harness.go>:213 +0xf1d
at org.apache.beam.runners.fnexecution.control.FnApiControlClient$ResponseStreamObserver.onNext(FnApiControlClient.java:180)
at org.apache.beam.runners.fnexecution.control.FnApiControlClient$ResponseStreamObserver.onNext(FnApiControlClient.java:160)
at org.apache.beam.vendor.grpc.v1p54p0.io.grpc.stub.ServerCalls$StreamingServerCallHandler$StreamingServerCallListener.onMessage(ServerCalls.java:262)
at org.apache.beam.vendor.grpc.v1p54p0.io.grpc.ForwardingServerCallListener.onMessage(ForwardingServerCallListener.java:33)
at org.apache.beam.vendor.grpc.v1p54p0.io.grpc.Contexts$ContextualizedServerCallListener.onMessage(Contexts.java:76)
at org.apache.beam.vendor.grpc.v1p54p0.io.grpc.internal.ServerCallImpl$ServerStreamListenerImpl.messagesAvailableInternal(ServerCallImpl.java:333)
at org.apache.beam.vendor.grpc.v1p54p0.io.grpc.internal.ServerCallImpl$ServerStreamListenerImpl.messagesAvailable(ServerCallImpl.java:316)
at org.apache.beam.vendor.grpc.v1p54p0.io.grpc.internal.ServerImpl$JumpToApplicationThreadServerStreamListener$1MessagesAvailable.runInContext(ServerImpl.java:835)
at org.apache.beam.vendor.grpc.v1p54p0.io.grpc.internal.ContextRunnable.run(ContextRunnable.java:37)
at org.apache.beam.vendor.grpc.v1p54p0.io.grpc.internal.SerializingExecutor.run(SerializingExecutor.java:133)
at java.util.concurrent.ThreadPoolExecutor.runWorker(ThreadPoolExecutor.java:1128)
at java.util.concurrent.ThreadPoolExecutor$Worker.run(ThreadPoolExecutor.java:628)
... 1 more
2023/06/08 14:00:38 (): java.lang.RuntimeException: Error received from SDK harness for instruction 5: process bundle failed for instruction 5 using plan 1-5 : panic: datamgr.go [{5 fn/write/n3:0}]: error flushing buffer of length 3999992
caused by:
rpc error: code = Unknown desc =
Full error:
while executing Process for Plan[1-5]:
2: DataSink[S[fn/write/n3:0@localhost:40455]] Coder:W;fn/wire/n3:0<KV;c2<bytes;c0,bytes;c0>>!GWC
3: PCollection[n3] Out:[2]
4: SDF.ProcessSizedElementsAndRestrictions[synthetic.sourceFn] UID:4 Out:[2]
1: DataSource[S[fn/read/n2/SplitAndSize0:0@localhost:40455], local_output] Out:4 Coder:W;fn/wire/n2/SplitAndSize0:0<KV;c3/SplitAndSize0<KV;c3/PairWithRestriction0<R;c3[synthetic.SourceConfig],KV;c7<offsetrange.Restriction[offsetrange.Restriction;c4];c5,bool;c6>>,double;DoubleCoder0>>!GWC
caused by:
panic: datamgr.go [{5 fn/write/n3:0}]: error flushing buffer of length 3999992
caused by:
rpc error: code = Unknown desc = goroutine 42 [running]:
runtime/debug.Stack()
/home/jenkins/sdk/go1.20.4/src/runtime/debug/stack.go:24 +0x65
github.com/apache/beam/sdks/v2/go/pkg/beam/core/runtime/exec.callNoPanic.func1()
<https://ci-beam.apache.org/job/beam_LoadTests_Go_SideInput_Flink_Batch/ws/src/sdks/go/pkg/beam/core/runtime/exec/util.go>:58 +0xa5
panic({0x145cf00, 0xc00052c440})
/home/jenkins/sdk/go1.20.4/src/runtime/panic.go:884 +0x213
github.com/apache/beam/sdks/v2/go/pkg/beam/register.(*emit2[...]).invoke(0x187f1a0, {0xc000e16230, 0xc0000c06e8?, 0x186c938?}, {0xc000e19800?, 0x384, 0x384})
<https://ci-beam.apache.org/job/beam_LoadTests_Go_SideInput_Flink_Batch/ws/src/sdks/go/pkg/beam/register/emitter.go>:81 +0x22f
github.com/apache/beam/sdks/v2/go/pkg/beam/io/synthetic.(*sourceFn).ProcessElement(0xc0003b8850, 0x7f5a57d09108?, {0x61a80, 0x1, 0x64, 0x384, 0x0, 0x0}, 0xc0003a9278)
<https://ci-beam.apache.org/job/beam_LoadTests_Go_SideInput_Flink_Batch/ws/src/sdks/go/pkg/beam/io/synthetic/source.go>:151 +0x123
github.com/apache/beam/sdks/v2/go/pkg/beam/register.registerDoFn3x1StructWrappersAndFuncs[...].func2.1({0x61a80?, 0x1, 0x64, 0x384, 0x0, 0x0}, 0x0)
<https://ci-beam.apache.org/job/beam_LoadTests_Go_SideInput_Flink_Batch/ws/src/sdks/go/pkg/beam/register/register.go>:3382 +0xb0
github.com/apache/beam/sdks/v2/go/pkg/beam/register.(*caller3x1[...]).Call3x1(0x0?, {0x15315a0?, 0xc0003a9248?}, {0x1589aa0?, 0xc0000a5bc0?}, {0x12ca080?, 0xc0003a9278?})
<https://ci-beam.apache.org/job/beam_LoadTests_Go_SideInput_Flink_Batch/ws/src/sdks/go/pkg/beam/register/register.go>:3371 +0xb6
github.com/apache/beam/sdks/v2/go/pkg/beam/core/runtime/exec.(*invoker).initCall.func13({0x0, 0x0, 0x0, 0x0, 0x0}, {0x233cb10, 0x1, 0x1}, 0x37a0637220?)
<https://ci-beam.apache.org/job/beam_LoadTests_Go_SideInput_Flink_Batch/ws/src/sdks/go/pkg/beam/core/runtime/exec/fn_arity.go>:109 +0xad
github.com/apache/beam/sdks/v2/go/pkg/beam/core/runtime/exec.(*invoker).invokeWithOpts(0xc0000d7680, {0x187da50?, 0xc0003ad380}, {0x0, 0x0, 0x0, 0x0, 0x0}, {0x233cb10, 0x1, ...}, ...)
<https://ci-beam.apache.org/job/beam_LoadTests_Go_SideInput_Flink_Batch/ws/src/sdks/go/pkg/beam/core/runtime/exec/fn.go>:297 +0xfec
github.com/apache/beam/sdks/v2/go/pkg/beam/core/runtime/exec.(*ParDo).invokeProcessFn(0xc0003a77a0, {0x187da50, 0xc0003ad380}, {0x0, 0x0, 0x0, 0x0, 0x0}, {0x233cb10, 0x1, ...}, ...)
<https://ci-beam.apache.org/job/beam_LoadTests_Go_SideInput_Flink_Batch/ws/src/sdks/go/pkg/beam/core/runtime/exec/pardo.go>:508 +0x2b5
github.com/apache/beam/sdks/v2/go/pkg/beam/core/runtime/exec.(*ParDo).processSingleWindow(0xc0003a77a0, 0xc0003d2120)
<https://ci-beam.apache.org/job/beam_LoadTests_Go_SideInput_Flink_Batch/ws/src/sdks/go/pkg/beam/core/runtime/exec/pardo.go>:194 +0x9b
github.com/apache/beam/sdks/v2/go/pkg/beam/core/runtime/exec.(*ProcessSizedElementsAndRestrictions).ProcessElement(0xc0003c4a00, {0x187da50, 0xc0004c6140}, 0xc00022a540, {0x0, 0x0, 0x0})
<https://ci-beam.apache.org/job/beam_LoadTests_Go_SideInput_Flink_Batch/ws/src/sdks/go/pkg/beam/core/runtime/exec/sdf.go>:556 +0x63d
github.com/apache/beam/sdks/v2/go/pkg/beam/core/runtime/exec.(*DataSource).Process.func1(0xc0003a8930, {0xc0000c1340?, 0xc0004b97a0?})
<https://ci-beam.apache.org/job/beam_LoadTests_Go_SideInput_Flink_Batch/ws/src/sdks/go/pkg/beam/core/runtime/exec/datasource.go>:241 +0x21e
github.com/apache/beam/sdks/v2/go/pkg/beam/core/runtime/exec.(*DataSource).process(0xc00038cdc0, {0x187da50, 0xc0004c6140}, 0xc0000c1630, 0xc0000c1610)
<https://ci-beam.apache.org/job/beam_LoadTests_Go_SideInput_Flink_Batch/ws/src/sdks/go/pkg/beam/core/runtime/exec/datasource.go>:147 +0x4f6
github.com/apache/beam/sdks/v2/go/pkg/beam/core/runtime/exec.(*DataSource).Process(0xc00038cdc0, {0x187da50, 0xc0004c6140})
<https://ci-beam.apache.org/job/beam_LoadTests_Go_SideInput_Flink_Batch/ws/src/sdks/go/pkg/beam/core/runtime/exec/datasource.go>:215 +0x226
github.com/apache/beam/sdks/v2/go/pkg/beam/core/runtime/exec.(*Plan).Execute.func2({0x187da50?, 0xc0004c6140?})
<https://ci-beam.apache.org/job/beam_LoadTests_Go_SideInput_Flink_Batch/ws/src/sdks/go/pkg/beam/core/runtime/exec/plan.go>:151 +0x42
github.com/apache/beam/sdks/v2/go/pkg/beam/core/runtime/exec.callNoPanic({0x187da50?, 0xc0004c6140?}, 0x415d50?)
<https://ci-beam.apache.org/job/beam_LoadTests_Go_SideInput_Flink_Batch/ws/src/sdks/go/pkg/beam/core/runtime/exec/util.go>:62 +0x6c
github.com/apache/beam/sdks/v2/go/pkg/beam/core/runtime/exec.(*Plan).Execute(0xc0003a1d40, {0x187da50, 0xc0004c6140}, {0x22e3cc8, 0x1}, {{0x1870550?, 0xc0003ad300?}, {0x18a5d98?, 0xc0003af4d0?}})
<https://ci-beam.apache.org/job/beam_LoadTests_Go_SideInput_Flink_Batch/ws/src/sdks/go/pkg/beam/core/runtime/exec/plan.go>:150 +0x3df
github.com/apache/beam/sdks/v2/go/pkg/beam/core/runtime/harness.(*control).handleInstruction(0xc000346000, {0x187d938?, 0xc00021acc0?}, 0xc00010caa0)
<https://ci-beam.apache.org/job/beam_LoadTests_Go_SideInput_Flink_Batch/ws/src/sdks/go/pkg/beam/core/runtime/harness/harness.go>:408 +0xa53
github.com/apache/beam/sdks/v2/go/pkg/beam/core/runtime/harness.MainWithOptions.func4({0x187d938?, 0xc00021acc0?}, 0x0?)
<https://ci-beam.apache.org/job/beam_LoadTests_Go_SideInput_Flink_Batch/ws/src/sdks/go/pkg/beam/core/runtime/harness/harness.go>:195 +0x7a
created by github.com/apache/beam/sdks/v2/go/pkg/beam/core/runtime/harness.MainWithOptions
<https://ci-beam.apache.org/job/beam_LoadTests_Go_SideInput_Flink_Batch/ws/src/sdks/go/pkg/beam/core/runtime/harness/harness.go>:213 +0xf1d
2023/06/08 14:00:38 Job state: FAILED
2023/06/08 14:00:38 Failed to execute job: job load0tests0go0flink0batch0sideinput0300608131249-root-0608135945-9937476c_8584bfd6-356f-4183-9a29-6acfd7774afc failed
panic: Failed to execute job: job load0tests0go0flink0batch0sideinput0300608131249-root-0608135945-9937476c_8584bfd6-356f-4183-9a29-6acfd7774afc failed
goroutine 1 [running]:
github.com/apache/beam/sdks/v2/go/pkg/beam/log.Fatalf({0x187d8c8, 0xc000126000}, {0x16faf5b?, 0x238f3d0?}, {0xc00036fe60?, 0x0?, 0x0?})
<https://ci-beam.apache.org/job/beam_LoadTests_Go_SideInput_Flink_Batch/ws/src/sdks/go/pkg/beam/log/log.go>:162 +0x8c
main.main()
<https://ci-beam.apache.org/job/beam_LoadTests_Go_SideInput_Flink_Batch/ws/src/sdks/go/test/load/sideinput/sideinput.go>:104 +0x439
> Task :sdks:go:test:load:run FAILED
FAILURE: Build failed with an exception.
* Where:
Build file '<https://ci-beam.apache.org/job/beam_LoadTests_Go_SideInput_Flink_Batch/ws/src/sdks/go/test/load/build.gradle'> line: 31
* What went wrong:
Execution failed for task ':sdks:go:test:load:run'.
> Process 'command 'sh'' finished with non-zero exit value 2
* Try:
> Run with --stacktrace option to get the stack trace.
> Run with --info or --debug option to get more log output.
* Get more help at https://help.gradle.org
BUILD FAILED in 1m 25s
12 actionable tasks: 6 executed, 4 from cache, 2 up-to-date
Publishing build scan...
https://ge.apache.org/s/gmu53gpexhd2g
Build step 'Invoke Gradle script' changed build result to FAILURE
Build step 'Invoke Gradle script' marked build as failure
---------------------------------------------------------------------
To unsubscribe, e-mail: builds-unsubscribe@beam.apache.org
For additional commands, e-mail: builds-help@beam.apache.org
beam_LoadTests_Go_SideInput_Flink_Batch - Build # 896 - Aborted!
Posted by Apache Jenkins Server <je...@builds.apache.org>.
beam_LoadTests_Go_SideInput_Flink_Batch - Build # 896 - Aborted:
Check console output at https://ci-beam.apache.org/job/beam_LoadTests_Go_SideInput_Flink_Batch/896/ to view the results.
beam_LoadTests_Go_SideInput_Flink_Batch - Build # 895 - Aborted!
Posted by Apache Jenkins Server <je...@builds.apache.org>.
beam_LoadTests_Go_SideInput_Flink_Batch - Build # 895 - Aborted:
Check console output at https://ci-beam.apache.org/job/beam_LoadTests_Go_SideInput_Flink_Batch/895/ to view the results.
beam_LoadTests_Go_SideInput_Flink_Batch - Build # 894 - Aborted!
Posted by Apache Jenkins Server <je...@builds.apache.org>.
beam_LoadTests_Go_SideInput_Flink_Batch - Build # 894 - Aborted:
Check console output at https://ci-beam.apache.org/job/beam_LoadTests_Go_SideInput_Flink_Batch/894/ to view the results.
Build failed in Jenkins: beam_LoadTests_Go_SideInput_Flink_Batch #893
Posted by Apache Jenkins Server <je...@builds.apache.org>.
See <https://ci-beam.apache.org/job/beam_LoadTests_Go_SideInput_Flink_Batch/893/display/redirect>
Changes:
------------------------------------------
[...truncated 41.82 KB...]
at scala.PartialFunction.applyOrElse(PartialFunction.scala:127)
at scala.PartialFunction.applyOrElse$(PartialFunction.scala:126)
at akka.japi.pf.UnitCaseStatement.applyOrElse(CaseStatements.scala:20)
at scala.PartialFunction$OrElse.applyOrElse(PartialFunction.scala:175)
at scala.PartialFunction$OrElse.applyOrElse(PartialFunction.scala:176)
at scala.PartialFunction$OrElse.applyOrElse(PartialFunction.scala:176)
at akka.actor.Actor.aroundReceive(Actor.scala:537)
at akka.actor.Actor.aroundReceive$(Actor.scala:535)
at akka.actor.AbstractActor.aroundReceive(AbstractActor.scala:220)
at akka.actor.ActorCell.receiveMessage(ActorCell.scala:580)
at akka.actor.ActorCell.invoke(ActorCell.scala:548)
at akka.dispatch.Mailbox.processMailbox(Mailbox.scala:270)
at akka.dispatch.Mailbox.run(Mailbox.scala:231)
at akka.dispatch.Mailbox.exec(Mailbox.scala:243)
at java.util.concurrent.ForkJoinTask.doExec(ForkJoinTask.java:290)
at java.util.concurrent.ForkJoinPool$WorkQueue.topLevelExec(ForkJoinPool.java:1020)
at java.util.concurrent.ForkJoinPool.scan(ForkJoinPool.java:1656)
at java.util.concurrent.ForkJoinPool.runWorker(ForkJoinPool.java:1594)
at java.util.concurrent.ForkJoinWorkerThread.run(ForkJoinWorkerThread.java:183)
Caused by: java.util.concurrent.ExecutionException: java.lang.RuntimeException: Error received from SDK harness for instruction 5: process bundle failed for instruction 5 using plan 1-5 : panic: datamgr.go [{5 fn/write/n3:0}]: error flushing buffer of length 3999992
caused by:
rpc error: code = Unknown desc =
Full error:
while executing Process for Plan[1-5]:
2: DataSink[S[fn/write/n3:0@localhost:35007]] Coder:W;fn/wire/n3:0<KV;c2<bytes;c0,bytes;c0>>!GWC
3: PCollection[n3] Out:[2]
4: SDF.ProcessSizedElementsAndRestrictions[synthetic.sourceFn] UID:4 Out:[2]
1: DataSource[S[fn/read/n2/SplitAndSize0:0@localhost:35007], local_output] Out:4 Coder:W;fn/wire/n2/SplitAndSize0:0<KV;c3/SplitAndSize0<KV;c3/PairWithRestriction0<R;c3[synthetic.SourceConfig],KV;c7<offsetrange.Restriction[offsetrange.Restriction;c4];c5,bool;c6>>,double;DoubleCoder0>>!GWC
caused by:
panic: datamgr.go [{5 fn/write/n3:0}]: error flushing buffer of length 3999992
caused by:
rpc error: code = Unknown desc = goroutine 26 [running]:
runtime/debug.Stack()
/home/jenkins/sdk/go1.20.4/src/runtime/debug/stack.go:24 +0x65
github.com/apache/beam/sdks/v2/go/pkg/beam/core/runtime/exec.callNoPanic.func1()
<https://ci-beam.apache.org/job/beam_LoadTests_Go_SideInput_Flink_Batch/ws/src/sdks/go/pkg/beam/core/runtime/exec/util.go>:58 +0xa5
panic({0x145cf00, 0xc00057f780})
/home/jenkins/sdk/go1.20.4/src/runtime/panic.go:884 +0x213
github.com/apache/beam/sdks/v2/go/pkg/beam/register.(*emit2[...]).invoke(0x187f1a0, {0xc000e082a0, 0xc0001046e8?, 0x186c938?}, {0xc000e0b800?, 0x384, 0x384})
<https://ci-beam.apache.org/job/beam_LoadTests_Go_SideInput_Flink_Batch/ws/src/sdks/go/pkg/beam/register/emitter.go>:81 +0x22f
github.com/apache/beam/sdks/v2/go/pkg/beam/io/synthetic.(*sourceFn).ProcessElement(0xc00010a270, 0x7ffbf8fb65b8?, {0x61a80, 0x1, 0x64, 0x384, 0x0, 0x0}, 0xc00021ac60)
<https://ci-beam.apache.org/job/beam_LoadTests_Go_SideInput_Flink_Batch/ws/src/sdks/go/pkg/beam/io/synthetic/source.go>:151 +0x123
github.com/apache/beam/sdks/v2/go/pkg/beam/register.registerDoFn3x1StructWrappersAndFuncs[...].func2.1({0x61a80?, 0x1, 0x64, 0x384, 0x0, 0x0}, 0x0)
<https://ci-beam.apache.org/job/beam_LoadTests_Go_SideInput_Flink_Batch/ws/src/sdks/go/pkg/beam/register/register.go>:3382 +0xb0
github.com/apache/beam/sdks/v2/go/pkg/beam/register.(*caller3x1[...]).Call3x1(0x0?, {0x15315a0?, 0xc00021ac30?}, {0x1589aa0?, 0xc000018870?}, {0x12ca080?, 0xc00021ac60?})
<https://ci-beam.apache.org/job/beam_LoadTests_Go_SideInput_Flink_Batch/ws/src/sdks/go/pkg/beam/register/register.go>:3371 +0xb6
github.com/apache/beam/sdks/v2/go/pkg/beam/core/runtime/exec.(*invoker).initCall.func13({0x0, 0x0, 0x0, 0x0, 0x0}, {0x233cb10, 0x1, 0x1}, 0xc000377e00?)
<https://ci-beam.apache.org/job/beam_LoadTests_Go_SideInput_Flink_Batch/ws/src/sdks/go/pkg/beam/core/runtime/exec/fn_arity.go>:109 +0xad
github.com/apache/beam/sdks/v2/go/pkg/beam/core/runtime/exec.(*invoker).invokeWithOpts(0xc000166780, {0x187da50?, 0xc00037a7c0}, {0x0, 0x0, 0x0, 0x0, 0x0}, {0x233cb10, 0x1, ...}, ...)
<https://ci-beam.apache.org/job/beam_LoadTests_Go_SideInput_Flink_Batch/ws/src/sdks/go/pkg/beam/core/runtime/exec/fn.go>:297 +0xfec
github.com/apache/beam/sdks/v2/go/pkg/beam/core/runtime/exec.(*ParDo).invokeProcessFn(0xc00020e120, {0x187da50, 0xc00037a7c0}, {0x0, 0x0, 0x0, 0x0, 0x0}, {0x233cb10, 0x1, ...}, ...)
<https://ci-beam.apache.org/job/beam_LoadTests_Go_SideInput_Flink_Batch/ws/src/sdks/go/pkg/beam/core/runtime/exec/pardo.go>:508 +0x2b5
github.com/apache/beam/sdks/v2/go/pkg/beam/core/runtime/exec.(*ParDo).processSingleWindow(0xc00020e120, 0xc00038bcb0)
<https://ci-beam.apache.org/job/beam_LoadTests_Go_SideInput_Flink_Batch/ws/src/sdks/go/pkg/beam/core/runtime/exec/pardo.go>:194 +0x9b
github.com/apache/beam/sdks/v2/go/pkg/beam/core/runtime/exec.(*ProcessSizedElementsAndRestrictions).ProcessElement(0xc000386460, {0x187da50, 0xc0004c8280}, 0xc00018e1c0, {0x0, 0x0, 0x0})
<https://ci-beam.apache.org/job/beam_LoadTests_Go_SideInput_Flink_Batch/ws/src/sdks/go/pkg/beam/core/runtime/exec/sdf.go>:556 +0x63d
github.com/apache/beam/sdks/v2/go/pkg/beam/core/runtime/exec.(*DataSource).Process.func1(0xc00021a780, {0xc000105340?, 0xc0004baf60?})
<https://ci-beam.apache.org/job/beam_LoadTests_Go_SideInput_Flink_Batch/ws/src/sdks/go/pkg/beam/core/runtime/exec/datasource.go>:241 +0x21e
github.com/apache/beam/sdks/v2/go/pkg/beam/core/runtime/exec.(*DataSource).process(0xc00049db80, {0x187da50, 0xc0004c8280}, 0xc000105630, 0xc000105610)
<https://ci-beam.apache.org/job/beam_LoadTests_Go_SideInput_Flink_Batch/ws/src/sdks/go/pkg/beam/core/runtime/exec/datasource.go>:147 +0x4f6
github.com/apache/beam/sdks/v2/go/pkg/beam/core/runtime/exec.(*DataSource).Process(0xc00049db80, {0x187da50, 0xc0004c8280})
<https://ci-beam.apache.org/job/beam_LoadTests_Go_SideInput_Flink_Batch/ws/src/sdks/go/pkg/beam/core/runtime/exec/datasource.go>:215 +0x226
github.com/apache/beam/sdks/v2/go/pkg/beam/core/runtime/exec.(*Plan).Execute.func2({0x187da50?, 0xc0004c8280?})
<https://ci-beam.apache.org/job/beam_LoadTests_Go_SideInput_Flink_Batch/ws/src/sdks/go/pkg/beam/core/runtime/exec/plan.go>:151 +0x42
github.com/apache/beam/sdks/v2/go/pkg/beam/core/runtime/exec.callNoPanic({0x187da50?, 0xc0004c8280?}, 0x415d50?)
<https://ci-beam.apache.org/job/beam_LoadTests_Go_SideInput_Flink_Batch/ws/src/sdks/go/pkg/beam/core/runtime/exec/util.go>:62 +0x6c
github.com/apache/beam/sdks/v2/go/pkg/beam/core/runtime/exec.(*Plan).Execute(0xc00038a090, {0x187da50, 0xc0004c8280}, {0x22e3cc8, 0x1}, {{0x1870550?, 0xc00037a740?}, {0x18a5d98?, 0xc000379b00?}})
<https://ci-beam.apache.org/job/beam_LoadTests_Go_SideInput_Flink_Batch/ws/src/sdks/go/pkg/beam/core/runtime/exec/plan.go>:150 +0x3df
github.com/apache/beam/sdks/v2/go/pkg/beam/core/runtime/harness.(*control).handleInstruction(0xc0001e6000, {0x187d938?, 0xc0000027b0?}, 0xc000032320)
<https://ci-beam.apache.org/job/beam_LoadTests_Go_SideInput_Flink_Batch/ws/src/sdks/go/pkg/beam/core/runtime/harness/harness.go>:408 +0xa53
github.com/apache/beam/sdks/v2/go/pkg/beam/core/runtime/harness.MainWithOptions.func4({0x187d938?, 0xc0000027b0?}, 0x0?)
<https://ci-beam.apache.org/job/beam_LoadTests_Go_SideInput_Flink_Batch/ws/src/sdks/go/pkg/beam/core/runtime/harness/harness.go>:195 +0x7a
created by github.com/apache/beam/sdks/v2/go/pkg/beam/core/runtime/harness.MainWithOptions
<https://ci-beam.apache.org/job/beam_LoadTests_Go_SideInput_Flink_Batch/ws/src/sdks/go/pkg/beam/core/runtime/harness/harness.go>:213 +0xf1d
at java.util.concurrent.CompletableFuture.reportGet(CompletableFuture.java:395)
at java.util.concurrent.CompletableFuture.get(CompletableFuture.java:1999)
at org.apache.beam.sdk.util.MoreFutures.get(MoreFutures.java:61)
at org.apache.beam.runners.fnexecution.control.SdkHarnessClient$BundleProcessor$ActiveBundle.close(SdkHarnessClient.java:522)
at org.apache.beam.runners.fnexecution.control.DefaultJobBundleFactory$SimpleStageBundleFactory$1.close(DefaultJobBundleFactory.java:556)
at org.apache.beam.runners.flink.translation.functions.FlinkExecutableStageFunction.$closeResource(FlinkExecutableStageFunction.java:269)
at org.apache.beam.runners.flink.translation.functions.FlinkExecutableStageFunction.mapPartition(FlinkExecutableStageFunction.java:269)
at org.apache.flink.runtime.operators.MapPartitionDriver.run(MapPartitionDriver.java:113)
at org.apache.flink.runtime.operators.BatchTask.run(BatchTask.java:514)
at org.apache.flink.runtime.operators.BatchTask.invoke(BatchTask.java:357)
at org.apache.flink.runtime.taskmanager.Task.runWithSystemExitMonitoring(Task.java:948)
at org.apache.flink.runtime.taskmanager.Task.restoreAndInvoke(Task.java:927)
at org.apache.flink.runtime.taskmanager.Task.doRun(Task.java:741)
at org.apache.flink.runtime.taskmanager.Task.run(Task.java:563)
at java.lang.Thread.run(Thread.java:829)
Caused by: java.lang.RuntimeException: Error received from SDK harness for instruction 5: process bundle failed for instruction 5 using plan 1-5 : panic: datamgr.go [{5 fn/write/n3:0}]: error flushing buffer of length 3999992
caused by:
rpc error: code = Unknown desc =
Full error:
while executing Process for Plan[1-5]:
2: DataSink[S[fn/write/n3:0@localhost:35007]] Coder:W;fn/wire/n3:0<KV;c2<bytes;c0,bytes;c0>>!GWC
3: PCollection[n3] Out:[2]
4: SDF.ProcessSizedElementsAndRestrictions[synthetic.sourceFn] UID:4 Out:[2]
1: DataSource[S[fn/read/n2/SplitAndSize0:0@localhost:35007], local_output] Out:4 Coder:W;fn/wire/n2/SplitAndSize0:0<KV;c3/SplitAndSize0<KV;c3/PairWithRestriction0<R;c3[synthetic.SourceConfig],KV;c7<offsetrange.Restriction[offsetrange.Restriction;c4];c5,bool;c6>>,double;DoubleCoder0>>!GWC
caused by:
panic: datamgr.go [{5 fn/write/n3:0}]: error flushing buffer of length 3999992
caused by:
rpc error: code = Unknown desc = goroutine 26 [running]:
runtime/debug.Stack()
/home/jenkins/sdk/go1.20.4/src/runtime/debug/stack.go:24 +0x65
github.com/apache/beam/sdks/v2/go/pkg/beam/core/runtime/exec.callNoPanic.func1()
<https://ci-beam.apache.org/job/beam_LoadTests_Go_SideInput_Flink_Batch/ws/src/sdks/go/pkg/beam/core/runtime/exec/util.go>:58 +0xa5
panic({0x145cf00, 0xc00057f780})
/home/jenkins/sdk/go1.20.4/src/runtime/panic.go:884 +0x213
github.com/apache/beam/sdks/v2/go/pkg/beam/register.(*emit2[...]).invoke(0x187f1a0, {0xc000e082a0, 0xc0001046e8?, 0x186c938?}, {0xc000e0b800?, 0x384, 0x384})
<https://ci-beam.apache.org/job/beam_LoadTests_Go_SideInput_Flink_Batch/ws/src/sdks/go/pkg/beam/register/emitter.go>:81 +0x22f
github.com/apache/beam/sdks/v2/go/pkg/beam/io/synthetic.(*sourceFn).ProcessElement(0xc00010a270, 0x7ffbf8fb65b8?, {0x61a80, 0x1, 0x64, 0x384, 0x0, 0x0}, 0xc00021ac60)
<https://ci-beam.apache.org/job/beam_LoadTests_Go_SideInput_Flink_Batch/ws/src/sdks/go/pkg/beam/io/synthetic/source.go>:151 +0x123
github.com/apache/beam/sdks/v2/go/pkg/beam/register.registerDoFn3x1StructWrappersAndFuncs[...].func2.1({0x61a80?, 0x1, 0x64, 0x384, 0x0, 0x0}, 0x0)
<https://ci-beam.apache.org/job/beam_LoadTests_Go_SideInput_Flink_Batch/ws/src/sdks/go/pkg/beam/register/register.go>:3382 +0xb0
github.com/apache/beam/sdks/v2/go/pkg/beam/register.(*caller3x1[...]).Call3x1(0x0?, {0x15315a0?, 0xc00021ac30?}, {0x1589aa0?, 0xc000018870?}, {0x12ca080?, 0xc00021ac60?})
<https://ci-beam.apache.org/job/beam_LoadTests_Go_SideInput_Flink_Batch/ws/src/sdks/go/pkg/beam/register/register.go>:3371 +0xb6
github.com/apache/beam/sdks/v2/go/pkg/beam/core/runtime/exec.(*invoker).initCall.func13({0x0, 0x0, 0x0, 0x0, 0x0}, {0x233cb10, 0x1, 0x1}, 0xc000377e00?)
<https://ci-beam.apache.org/job/beam_LoadTests_Go_SideInput_Flink_Batch/ws/src/sdks/go/pkg/beam/core/runtime/exec/fn_arity.go>:109 +0xad
github.com/apache/beam/sdks/v2/go/pkg/beam/core/runtime/exec.(*invoker).invokeWithOpts(0xc000166780, {0x187da50?, 0xc00037a7c0}, {0x0, 0x0, 0x0, 0x0, 0x0}, {0x233cb10, 0x1, ...}, ...)
<https://ci-beam.apache.org/job/beam_LoadTests_Go_SideInput_Flink_Batch/ws/src/sdks/go/pkg/beam/core/runtime/exec/fn.go>:297 +0xfec
github.com/apache/beam/sdks/v2/go/pkg/beam/core/runtime/exec.(*ParDo).invokeProcessFn(0xc00020e120, {0x187da50, 0xc00037a7c0}, {0x0, 0x0, 0x0, 0x0, 0x0}, {0x233cb10, 0x1, ...}, ...)
<https://ci-beam.apache.org/job/beam_LoadTests_Go_SideInput_Flink_Batch/ws/src/sdks/go/pkg/beam/core/runtime/exec/pardo.go>:508 +0x2b5
github.com/apache/beam/sdks/v2/go/pkg/beam/core/runtime/exec.(*ParDo).processSingleWindow(0xc00020e120, 0xc00038bcb0)
<https://ci-beam.apache.org/job/beam_LoadTests_Go_SideInput_Flink_Batch/ws/src/sdks/go/pkg/beam/core/runtime/exec/pardo.go>:194 +0x9b
github.com/apache/beam/sdks/v2/go/pkg/beam/core/runtime/exec.(*ProcessSizedElementsAndRestrictions).ProcessElement(0xc000386460, {0x187da50, 0xc0004c8280}, 0xc00018e1c0, {0x0, 0x0, 0x0})
<https://ci-beam.apache.org/job/beam_LoadTests_Go_SideInput_Flink_Batch/ws/src/sdks/go/pkg/beam/core/runtime/exec/sdf.go>:556 +0x63d
github.com/apache/beam/sdks/v2/go/pkg/beam/core/runtime/exec.(*DataSource).Process.func1(0xc00021a780, {0xc000105340?, 0xc0004baf60?})
<https://ci-beam.apache.org/job/beam_LoadTests_Go_SideInput_Flink_Batch/ws/src/sdks/go/pkg/beam/core/runtime/exec/datasource.go>:241 +0x21e
github.com/apache/beam/sdks/v2/go/pkg/beam/core/runtime/exec.(*DataSource).process(0xc00049db80, {0x187da50, 0xc0004c8280}, 0xc000105630, 0xc000105610)
<https://ci-beam.apache.org/job/beam_LoadTests_Go_SideInput_Flink_Batch/ws/src/sdks/go/pkg/beam/core/runtime/exec/datasource.go>:147 +0x4f6
github.com/apache/beam/sdks/v2/go/pkg/beam/core/runtime/exec.(*DataSource).Process(0xc00049db80, {0x187da50, 0xc0004c8280})
<https://ci-beam.apache.org/job/beam_LoadTests_Go_SideInput_Flink_Batch/ws/src/sdks/go/pkg/beam/core/runtime/exec/datasource.go>:215 +0x226
github.com/apache/beam/sdks/v2/go/pkg/beam/core/runtime/exec.(*Plan).Execute.func2({0x187da50?, 0xc0004c8280?})
<https://ci-beam.apache.org/job/beam_LoadTests_Go_SideInput_Flink_Batch/ws/src/sdks/go/pkg/beam/core/runtime/exec/plan.go>:151 +0x42
github.com/apache/beam/sdks/v2/go/pkg/beam/core/runtime/exec.callNoPanic({0x187da50?, 0xc0004c8280?}, 0x415d50?)
<https://ci-beam.apache.org/job/beam_LoadTests_Go_SideInput_Flink_Batch/ws/src/sdks/go/pkg/beam/core/runtime/exec/util.go>:62 +0x6c
github.com/apache/beam/sdks/v2/go/pkg/beam/core/runtime/exec.(*Plan).Execute(0xc00038a090, {0x187da50, 0xc0004c8280}, {0x22e3cc8, 0x1}, {{0x1870550?, 0xc00037a740?}, {0x18a5d98?, 0xc000379b00?}})
<https://ci-beam.apache.org/job/beam_LoadTests_Go_SideInput_Flink_Batch/ws/src/sdks/go/pkg/beam/core/runtime/exec/plan.go>:150 +0x3df
github.com/apache/beam/sdks/v2/go/pkg/beam/core/runtime/harness.(*control).handleInstruction(0xc0001e6000, {0x187d938?, 0xc0000027b0?}, 0xc000032320)
<https://ci-beam.apache.org/job/beam_LoadTests_Go_SideInput_Flink_Batch/ws/src/sdks/go/pkg/beam/core/runtime/harness/harness.go>:408 +0xa53
github.com/apache/beam/sdks/v2/go/pkg/beam/core/runtime/harness.MainWithOptions.func4({0x187d938?, 0xc0000027b0?}, 0x0?)
<https://ci-beam.apache.org/job/beam_LoadTests_Go_SideInput_Flink_Batch/ws/src/sdks/go/pkg/beam/core/runtime/harness/harness.go>:195 +0x7a
created by github.com/apache/beam/sdks/v2/go/pkg/beam/core/runtime/harness.MainWithOptions
<https://ci-beam.apache.org/job/beam_LoadTests_Go_SideInput_Flink_Batch/ws/src/sdks/go/pkg/beam/core/runtime/harness/harness.go>:213 +0xf1d
at org.apache.beam.runners.fnexecution.control.FnApiControlClient$ResponseStreamObserver.onNext(FnApiControlClient.java:180)
at org.apache.beam.runners.fnexecution.control.FnApiControlClient$ResponseStreamObserver.onNext(FnApiControlClient.java:160)
at org.apache.beam.vendor.grpc.v1p48p1.io.grpc.stub.ServerCalls$StreamingServerCallHandler$StreamingServerCallListener.onMessage(ServerCalls.java:262)
at org.apache.beam.vendor.grpc.v1p48p1.io.grpc.ForwardingServerCallListener.onMessage(ForwardingServerCallListener.java:33)
at org.apache.beam.vendor.grpc.v1p48p1.io.grpc.Contexts$ContextualizedServerCallListener.onMessage(Contexts.java:76)
at org.apache.beam.vendor.grpc.v1p48p1.io.grpc.internal.ServerCallImpl$ServerStreamListenerImpl.messagesAvailableInternal(ServerCallImpl.java:332)
at org.apache.beam.vendor.grpc.v1p48p1.io.grpc.internal.ServerCallImpl$ServerStreamListenerImpl.messagesAvailable(ServerCallImpl.java:315)
at org.apache.beam.vendor.grpc.v1p48p1.io.grpc.internal.ServerImpl$JumpToApplicationThreadServerStreamListener$1MessagesAvailable.runInContext(ServerImpl.java:834)
at org.apache.beam.vendor.grpc.v1p48p1.io.grpc.internal.ContextRunnable.run(ContextRunnable.java:37)
at org.apache.beam.vendor.grpc.v1p48p1.io.grpc.internal.SerializingExecutor.run(SerializingExecutor.java:133)
at java.util.concurrent.ThreadPoolExecutor.runWorker(ThreadPoolExecutor.java:1128)
at java.util.concurrent.ThreadPoolExecutor$Worker.run(ThreadPoolExecutor.java:628)
... 1 more
2023/06/04 14:00:23 (): java.lang.RuntimeException: Error received from SDK harness for instruction 5: process bundle failed for instruction 5 using plan 1-5 : panic: datamgr.go [{5 fn/write/n3:0}]: error flushing buffer of length 3999992
caused by:
rpc error: code = Unknown desc =
Full error:
while executing Process for Plan[1-5]:
2: DataSink[S[fn/write/n3:0@localhost:35007]] Coder:W;fn/wire/n3:0<KV;c2<bytes;c0,bytes;c0>>!GWC
3: PCollection[n3] Out:[2]
4: SDF.ProcessSizedElementsAndRestrictions[synthetic.sourceFn] UID:4 Out:[2]
1: DataSource[S[fn/read/n2/SplitAndSize0:0@localhost:35007], local_output] Out:4 Coder:W;fn/wire/n2/SplitAndSize0:0<KV;c3/SplitAndSize0<KV;c3/PairWithRestriction0<R;c3[synthetic.SourceConfig],KV;c7<offsetrange.Restriction[offsetrange.Restriction;c4];c5,bool;c6>>,double;DoubleCoder0>>!GWC
caused by:
panic: datamgr.go [{5 fn/write/n3:0}]: error flushing buffer of length 3999992
caused by:
rpc error: code = Unknown desc = goroutine 26 [running]:
runtime/debug.Stack()
/home/jenkins/sdk/go1.20.4/src/runtime/debug/stack.go:24 +0x65
github.com/apache/beam/sdks/v2/go/pkg/beam/core/runtime/exec.callNoPanic.func1()
<https://ci-beam.apache.org/job/beam_LoadTests_Go_SideInput_Flink_Batch/ws/src/sdks/go/pkg/beam/core/runtime/exec/util.go>:58 +0xa5
panic({0x145cf00, 0xc00057f780})
/home/jenkins/sdk/go1.20.4/src/runtime/panic.go:884 +0x213
github.com/apache/beam/sdks/v2/go/pkg/beam/register.(*emit2[...]).invoke(0x187f1a0, {0xc000e082a0, 0xc0001046e8?, 0x186c938?}, {0xc000e0b800?, 0x384, 0x384})
<https://ci-beam.apache.org/job/beam_LoadTests_Go_SideInput_Flink_Batch/ws/src/sdks/go/pkg/beam/register/emitter.go>:81 +0x22f
github.com/apache/beam/sdks/v2/go/pkg/beam/io/synthetic.(*sourceFn).ProcessElement(0xc00010a270, 0x7ffbf8fb65b8?, {0x61a80, 0x1, 0x64, 0x384, 0x0, 0x0}, 0xc00021ac60)
<https://ci-beam.apache.org/job/beam_LoadTests_Go_SideInput_Flink_Batch/ws/src/sdks/go/pkg/beam/io/synthetic/source.go>:151 +0x123
github.com/apache/beam/sdks/v2/go/pkg/beam/register.registerDoFn3x1StructWrappersAndFuncs[...].func2.1({0x61a80?, 0x1, 0x64, 0x384, 0x0, 0x0}, 0x0)
<https://ci-beam.apache.org/job/beam_LoadTests_Go_SideInput_Flink_Batch/ws/src/sdks/go/pkg/beam/register/register.go>:3382 +0xb0
github.com/apache/beam/sdks/v2/go/pkg/beam/register.(*caller3x1[...]).Call3x1(0x0?, {0x15315a0?, 0xc00021ac30?}, {0x1589aa0?, 0xc000018870?}, {0x12ca080?, 0xc00021ac60?})
<https://ci-beam.apache.org/job/beam_LoadTests_Go_SideInput_Flink_Batch/ws/src/sdks/go/pkg/beam/register/register.go>:3371 +0xb6
github.com/apache/beam/sdks/v2/go/pkg/beam/core/runtime/exec.(*invoker).initCall.func13({0x0, 0x0, 0x0, 0x0, 0x0}, {0x233cb10, 0x1, 0x1}, 0xc000377e00?)
<https://ci-beam.apache.org/job/beam_LoadTests_Go_SideInput_Flink_Batch/ws/src/sdks/go/pkg/beam/core/runtime/exec/fn_arity.go>:109 +0xad
github.com/apache/beam/sdks/v2/go/pkg/beam/core/runtime/exec.(*invoker).invokeWithOpts(0xc000166780, {0x187da50?, 0xc00037a7c0}, {0x0, 0x0, 0x0, 0x0, 0x0}, {0x233cb10, 0x1, ...}, ...)
<https://ci-beam.apache.org/job/beam_LoadTests_Go_SideInput_Flink_Batch/ws/src/sdks/go/pkg/beam/core/runtime/exec/fn.go>:297 +0xfec
github.com/apache/beam/sdks/v2/go/pkg/beam/core/runtime/exec.(*ParDo).invokeProcessFn(0xc00020e120, {0x187da50, 0xc00037a7c0}, {0x0, 0x0, 0x0, 0x0, 0x0}, {0x233cb10, 0x1, ...}, ...)
<https://ci-beam.apache.org/job/beam_LoadTests_Go_SideInput_Flink_Batch/ws/src/sdks/go/pkg/beam/core/runtime/exec/pardo.go>:508 +0x2b5
github.com/apache/beam/sdks/v2/go/pkg/beam/core/runtime/exec.(*ParDo).processSingleWindow(0xc00020e120, 0xc00038bcb0)
<https://ci-beam.apache.org/job/beam_LoadTests_Go_SideInput_Flink_Batch/ws/src/sdks/go/pkg/beam/core/runtime/exec/pardo.go>:194 +0x9b
github.com/apache/beam/sdks/v2/go/pkg/beam/core/runtime/exec.(*ProcessSizedElementsAndRestrictions).ProcessElement(0xc000386460, {0x187da50, 0xc0004c8280}, 0xc00018e1c0, {0x0, 0x0, 0x0})
<https://ci-beam.apache.org/job/beam_LoadTests_Go_SideInput_Flink_Batch/ws/src/sdks/go/pkg/beam/core/runtime/exec/sdf.go>:556 +0x63d
github.com/apache/beam/sdks/v2/go/pkg/beam/core/runtime/exec.(*DataSource).Process.func1(0xc00021a780, {0xc000105340?, 0xc0004baf60?})
<https://ci-beam.apache.org/job/beam_LoadTests_Go_SideInput_Flink_Batch/ws/src/sdks/go/pkg/beam/core/runtime/exec/datasource.go>:241 +0x21e
github.com/apache/beam/sdks/v2/go/pkg/beam/core/runtime/exec.(*DataSource).process(0xc00049db80, {0x187da50, 0xc0004c8280}, 0xc000105630, 0xc000105610)
<https://ci-beam.apache.org/job/beam_LoadTests_Go_SideInput_Flink_Batch/ws/src/sdks/go/pkg/beam/core/runtime/exec/datasource.go>:147 +0x4f6
github.com/apache/beam/sdks/v2/go/pkg/beam/core/runtime/exec.(*DataSource).Process(0xc00049db80, {0x187da50, 0xc0004c8280})
<https://ci-beam.apache.org/job/beam_LoadTests_Go_SideInput_Flink_Batch/ws/src/sdks/go/pkg/beam/core/runtime/exec/datasource.go>:215 +0x226
github.com/apache/beam/sdks/v2/go/pkg/beam/core/runtime/exec.(*Plan).Execute.func2({0x187da50?, 0xc0004c8280?})
<https://ci-beam.apache.org/job/beam_LoadTests_Go_SideInput_Flink_Batch/ws/src/sdks/go/pkg/beam/core/runtime/exec/plan.go>:151 +0x42
github.com/apache/beam/sdks/v2/go/pkg/beam/core/runtime/exec.callNoPanic({0x187da50?, 0xc0004c8280?}, 0x415d50?)
<https://ci-beam.apache.org/job/beam_LoadTests_Go_SideInput_Flink_Batch/ws/src/sdks/go/pkg/beam/core/runtime/exec/util.go>:62 +0x6c
github.com/apache/beam/sdks/v2/go/pkg/beam/core/runtime/exec.(*Plan).Execute(0xc00038a090, {0x187da50, 0xc0004c8280}, {0x22e3cc8, 0x1}, {{0x1870550?, 0xc00037a740?}, {0x18a5d98?, 0xc000379b00?}})
<https://ci-beam.apache.org/job/beam_LoadTests_Go_SideInput_Flink_Batch/ws/src/sdks/go/pkg/beam/core/runtime/exec/plan.go>:150 +0x3df
github.com/apache/beam/sdks/v2/go/pkg/beam/core/runtime/harness.(*control).handleInstruction(0xc0001e6000, {0x187d938?, 0xc0000027b0?}, 0xc000032320)
<https://ci-beam.apache.org/job/beam_LoadTests_Go_SideInput_Flink_Batch/ws/src/sdks/go/pkg/beam/core/runtime/harness/harness.go>:408 +0xa53
github.com/apache/beam/sdks/v2/go/pkg/beam/core/runtime/harness.MainWithOptions.func4({0x187d938?, 0xc0000027b0?}, 0x0?)
<https://ci-beam.apache.org/job/beam_LoadTests_Go_SideInput_Flink_Batch/ws/src/sdks/go/pkg/beam/core/runtime/harness/harness.go>:195 +0x7a
created by github.com/apache/beam/sdks/v2/go/pkg/beam/core/runtime/harness.MainWithOptions
<https://ci-beam.apache.org/job/beam_LoadTests_Go_SideInput_Flink_Batch/ws/src/sdks/go/pkg/beam/core/runtime/harness/harness.go>:213 +0xf1d
2023/06/04 14:00:24 Job state: FAILED
2023/06/04 14:00:24 Failed to execute job: job load0tests0go0flink0batch0sideinput0300604125519-root-0604135928-e33954c4_6e58b423-73f7-4da4-b6bd-47acd6f864ec failed
panic: Failed to execute job: job load0tests0go0flink0batch0sideinput0300604125519-root-0604135928-e33954c4_6e58b423-73f7-4da4-b6bd-47acd6f864ec failed
goroutine 1 [running]:
github.com/apache/beam/sdks/v2/go/pkg/beam/log.Fatalf({0x187d8c8, 0xc00004c0c0}, {0x16faf5b?, 0x238f3d0?}, {0xc00065fe60?, 0x0?, 0x0?})
<https://ci-beam.apache.org/job/beam_LoadTests_Go_SideInput_Flink_Batch/ws/src/sdks/go/pkg/beam/log/log.go>:162 +0x8c
main.main()
<https://ci-beam.apache.org/job/beam_LoadTests_Go_SideInput_Flink_Batch/ws/src/sdks/go/test/load/sideinput/sideinput.go>:104 +0x439
> Task :sdks:go:test:load:run FAILED
FAILURE: Build failed with an exception.
* Where:
Build file '<https://ci-beam.apache.org/job/beam_LoadTests_Go_SideInput_Flink_Batch/ws/src/sdks/go/test/load/build.gradle'> line: 31
* What went wrong:
Execution failed for task ':sdks:go:test:load:run'.
> Process 'command 'sh'' finished with non-zero exit value 2
* Try:
> Run with --stacktrace option to get the stack trace.
> Run with --info or --debug option to get more log output.
* Get more help at https://help.gradle.org
BUILD FAILED in 1m 29s
12 actionable tasks: 6 executed, 4 from cache, 2 up-to-date
Publishing build scan...
https://ge.apache.org/s/clqjmhyow6s4e
Build step 'Invoke Gradle script' changed build result to FAILURE
Build step 'Invoke Gradle script' marked build as failure
---------------------------------------------------------------------
To unsubscribe, e-mail: builds-unsubscribe@beam.apache.org
For additional commands, e-mail: builds-help@beam.apache.org
beam_LoadTests_Go_SideInput_Flink_Batch - Build # 892 - Aborted!
Posted by Apache Jenkins Server <je...@builds.apache.org>.
beam_LoadTests_Go_SideInput_Flink_Batch - Build # 892 - Aborted:
Check console output at https://ci-beam.apache.org/job/beam_LoadTests_Go_SideInput_Flink_Batch/892/ to view the results.
Build failed in Jenkins: beam_LoadTests_Go_SideInput_Flink_Batch #891
Posted by Apache Jenkins Server <je...@builds.apache.org>.
See <https://ci-beam.apache.org/job/beam_LoadTests_Go_SideInput_Flink_Batch/891/display/redirect>
Changes:
------------------------------------------
[...truncated 41.95 KB...]
at scala.PartialFunction.applyOrElse(PartialFunction.scala:127)
at scala.PartialFunction.applyOrElse$(PartialFunction.scala:126)
at akka.japi.pf.UnitCaseStatement.applyOrElse(CaseStatements.scala:20)
at scala.PartialFunction$OrElse.applyOrElse(PartialFunction.scala:175)
at scala.PartialFunction$OrElse.applyOrElse(PartialFunction.scala:176)
at scala.PartialFunction$OrElse.applyOrElse(PartialFunction.scala:176)
at akka.actor.Actor.aroundReceive(Actor.scala:537)
at akka.actor.Actor.aroundReceive$(Actor.scala:535)
at akka.actor.AbstractActor.aroundReceive(AbstractActor.scala:220)
at akka.actor.ActorCell.receiveMessage(ActorCell.scala:580)
at akka.actor.ActorCell.invoke(ActorCell.scala:548)
at akka.dispatch.Mailbox.processMailbox(Mailbox.scala:270)
at akka.dispatch.Mailbox.run(Mailbox.scala:231)
at akka.dispatch.Mailbox.exec(Mailbox.scala:243)
at java.util.concurrent.ForkJoinTask.doExec(ForkJoinTask.java:290)
at java.util.concurrent.ForkJoinPool$WorkQueue.topLevelExec(ForkJoinPool.java:1020)
at java.util.concurrent.ForkJoinPool.scan(ForkJoinPool.java:1656)
at java.util.concurrent.ForkJoinPool.runWorker(ForkJoinPool.java:1594)
at java.util.concurrent.ForkJoinWorkerThread.run(ForkJoinWorkerThread.java:183)
Caused by: java.util.concurrent.ExecutionException: java.lang.RuntimeException: Error received from SDK harness for instruction 4: process bundle failed for instruction 4 using plan 1-2 : panic: datamgr.go [{4 fn/write/n3:0}]: error flushing buffer of length 3999992
caused by:
rpc error: code = Unknown desc =
Full error:
while executing Process for Plan[1-2]:
2: DataSink[S[fn/write/n3:0@localhost:34711]] Coder:W;fn/wire/n3:0<KV;c2<bytes;c0,bytes;c0>>!GWC
3: PCollection[n3] Out:[2]
4: SDF.ProcessSizedElementsAndRestrictions[synthetic.sourceFn] UID:4 Out:[2]
1: DataSource[S[fn/read/n2/SplitAndSize0:0@localhost:34711], local_output] Out:4 Coder:W;fn/wire/n2/SplitAndSize0:0<KV;c3/SplitAndSize0<KV;c3/PairWithRestriction0<R;c3[synthetic.SourceConfig],KV;c7<offsetrange.Restriction[offsetrange.Restriction;c4];c5,bool;c6>>,double;DoubleCoder0>>!GWC
caused by:
panic: datamgr.go [{4 fn/write/n3:0}]: error flushing buffer of length 3999992
caused by:
rpc error: code = Unknown desc = goroutine 16 [running]:
runtime/debug.Stack()
/home/jenkins/sdk/go1.20.4/src/runtime/debug/stack.go:24 +0x65
github.com/apache/beam/sdks/v2/go/pkg/beam/core/runtime/exec.callNoPanic.func1()
<https://ci-beam.apache.org/job/beam_LoadTests_Go_SideInput_Flink_Batch/ws/src/sdks/go/pkg/beam/core/runtime/exec/util.go>:58 +0xa5
panic({0x1458100, 0xc0003d4200})
/home/jenkins/sdk/go1.20.4/src/runtime/panic.go:884 +0x213
github.com/apache/beam/sdks/v2/go/pkg/beam/register.(*emit2[...]).invoke(0x1878fe0, {0xc000da4230, 0xc00036c590?, 0x18667b8?}, {0xc000da7800?, 0x384, 0x384})
<https://ci-beam.apache.org/job/beam_LoadTests_Go_SideInput_Flink_Batch/ws/src/sdks/go/pkg/beam/register/emitter.go>:81 +0x22f
github.com/apache/beam/sdks/v2/go/pkg/beam/io/synthetic.(*sourceFn).ProcessElement(0xc0002ac350, 0xc00036c798?, {0x61a80, 0x1, 0x64, 0x384, 0x0, 0x0}, 0xc00011b3b0)
<https://ci-beam.apache.org/job/beam_LoadTests_Go_SideInput_Flink_Batch/ws/src/sdks/go/pkg/beam/io/synthetic/source.go>:151 +0x123
github.com/apache/beam/sdks/v2/go/pkg/beam/register.registerDoFn3x1StructWrappersAndFuncs[...].func2.1({0x61a80?, 0x1, 0x64, 0x384, 0x0, 0x0}, 0x0)
<https://ci-beam.apache.org/job/beam_LoadTests_Go_SideInput_Flink_Batch/ws/src/sdks/go/pkg/beam/register/register.go>:3382 +0xb0
github.com/apache/beam/sdks/v2/go/pkg/beam/register.(*caller3x1[...]).Call3x1(0x0?, {0x152c020?, 0xc00011b320?}, {0x1584280?, 0xc0005fad20?}, {0x12c56c0?, 0xc00011b3b0?})
<https://ci-beam.apache.org/job/beam_LoadTests_Go_SideInput_Flink_Batch/ws/src/sdks/go/pkg/beam/register/register.go>:3371 +0xb6
github.com/apache/beam/sdks/v2/go/pkg/beam/core/runtime/exec.(*invoker).initCall.func13({0x0, 0x0, 0x0, 0x0, 0x0}, {0x2333af0, 0x1, 0x1}, 0x12?)
<https://ci-beam.apache.org/job/beam_LoadTests_Go_SideInput_Flink_Batch/ws/src/sdks/go/pkg/beam/core/runtime/exec/fn_arity.go>:109 +0xad
github.com/apache/beam/sdks/v2/go/pkg/beam/core/runtime/exec.(*invoker).invokeWithOpts(0xc0005b8a00, {0x18778d0?, 0xc0002c9e80}, {0x0, 0x0, 0x0, 0x0, 0x0}, {0x2333af0, 0x1, ...}, ...)
<https://ci-beam.apache.org/job/beam_LoadTests_Go_SideInput_Flink_Batch/ws/src/sdks/go/pkg/beam/core/runtime/exec/fn.go>:301 +0x1132
github.com/apache/beam/sdks/v2/go/pkg/beam/core/runtime/exec.(*ParDo).invokeProcessFn(0xc0005b88c0, {0x18778d0, 0xc0002c9e80}, {0x0, 0x0, 0x0, 0x0, 0x0}, {0x2333af0, 0x1, ...}, ...)
<https://ci-beam.apache.org/job/beam_LoadTests_Go_SideInput_Flink_Batch/ws/src/sdks/go/pkg/beam/core/runtime/exec/pardo.go>:419 +0x2de
github.com/apache/beam/sdks/v2/go/pkg/beam/core/runtime/exec.(*ParDo).processSingleWindow(0xc0005b88c0, 0xc0003da6c0)
<https://ci-beam.apache.org/job/beam_LoadTests_Go_SideInput_Flink_Batch/ws/src/sdks/go/pkg/beam/core/runtime/exec/pardo.go>:190 +0x9b
github.com/apache/beam/sdks/v2/go/pkg/beam/core/runtime/exec.(*ProcessSizedElementsAndRestrictions).ProcessElement(0xc0002e0280, {0x18778d0, 0xc0005f1a80}, 0xc00022a0e0, {0x0, 0x0, 0x0})
<https://ci-beam.apache.org/job/beam_LoadTests_Go_SideInput_Flink_Batch/ws/src/sdks/go/pkg/beam/core/runtime/exec/sdf.go>:556 +0x63d
github.com/apache/beam/sdks/v2/go/pkg/beam/core/runtime/exec.(*DataSource).Process.func1(0xc00027d620, {0xc00036d340?, 0xc0000474c0?})
<https://ci-beam.apache.org/job/beam_LoadTests_Go_SideInput_Flink_Batch/ws/src/sdks/go/pkg/beam/core/runtime/exec/datasource.go>:241 +0x21e
github.com/apache/beam/sdks/v2/go/pkg/beam/core/runtime/exec.(*DataSource).process(0xc00029c9a0, {0x18778d0, 0xc0005f1a80}, 0xc00036d630, 0xc00036d610)
<https://ci-beam.apache.org/job/beam_LoadTests_Go_SideInput_Flink_Batch/ws/src/sdks/go/pkg/beam/core/runtime/exec/datasource.go>:147 +0x4f6
github.com/apache/beam/sdks/v2/go/pkg/beam/core/runtime/exec.(*DataSource).Process(0xc00029c9a0, {0x18778d0, 0xc0005f1a80})
<https://ci-beam.apache.org/job/beam_LoadTests_Go_SideInput_Flink_Batch/ws/src/sdks/go/pkg/beam/core/runtime/exec/datasource.go>:215 +0x226
github.com/apache/beam/sdks/v2/go/pkg/beam/core/runtime/exec.(*Plan).Execute.func2({0x18778d0?, 0xc0005f1a80?})
<https://ci-beam.apache.org/job/beam_LoadTests_Go_SideInput_Flink_Batch/ws/src/sdks/go/pkg/beam/core/runtime/exec/plan.go>:151 +0x42
github.com/apache/beam/sdks/v2/go/pkg/beam/core/runtime/exec.callNoPanic({0x18778d0?, 0xc0005f1a80?}, 0x415d50?)
<https://ci-beam.apache.org/job/beam_LoadTests_Go_SideInput_Flink_Batch/ws/src/sdks/go/pkg/beam/core/runtime/exec/util.go>:62 +0x6c
github.com/apache/beam/sdks/v2/go/pkg/beam/core/runtime/exec.(*Plan).Execute(0xc00029f950, {0x18778d0, 0xc0005f1a80}, {0x22daca0, 0x1}, {{0x186a3d0?, 0xc0002c9e00?}, {0x189fbd8?, 0xc0002c49f0?}})
<https://ci-beam.apache.org/job/beam_LoadTests_Go_SideInput_Flink_Batch/ws/src/sdks/go/pkg/beam/core/runtime/exec/plan.go>:150 +0x3df
github.com/apache/beam/sdks/v2/go/pkg/beam/core/runtime/harness.(*control).handleInstruction(0xc00007c000, {0x18777b8?, 0xc0005f2cc0?}, 0xc000036690)
<https://ci-beam.apache.org/job/beam_LoadTests_Go_SideInput_Flink_Batch/ws/src/sdks/go/pkg/beam/core/runtime/harness/harness.go>:408 +0xa53
github.com/apache/beam/sdks/v2/go/pkg/beam/core/runtime/harness.MainWithOptions.func4({0x18777b8?, 0xc0005f2cc0?}, 0x0?)
<https://ci-beam.apache.org/job/beam_LoadTests_Go_SideInput_Flink_Batch/ws/src/sdks/go/pkg/beam/core/runtime/harness/harness.go>:195 +0x7a
created by github.com/apache/beam/sdks/v2/go/pkg/beam/core/runtime/harness.MainWithOptions
<https://ci-beam.apache.org/job/beam_LoadTests_Go_SideInput_Flink_Batch/ws/src/sdks/go/pkg/beam/core/runtime/harness/harness.go>:213 +0xf1d
at java.util.concurrent.CompletableFuture.reportGet(CompletableFuture.java:395)
at java.util.concurrent.CompletableFuture.get(CompletableFuture.java:1999)
at org.apache.beam.sdk.util.MoreFutures.get(MoreFutures.java:61)
at org.apache.beam.runners.fnexecution.control.SdkHarnessClient$BundleProcessor$ActiveBundle.close(SdkHarnessClient.java:522)
at org.apache.beam.runners.fnexecution.control.DefaultJobBundleFactory$SimpleStageBundleFactory$1.close(DefaultJobBundleFactory.java:556)
at org.apache.beam.runners.flink.translation.functions.FlinkExecutableStageFunction.$closeResource(FlinkExecutableStageFunction.java:269)
at org.apache.beam.runners.flink.translation.functions.FlinkExecutableStageFunction.mapPartition(FlinkExecutableStageFunction.java:269)
at org.apache.flink.runtime.operators.MapPartitionDriver.run(MapPartitionDriver.java:113)
at org.apache.flink.runtime.operators.BatchTask.run(BatchTask.java:514)
at org.apache.flink.runtime.operators.BatchTask.invoke(BatchTask.java:357)
at org.apache.flink.runtime.taskmanager.Task.runWithSystemExitMonitoring(Task.java:948)
at org.apache.flink.runtime.taskmanager.Task.restoreAndInvoke(Task.java:927)
at org.apache.flink.runtime.taskmanager.Task.doRun(Task.java:741)
at org.apache.flink.runtime.taskmanager.Task.run(Task.java:563)
at java.lang.Thread.run(Thread.java:829)
Caused by: java.lang.RuntimeException: Error received from SDK harness for instruction 4: process bundle failed for instruction 4 using plan 1-2 : panic: datamgr.go [{4 fn/write/n3:0}]: error flushing buffer of length 3999992
caused by:
rpc error: code = Unknown desc =
Full error:
while executing Process for Plan[1-2]:
2: DataSink[S[fn/write/n3:0@localhost:34711]] Coder:W;fn/wire/n3:0<KV;c2<bytes;c0,bytes;c0>>!GWC
3: PCollection[n3] Out:[2]
4: SDF.ProcessSizedElementsAndRestrictions[synthetic.sourceFn] UID:4 Out:[2]
1: DataSource[S[fn/read/n2/SplitAndSize0:0@localhost:34711], local_output] Out:4 Coder:W;fn/wire/n2/SplitAndSize0:0<KV;c3/SplitAndSize0<KV;c3/PairWithRestriction0<R;c3[synthetic.SourceConfig],KV;c7<offsetrange.Restriction[offsetrange.Restriction;c4];c5,bool;c6>>,double;DoubleCoder0>>!GWC
caused by:
panic: datamgr.go [{4 fn/write/n3:0}]: error flushing buffer of length 3999992
caused by:
rpc error: code = Unknown desc = goroutine 16 [running]:
runtime/debug.Stack()
/home/jenkins/sdk/go1.20.4/src/runtime/debug/stack.go:24 +0x65
github.com/apache/beam/sdks/v2/go/pkg/beam/core/runtime/exec.callNoPanic.func1()
<https://ci-beam.apache.org/job/beam_LoadTests_Go_SideInput_Flink_Batch/ws/src/sdks/go/pkg/beam/core/runtime/exec/util.go>:58 +0xa5
panic({0x1458100, 0xc0003d4200})
/home/jenkins/sdk/go1.20.4/src/runtime/panic.go:884 +0x213
github.com/apache/beam/sdks/v2/go/pkg/beam/register.(*emit2[...]).invoke(0x1878fe0, {0xc000da4230, 0xc00036c590?, 0x18667b8?}, {0xc000da7800?, 0x384, 0x384})
<https://ci-beam.apache.org/job/beam_LoadTests_Go_SideInput_Flink_Batch/ws/src/sdks/go/pkg/beam/register/emitter.go>:81 +0x22f
github.com/apache/beam/sdks/v2/go/pkg/beam/io/synthetic.(*sourceFn).ProcessElement(0xc0002ac350, 0xc00036c798?, {0x61a80, 0x1, 0x64, 0x384, 0x0, 0x0}, 0xc00011b3b0)
<https://ci-beam.apache.org/job/beam_LoadTests_Go_SideInput_Flink_Batch/ws/src/sdks/go/pkg/beam/io/synthetic/source.go>:151 +0x123
github.com/apache/beam/sdks/v2/go/pkg/beam/register.registerDoFn3x1StructWrappersAndFuncs[...].func2.1({0x61a80?, 0x1, 0x64, 0x384, 0x0, 0x0}, 0x0)
<https://ci-beam.apache.org/job/beam_LoadTests_Go_SideInput_Flink_Batch/ws/src/sdks/go/pkg/beam/register/register.go>:3382 +0xb0
github.com/apache/beam/sdks/v2/go/pkg/beam/register.(*caller3x1[...]).Call3x1(0x0?, {0x152c020?, 0xc00011b320?}, {0x1584280?, 0xc0005fad20?}, {0x12c56c0?, 0xc00011b3b0?})
<https://ci-beam.apache.org/job/beam_LoadTests_Go_SideInput_Flink_Batch/ws/src/sdks/go/pkg/beam/register/register.go>:3371 +0xb6
github.com/apache/beam/sdks/v2/go/pkg/beam/core/runtime/exec.(*invoker).initCall.func13({0x0, 0x0, 0x0, 0x0, 0x0}, {0x2333af0, 0x1, 0x1}, 0x12?)
<https://ci-beam.apache.org/job/beam_LoadTests_Go_SideInput_Flink_Batch/ws/src/sdks/go/pkg/beam/core/runtime/exec/fn_arity.go>:109 +0xad
github.com/apache/beam/sdks/v2/go/pkg/beam/core/runtime/exec.(*invoker).invokeWithOpts(0xc0005b8a00, {0x18778d0?, 0xc0002c9e80}, {0x0, 0x0, 0x0, 0x0, 0x0}, {0x2333af0, 0x1, ...}, ...)
<https://ci-beam.apache.org/job/beam_LoadTests_Go_SideInput_Flink_Batch/ws/src/sdks/go/pkg/beam/core/runtime/exec/fn.go>:301 +0x1132
github.com/apache/beam/sdks/v2/go/pkg/beam/core/runtime/exec.(*ParDo).invokeProcessFn(0xc0005b88c0, {0x18778d0, 0xc0002c9e80}, {0x0, 0x0, 0x0, 0x0, 0x0}, {0x2333af0, 0x1, ...}, ...)
<https://ci-beam.apache.org/job/beam_LoadTests_Go_SideInput_Flink_Batch/ws/src/sdks/go/pkg/beam/core/runtime/exec/pardo.go>:419 +0x2de
github.com/apache/beam/sdks/v2/go/pkg/beam/core/runtime/exec.(*ParDo).processSingleWindow(0xc0005b88c0, 0xc0003da6c0)
<https://ci-beam.apache.org/job/beam_LoadTests_Go_SideInput_Flink_Batch/ws/src/sdks/go/pkg/beam/core/runtime/exec/pardo.go>:190 +0x9b
github.com/apache/beam/sdks/v2/go/pkg/beam/core/runtime/exec.(*ProcessSizedElementsAndRestrictions).ProcessElement(0xc0002e0280, {0x18778d0, 0xc0005f1a80}, 0xc00022a0e0, {0x0, 0x0, 0x0})
<https://ci-beam.apache.org/job/beam_LoadTests_Go_SideInput_Flink_Batch/ws/src/sdks/go/pkg/beam/core/runtime/exec/sdf.go>:556 +0x63d
github.com/apache/beam/sdks/v2/go/pkg/beam/core/runtime/exec.(*DataSource).Process.func1(0xc00027d620, {0xc00036d340?, 0xc0000474c0?})
<https://ci-beam.apache.org/job/beam_LoadTests_Go_SideInput_Flink_Batch/ws/src/sdks/go/pkg/beam/core/runtime/exec/datasource.go>:241 +0x21e
github.com/apache/beam/sdks/v2/go/pkg/beam/core/runtime/exec.(*DataSource).process(0xc00029c9a0, {0x18778d0, 0xc0005f1a80}, 0xc00036d630, 0xc00036d610)
<https://ci-beam.apache.org/job/beam_LoadTests_Go_SideInput_Flink_Batch/ws/src/sdks/go/pkg/beam/core/runtime/exec/datasource.go>:147 +0x4f6
github.com/apache/beam/sdks/v2/go/pkg/beam/core/runtime/exec.(*DataSource).Process(0xc00029c9a0, {0x18778d0, 0xc0005f1a80})
<https://ci-beam.apache.org/job/beam_LoadTests_Go_SideInput_Flink_Batch/ws/src/sdks/go/pkg/beam/core/runtime/exec/datasource.go>:215 +0x226
github.com/apache/beam/sdks/v2/go/pkg/beam/core/runtime/exec.(*Plan).Execute.func2({0x18778d0?, 0xc0005f1a80?})
<https://ci-beam.apache.org/job/beam_LoadTests_Go_SideInput_Flink_Batch/ws/src/sdks/go/pkg/beam/core/runtime/exec/plan.go>:151 +0x42
github.com/apache/beam/sdks/v2/go/pkg/beam/core/runtime/exec.callNoPanic({0x18778d0?, 0xc0005f1a80?}, 0x415d50?)
<https://ci-beam.apache.org/job/beam_LoadTests_Go_SideInput_Flink_Batch/ws/src/sdks/go/pkg/beam/core/runtime/exec/util.go>:62 +0x6c
github.com/apache/beam/sdks/v2/go/pkg/beam/core/runtime/exec.(*Plan).Execute(0xc00029f950, {0x18778d0, 0xc0005f1a80}, {0x22daca0, 0x1}, {{0x186a3d0?, 0xc0002c9e00?}, {0x189fbd8?, 0xc0002c49f0?}})
<https://ci-beam.apache.org/job/beam_LoadTests_Go_SideInput_Flink_Batch/ws/src/sdks/go/pkg/beam/core/runtime/exec/plan.go>:150 +0x3df
github.com/apache/beam/sdks/v2/go/pkg/beam/core/runtime/harness.(*control).handleInstruction(0xc00007c000, {0x18777b8?, 0xc0005f2cc0?}, 0xc000036690)
<https://ci-beam.apache.org/job/beam_LoadTests_Go_SideInput_Flink_Batch/ws/src/sdks/go/pkg/beam/core/runtime/harness/harness.go>:408 +0xa53
github.com/apache/beam/sdks/v2/go/pkg/beam/core/runtime/harness.MainWithOptions.func4({0x18777b8?, 0xc0005f2cc0?}, 0x0?)
<https://ci-beam.apache.org/job/beam_LoadTests_Go_SideInput_Flink_Batch/ws/src/sdks/go/pkg/beam/core/runtime/harness/harness.go>:195 +0x7a
created by github.com/apache/beam/sdks/v2/go/pkg/beam/core/runtime/harness.MainWithOptions
<https://ci-beam.apache.org/job/beam_LoadTests_Go_SideInput_Flink_Batch/ws/src/sdks/go/pkg/beam/core/runtime/harness/harness.go>:213 +0xf1d
at org.apache.beam.runners.fnexecution.control.FnApiControlClient$ResponseStreamObserver.onNext(FnApiControlClient.java:180)
at org.apache.beam.runners.fnexecution.control.FnApiControlClient$ResponseStreamObserver.onNext(FnApiControlClient.java:160)
at org.apache.beam.vendor.grpc.v1p48p1.io.grpc.stub.ServerCalls$StreamingServerCallHandler$StreamingServerCallListener.onMessage(ServerCalls.java:262)
at org.apache.beam.vendor.grpc.v1p48p1.io.grpc.ForwardingServerCallListener.onMessage(ForwardingServerCallListener.java:33)
at org.apache.beam.vendor.grpc.v1p48p1.io.grpc.Contexts$ContextualizedServerCallListener.onMessage(Contexts.java:76)
at org.apache.beam.vendor.grpc.v1p48p1.io.grpc.internal.ServerCallImpl$ServerStreamListenerImpl.messagesAvailableInternal(ServerCallImpl.java:332)
at org.apache.beam.vendor.grpc.v1p48p1.io.grpc.internal.ServerCallImpl$ServerStreamListenerImpl.messagesAvailable(ServerCallImpl.java:315)
at org.apache.beam.vendor.grpc.v1p48p1.io.grpc.internal.ServerImpl$JumpToApplicationThreadServerStreamListener$1MessagesAvailable.runInContext(ServerImpl.java:834)
at org.apache.beam.vendor.grpc.v1p48p1.io.grpc.internal.ContextRunnable.run(ContextRunnable.java:37)
at org.apache.beam.vendor.grpc.v1p48p1.io.grpc.internal.SerializingExecutor.run(SerializingExecutor.java:133)
at java.util.concurrent.ThreadPoolExecutor.runWorker(ThreadPoolExecutor.java:1128)
at java.util.concurrent.ThreadPoolExecutor$Worker.run(ThreadPoolExecutor.java:628)
... 1 more
2023/06/02 14:00:45 (): java.lang.RuntimeException: Error received from SDK harness for instruction 4: process bundle failed for instruction 4 using plan 1-2 : panic: datamgr.go [{4 fn/write/n3:0}]: error flushing buffer of length 3999992
caused by:
rpc error: code = Unknown desc =
Full error:
while executing Process for Plan[1-2]:
2: DataSink[S[fn/write/n3:0@localhost:34711]] Coder:W;fn/wire/n3:0<KV;c2<bytes;c0,bytes;c0>>!GWC
3: PCollection[n3] Out:[2]
4: SDF.ProcessSizedElementsAndRestrictions[synthetic.sourceFn] UID:4 Out:[2]
1: DataSource[S[fn/read/n2/SplitAndSize0:0@localhost:34711], local_output] Out:4 Coder:W;fn/wire/n2/SplitAndSize0:0<KV;c3/SplitAndSize0<KV;c3/PairWithRestriction0<R;c3[synthetic.SourceConfig],KV;c7<offsetrange.Restriction[offsetrange.Restriction;c4];c5,bool;c6>>,double;DoubleCoder0>>!GWC
caused by:
panic: datamgr.go [{4 fn/write/n3:0}]: error flushing buffer of length 3999992
caused by:
rpc error: code = Unknown desc = goroutine 16 [running]:
runtime/debug.Stack()
/home/jenkins/sdk/go1.20.4/src/runtime/debug/stack.go:24 +0x65
github.com/apache/beam/sdks/v2/go/pkg/beam/core/runtime/exec.callNoPanic.func1()
<https://ci-beam.apache.org/job/beam_LoadTests_Go_SideInput_Flink_Batch/ws/src/sdks/go/pkg/beam/core/runtime/exec/util.go>:58 +0xa5
panic({0x1458100, 0xc0003d4200})
/home/jenkins/sdk/go1.20.4/src/runtime/panic.go:884 +0x213
github.com/apache/beam/sdks/v2/go/pkg/beam/register.(*emit2[...]).invoke(0x1878fe0, {0xc000da4230, 0xc00036c590?, 0x18667b8?}, {0xc000da7800?, 0x384, 0x384})
<https://ci-beam.apache.org/job/beam_LoadTests_Go_SideInput_Flink_Batch/ws/src/sdks/go/pkg/beam/register/emitter.go>:81 +0x22f
github.com/apache/beam/sdks/v2/go/pkg/beam/io/synthetic.(*sourceFn).ProcessElement(0xc0002ac350, 0xc00036c798?, {0x61a80, 0x1, 0x64, 0x384, 0x0, 0x0}, 0xc00011b3b0)
<https://ci-beam.apache.org/job/beam_LoadTests_Go_SideInput_Flink_Batch/ws/src/sdks/go/pkg/beam/io/synthetic/source.go>:151 +0x123
github.com/apache/beam/sdks/v2/go/pkg/beam/register.registerDoFn3x1StructWrappersAndFuncs[...].func2.1({0x61a80?, 0x1, 0x64, 0x384, 0x0, 0x0}, 0x0)
<https://ci-beam.apache.org/job/beam_LoadTests_Go_SideInput_Flink_Batch/ws/src/sdks/go/pkg/beam/register/register.go>:3382 +0xb0
github.com/apache/beam/sdks/v2/go/pkg/beam/register.(*caller3x1[...]).Call3x1(0x0?, {0x152c020?, 0xc00011b320?}, {0x1584280?, 0xc0005fad20?}, {0x12c56c0?, 0xc00011b3b0?})
<https://ci-beam.apache.org/job/beam_LoadTests_Go_SideInput_Flink_Batch/ws/src/sdks/go/pkg/beam/register/register.go>:3371 +0xb6
github.com/apache/beam/sdks/v2/go/pkg/beam/core/runtime/exec.(*invoker).initCall.func13({0x0, 0x0, 0x0, 0x0, 0x0}, {0x2333af0, 0x1, 0x1}, 0x12?)
<https://ci-beam.apache.org/job/beam_LoadTests_Go_SideInput_Flink_Batch/ws/src/sdks/go/pkg/beam/core/runtime/exec/fn_arity.go>:109 +0xad
github.com/apache/beam/sdks/v2/go/pkg/beam/core/runtime/exec.(*invoker).invokeWithOpts(0xc0005b8a00, {0x18778d0?, 0xc0002c9e80}, {0x0, 0x0, 0x0, 0x0, 0x0}, {0x2333af0, 0x1, ...}, ...)
<https://ci-beam.apache.org/job/beam_LoadTests_Go_SideInput_Flink_Batch/ws/src/sdks/go/pkg/beam/core/runtime/exec/fn.go>:301 +0x1132
github.com/apache/beam/sdks/v2/go/pkg/beam/core/runtime/exec.(*ParDo).invokeProcessFn(0xc0005b88c0, {0x18778d0, 0xc0002c9e80}, {0x0, 0x0, 0x0, 0x0, 0x0}, {0x2333af0, 0x1, ...}, ...)
<https://ci-beam.apache.org/job/beam_LoadTests_Go_SideInput_Flink_Batch/ws/src/sdks/go/pkg/beam/core/runtime/exec/pardo.go>:419 +0x2de
github.com/apache/beam/sdks/v2/go/pkg/beam/core/runtime/exec.(*ParDo).processSingleWindow(0xc0005b88c0, 0xc0003da6c0)
<https://ci-beam.apache.org/job/beam_LoadTests_Go_SideInput_Flink_Batch/ws/src/sdks/go/pkg/beam/core/runtime/exec/pardo.go>:190 +0x9b
github.com/apache/beam/sdks/v2/go/pkg/beam/core/runtime/exec.(*ProcessSizedElementsAndRestrictions).ProcessElement(0xc0002e0280, {0x18778d0, 0xc0005f1a80}, 0xc00022a0e0, {0x0, 0x0, 0x0})
<https://ci-beam.apache.org/job/beam_LoadTests_Go_SideInput_Flink_Batch/ws/src/sdks/go/pkg/beam/core/runtime/exec/sdf.go>:556 +0x63d
github.com/apache/beam/sdks/v2/go/pkg/beam/core/runtime/exec.(*DataSource).Process.func1(0xc00027d620, {0xc00036d340?, 0xc0000474c0?})
<https://ci-beam.apache.org/job/beam_LoadTests_Go_SideInput_Flink_Batch/ws/src/sdks/go/pkg/beam/core/runtime/exec/datasource.go>:241 +0x21e
github.com/apache/beam/sdks/v2/go/pkg/beam/core/runtime/exec.(*DataSource).process(0xc00029c9a0, {0x18778d0, 0xc0005f1a80}, 0xc00036d630, 0xc00036d610)
<https://ci-beam.apache.org/job/beam_LoadTests_Go_SideInput_Flink_Batch/ws/src/sdks/go/pkg/beam/core/runtime/exec/datasource.go>:147 +0x4f6
github.com/apache/beam/sdks/v2/go/pkg/beam/core/runtime/exec.(*DataSource).Process(0xc00029c9a0, {0x18778d0, 0xc0005f1a80})
<https://ci-beam.apache.org/job/beam_LoadTests_Go_SideInput_Flink_Batch/ws/src/sdks/go/pkg/beam/core/runtime/exec/datasource.go>:215 +0x226
github.com/apache/beam/sdks/v2/go/pkg/beam/core/runtime/exec.(*Plan).Execute.func2({0x18778d0?, 0xc0005f1a80?})
<https://ci-beam.apache.org/job/beam_LoadTests_Go_SideInput_Flink_Batch/ws/src/sdks/go/pkg/beam/core/runtime/exec/plan.go>:151 +0x42
github.com/apache/beam/sdks/v2/go/pkg/beam/core/runtime/exec.callNoPanic({0x18778d0?, 0xc0005f1a80?}, 0x415d50?)
<https://ci-beam.apache.org/job/beam_LoadTests_Go_SideInput_Flink_Batch/ws/src/sdks/go/pkg/beam/core/runtime/exec/util.go>:62 +0x6c
github.com/apache/beam/sdks/v2/go/pkg/beam/core/runtime/exec.(*Plan).Execute(0xc00029f950, {0x18778d0, 0xc0005f1a80}, {0x22daca0, 0x1}, {{0x186a3d0?, 0xc0002c9e00?}, {0x189fbd8?, 0xc0002c49f0?}})
<https://ci-beam.apache.org/job/beam_LoadTests_Go_SideInput_Flink_Batch/ws/src/sdks/go/pkg/beam/core/runtime/exec/plan.go>:150 +0x3df
github.com/apache/beam/sdks/v2/go/pkg/beam/core/runtime/harness.(*control).handleInstruction(0xc00007c000, {0x18777b8?, 0xc0005f2cc0?}, 0xc000036690)
<https://ci-beam.apache.org/job/beam_LoadTests_Go_SideInput_Flink_Batch/ws/src/sdks/go/pkg/beam/core/runtime/harness/harness.go>:408 +0xa53
github.com/apache/beam/sdks/v2/go/pkg/beam/core/runtime/harness.MainWithOptions.func4({0x18777b8?, 0xc0005f2cc0?}, 0x0?)
<https://ci-beam.apache.org/job/beam_LoadTests_Go_SideInput_Flink_Batch/ws/src/sdks/go/pkg/beam/core/runtime/harness/harness.go>:195 +0x7a
created by github.com/apache/beam/sdks/v2/go/pkg/beam/core/runtime/harness.MainWithOptions
<https://ci-beam.apache.org/job/beam_LoadTests_Go_SideInput_Flink_Batch/ws/src/sdks/go/pkg/beam/core/runtime/harness/harness.go>:213 +0xf1d
2023/06/02 14:00:45 Job state: FAILED
2023/06/02 14:00:45 Failed to execute job: job load0tests0go0flink0batch0sideinput0300602125512-root-0602135949-7a335c1c_890d5b67-380d-47e9-bf6c-9f9ada6af3cf failed
panic: Failed to execute job: job load0tests0go0flink0batch0sideinput0300602125512-root-0602135949-7a335c1c_890d5b67-380d-47e9-bf6c-9f9ada6af3cf failed
goroutine 1 [running]:
github.com/apache/beam/sdks/v2/go/pkg/beam/log.Fatalf({0x1877748, 0xc000126000}, {0x16f589b?, 0x23863b0?}, {0xc0005ede60?, 0x0?, 0x0?})
<https://ci-beam.apache.org/job/beam_LoadTests_Go_SideInput_Flink_Batch/ws/src/sdks/go/pkg/beam/log/log.go>:162 +0x8c
main.main()
<https://ci-beam.apache.org/job/beam_LoadTests_Go_SideInput_Flink_Batch/ws/src/sdks/go/test/load/sideinput/sideinput.go>:104 +0x439
> Task :sdks:go:test:load:run FAILED
FAILURE: Build failed with an exception.
* Where:
Build file '<https://ci-beam.apache.org/job/beam_LoadTests_Go_SideInput_Flink_Batch/ws/src/sdks/go/test/load/build.gradle'> line: 31
* What went wrong:
Execution failed for task ':sdks:go:test:load:run'.
> Process 'command 'sh'' finished with non-zero exit value 2
* Try:
> Run with --stacktrace option to get the stack trace.
> Run with --info or --debug option to get more log output.
* Get more help at https://help.gradle.org
BUILD FAILED in 1m 27s
12 actionable tasks: 6 executed, 4 from cache, 2 up-to-date
Publishing build scan...
https://ge.apache.org/s/b5z427jqthze2
Build step 'Invoke Gradle script' changed build result to FAILURE
Build step 'Invoke Gradle script' marked build as failure
---------------------------------------------------------------------
To unsubscribe, e-mail: builds-unsubscribe@beam.apache.org
For additional commands, e-mail: builds-help@beam.apache.org
Build failed in Jenkins: beam_LoadTests_Go_SideInput_Flink_Batch #890
Posted by Apache Jenkins Server <je...@builds.apache.org>.
See <https://ci-beam.apache.org/job/beam_LoadTests_Go_SideInput_Flink_Batch/890/display/redirect>
Changes:
------------------------------------------
[...truncated 41.88 KB...]
at scala.PartialFunction.applyOrElse(PartialFunction.scala:127)
at scala.PartialFunction.applyOrElse$(PartialFunction.scala:126)
at akka.japi.pf.UnitCaseStatement.applyOrElse(CaseStatements.scala:20)
at scala.PartialFunction$OrElse.applyOrElse(PartialFunction.scala:175)
at scala.PartialFunction$OrElse.applyOrElse(PartialFunction.scala:176)
at scala.PartialFunction$OrElse.applyOrElse(PartialFunction.scala:176)
at akka.actor.Actor.aroundReceive(Actor.scala:537)
at akka.actor.Actor.aroundReceive$(Actor.scala:535)
at akka.actor.AbstractActor.aroundReceive(AbstractActor.scala:220)
at akka.actor.ActorCell.receiveMessage(ActorCell.scala:580)
at akka.actor.ActorCell.invoke(ActorCell.scala:548)
at akka.dispatch.Mailbox.processMailbox(Mailbox.scala:270)
at akka.dispatch.Mailbox.run(Mailbox.scala:231)
at akka.dispatch.Mailbox.exec(Mailbox.scala:243)
at java.util.concurrent.ForkJoinTask.doExec(ForkJoinTask.java:290)
at java.util.concurrent.ForkJoinPool$WorkQueue.topLevelExec(ForkJoinPool.java:1020)
at java.util.concurrent.ForkJoinPool.scan(ForkJoinPool.java:1656)
at java.util.concurrent.ForkJoinPool.runWorker(ForkJoinPool.java:1594)
at java.util.concurrent.ForkJoinWorkerThread.run(ForkJoinWorkerThread.java:183)
Caused by: java.util.concurrent.ExecutionException: java.lang.RuntimeException: Error received from SDK harness for instruction 5: process bundle failed for instruction 5 using plan 1-4 : panic: datamgr.go [{5 fn/write/n3:0}]: error flushing buffer of length 3999992
caused by:
rpc error: code = Unknown desc =
Full error:
while executing Process for Plan[1-4]:
2: DataSink[S[fn/write/n3:0@localhost:35729]] Coder:W;fn/wire/n3:0<KV;c2<bytes;c0,bytes;c0>>!GWC
3: PCollection[n3] Out:[2]
4: SDF.ProcessSizedElementsAndRestrictions[synthetic.sourceFn] UID:4 Out:[2]
1: DataSource[S[fn/read/n2/SplitAndSize0:0@localhost:35729], local_output] Out:4 Coder:W;fn/wire/n2/SplitAndSize0:0<KV;c3/SplitAndSize0<KV;c3/PairWithRestriction0<R;c3[synthetic.SourceConfig],KV;c7<offsetrange.Restriction[offsetrange.Restriction;c4];c5,bool;c6>>,double;DoubleCoder0>>!GWC
caused by:
panic: datamgr.go [{5 fn/write/n3:0}]: error flushing buffer of length 3999992
caused by:
rpc error: code = Unknown desc = goroutine 25 [running]:
runtime/debug.Stack()
/home/jenkins/sdk/go1.20.4/src/runtime/debug/stack.go:24 +0x65
github.com/apache/beam/sdks/v2/go/pkg/beam/core/runtime/exec.callNoPanic.func1()
<https://ci-beam.apache.org/job/beam_LoadTests_Go_SideInput_Flink_Batch/ws/src/sdks/go/pkg/beam/core/runtime/exec/util.go>:58 +0xa5
panic({0x1458100, 0xc0004fa140})
/home/jenkins/sdk/go1.20.4/src/runtime/panic.go:884 +0x213
github.com/apache/beam/sdks/v2/go/pkg/beam/register.(*emit2[...]).invoke(0x1878fe0, {0xc000bbd8f0, 0xc0002b6590?, 0x18667b8?}, {0xc000bdd400?, 0x384, 0x384})
<https://ci-beam.apache.org/job/beam_LoadTests_Go_SideInput_Flink_Batch/ws/src/sdks/go/pkg/beam/register/emitter.go>:81 +0x22f
github.com/apache/beam/sdks/v2/go/pkg/beam/io/synthetic.(*sourceFn).ProcessElement(0xc00022b770, 0xc0002b6798?, {0x61a80, 0x1, 0x64, 0x384, 0x0, 0x0}, 0xc000011818)
<https://ci-beam.apache.org/job/beam_LoadTests_Go_SideInput_Flink_Batch/ws/src/sdks/go/pkg/beam/io/synthetic/source.go>:151 +0x123
github.com/apache/beam/sdks/v2/go/pkg/beam/register.registerDoFn3x1StructWrappersAndFuncs[...].func2.1({0x61a80?, 0x1, 0x64, 0x384, 0x0, 0x0}, 0x0)
<https://ci-beam.apache.org/job/beam_LoadTests_Go_SideInput_Flink_Batch/ws/src/sdks/go/pkg/beam/register/register.go>:3382 +0xb0
github.com/apache/beam/sdks/v2/go/pkg/beam/register.(*caller3x1[...]).Call3x1(0x0?, {0x152c020?, 0xc0000117e8?}, {0x1584280?, 0xc00029c8d0?}, {0x12c56c0?, 0xc000011818?})
<https://ci-beam.apache.org/job/beam_LoadTests_Go_SideInput_Flink_Batch/ws/src/sdks/go/pkg/beam/register/register.go>:3371 +0xb6
github.com/apache/beam/sdks/v2/go/pkg/beam/core/runtime/exec.(*invoker).initCall.func13({0x0, 0x0, 0x0, 0x0, 0x0}, {0x2333af0, 0x1, 0x1}, 0x12?)
<https://ci-beam.apache.org/job/beam_LoadTests_Go_SideInput_Flink_Batch/ws/src/sdks/go/pkg/beam/core/runtime/exec/fn_arity.go>:109 +0xad
github.com/apache/beam/sdks/v2/go/pkg/beam/core/runtime/exec.(*invoker).invokeWithOpts(0xc000096280, {0x18778d0?, 0xc000123dc0}, {0x0, 0x0, 0x0, 0x0, 0x0}, {0x2333af0, 0x1, ...}, ...)
<https://ci-beam.apache.org/job/beam_LoadTests_Go_SideInput_Flink_Batch/ws/src/sdks/go/pkg/beam/core/runtime/exec/fn.go>:301 +0x1132
github.com/apache/beam/sdks/v2/go/pkg/beam/core/runtime/exec.(*ParDo).invokeProcessFn(0xc000096140, {0x18778d0, 0xc000123dc0}, {0x0, 0x0, 0x0, 0x0, 0x0}, {0x2333af0, 0x1, ...}, ...)
<https://ci-beam.apache.org/job/beam_LoadTests_Go_SideInput_Flink_Batch/ws/src/sdks/go/pkg/beam/core/runtime/exec/pardo.go>:419 +0x2de
github.com/apache/beam/sdks/v2/go/pkg/beam/core/runtime/exec.(*ParDo).processSingleWindow(0xc000096140, 0xc0002a6cf0)
<https://ci-beam.apache.org/job/beam_LoadTests_Go_SideInput_Flink_Batch/ws/src/sdks/go/pkg/beam/core/runtime/exec/pardo.go>:190 +0x9b
github.com/apache/beam/sdks/v2/go/pkg/beam/core/runtime/exec.(*ProcessSizedElementsAndRestrictions).ProcessElement(0xc0002c8e60, {0x18778d0, 0xc000219800}, 0xc000125d50, {0x0, 0x0, 0x0})
<https://ci-beam.apache.org/job/beam_LoadTests_Go_SideInput_Flink_Batch/ws/src/sdks/go/pkg/beam/core/runtime/exec/sdf.go>:556 +0x63d
github.com/apache/beam/sdks/v2/go/pkg/beam/core/runtime/exec.(*DataSource).Process.func1(0xc00011b3e0, {0xc0002b7340?, 0xc0004bb340?})
<https://ci-beam.apache.org/job/beam_LoadTests_Go_SideInput_Flink_Batch/ws/src/sdks/go/pkg/beam/core/runtime/exec/datasource.go>:241 +0x21e
github.com/apache/beam/sdks/v2/go/pkg/beam/core/runtime/exec.(*DataSource).process(0xc0004a1340, {0x18778d0, 0xc000219800}, 0xc0002b7630, 0xc0002b7610)
<https://ci-beam.apache.org/job/beam_LoadTests_Go_SideInput_Flink_Batch/ws/src/sdks/go/pkg/beam/core/runtime/exec/datasource.go>:147 +0x4f6
github.com/apache/beam/sdks/v2/go/pkg/beam/core/runtime/exec.(*DataSource).Process(0xc0004a1340, {0x18778d0, 0xc000219800})
<https://ci-beam.apache.org/job/beam_LoadTests_Go_SideInput_Flink_Batch/ws/src/sdks/go/pkg/beam/core/runtime/exec/datasource.go>:215 +0x226
github.com/apache/beam/sdks/v2/go/pkg/beam/core/runtime/exec.(*Plan).Execute.func2({0x18778d0?, 0xc000219800?})
<https://ci-beam.apache.org/job/beam_LoadTests_Go_SideInput_Flink_Batch/ws/src/sdks/go/pkg/beam/core/runtime/exec/plan.go>:151 +0x42
github.com/apache/beam/sdks/v2/go/pkg/beam/core/runtime/exec.callNoPanic({0x18778d0?, 0xc000219800?}, 0x415d50?)
<https://ci-beam.apache.org/job/beam_LoadTests_Go_SideInput_Flink_Batch/ws/src/sdks/go/pkg/beam/core/runtime/exec/util.go>:62 +0x6c
github.com/apache/beam/sdks/v2/go/pkg/beam/core/runtime/exec.(*Plan).Execute(0xc0002a6120, {0x18778d0, 0xc000219800}, {0x22daca8, 0x1}, {{0x186a3d0?, 0xc000123bc0?}, {0x189fbd8?, 0xc00021bb90?}})
<https://ci-beam.apache.org/job/beam_LoadTests_Go_SideInput_Flink_Batch/ws/src/sdks/go/pkg/beam/core/runtime/exec/plan.go>:150 +0x3df
github.com/apache/beam/sdks/v2/go/pkg/beam/core/runtime/harness.(*control).handleInstruction(0xc0002c0000, {0x18777b8?, 0xc00021acc0?}, 0xc00010c230)
<https://ci-beam.apache.org/job/beam_LoadTests_Go_SideInput_Flink_Batch/ws/src/sdks/go/pkg/beam/core/runtime/harness/harness.go>:408 +0xa53
github.com/apache/beam/sdks/v2/go/pkg/beam/core/runtime/harness.MainWithOptions.func4({0x18777b8?, 0xc00021acc0?}, 0x3e6?)
<https://ci-beam.apache.org/job/beam_LoadTests_Go_SideInput_Flink_Batch/ws/src/sdks/go/pkg/beam/core/runtime/harness/harness.go>:195 +0x7a
created by github.com/apache/beam/sdks/v2/go/pkg/beam/core/runtime/harness.MainWithOptions
<https://ci-beam.apache.org/job/beam_LoadTests_Go_SideInput_Flink_Batch/ws/src/sdks/go/pkg/beam/core/runtime/harness/harness.go>:213 +0xf1d
at java.util.concurrent.CompletableFuture.reportGet(CompletableFuture.java:395)
at java.util.concurrent.CompletableFuture.get(CompletableFuture.java:1999)
at org.apache.beam.sdk.util.MoreFutures.get(MoreFutures.java:61)
at org.apache.beam.runners.fnexecution.control.SdkHarnessClient$BundleProcessor$ActiveBundle.close(SdkHarnessClient.java:522)
at org.apache.beam.runners.fnexecution.control.DefaultJobBundleFactory$SimpleStageBundleFactory$1.close(DefaultJobBundleFactory.java:556)
at org.apache.beam.runners.flink.translation.functions.FlinkExecutableStageFunction.$closeResource(FlinkExecutableStageFunction.java:269)
at org.apache.beam.runners.flink.translation.functions.FlinkExecutableStageFunction.mapPartition(FlinkExecutableStageFunction.java:269)
at org.apache.flink.runtime.operators.MapPartitionDriver.run(MapPartitionDriver.java:113)
at org.apache.flink.runtime.operators.BatchTask.run(BatchTask.java:514)
at org.apache.flink.runtime.operators.BatchTask.invoke(BatchTask.java:357)
at org.apache.flink.runtime.taskmanager.Task.runWithSystemExitMonitoring(Task.java:948)
at org.apache.flink.runtime.taskmanager.Task.restoreAndInvoke(Task.java:927)
at org.apache.flink.runtime.taskmanager.Task.doRun(Task.java:741)
at org.apache.flink.runtime.taskmanager.Task.run(Task.java:563)
at java.lang.Thread.run(Thread.java:829)
Caused by: java.lang.RuntimeException: Error received from SDK harness for instruction 5: process bundle failed for instruction 5 using plan 1-4 : panic: datamgr.go [{5 fn/write/n3:0}]: error flushing buffer of length 3999992
caused by:
rpc error: code = Unknown desc =
Full error:
while executing Process for Plan[1-4]:
2: DataSink[S[fn/write/n3:0@localhost:35729]] Coder:W;fn/wire/n3:0<KV;c2<bytes;c0,bytes;c0>>!GWC
3: PCollection[n3] Out:[2]
4: SDF.ProcessSizedElementsAndRestrictions[synthetic.sourceFn] UID:4 Out:[2]
1: DataSource[S[fn/read/n2/SplitAndSize0:0@localhost:35729], local_output] Out:4 Coder:W;fn/wire/n2/SplitAndSize0:0<KV;c3/SplitAndSize0<KV;c3/PairWithRestriction0<R;c3[synthetic.SourceConfig],KV;c7<offsetrange.Restriction[offsetrange.Restriction;c4];c5,bool;c6>>,double;DoubleCoder0>>!GWC
caused by:
panic: datamgr.go [{5 fn/write/n3:0}]: error flushing buffer of length 3999992
caused by:
rpc error: code = Unknown desc = goroutine 25 [running]:
runtime/debug.Stack()
/home/jenkins/sdk/go1.20.4/src/runtime/debug/stack.go:24 +0x65
github.com/apache/beam/sdks/v2/go/pkg/beam/core/runtime/exec.callNoPanic.func1()
<https://ci-beam.apache.org/job/beam_LoadTests_Go_SideInput_Flink_Batch/ws/src/sdks/go/pkg/beam/core/runtime/exec/util.go>:58 +0xa5
panic({0x1458100, 0xc0004fa140})
/home/jenkins/sdk/go1.20.4/src/runtime/panic.go:884 +0x213
github.com/apache/beam/sdks/v2/go/pkg/beam/register.(*emit2[...]).invoke(0x1878fe0, {0xc000bbd8f0, 0xc0002b6590?, 0x18667b8?}, {0xc000bdd400?, 0x384, 0x384})
<https://ci-beam.apache.org/job/beam_LoadTests_Go_SideInput_Flink_Batch/ws/src/sdks/go/pkg/beam/register/emitter.go>:81 +0x22f
github.com/apache/beam/sdks/v2/go/pkg/beam/io/synthetic.(*sourceFn).ProcessElement(0xc00022b770, 0xc0002b6798?, {0x61a80, 0x1, 0x64, 0x384, 0x0, 0x0}, 0xc000011818)
<https://ci-beam.apache.org/job/beam_LoadTests_Go_SideInput_Flink_Batch/ws/src/sdks/go/pkg/beam/io/synthetic/source.go>:151 +0x123
github.com/apache/beam/sdks/v2/go/pkg/beam/register.registerDoFn3x1StructWrappersAndFuncs[...].func2.1({0x61a80?, 0x1, 0x64, 0x384, 0x0, 0x0}, 0x0)
<https://ci-beam.apache.org/job/beam_LoadTests_Go_SideInput_Flink_Batch/ws/src/sdks/go/pkg/beam/register/register.go>:3382 +0xb0
github.com/apache/beam/sdks/v2/go/pkg/beam/register.(*caller3x1[...]).Call3x1(0x0?, {0x152c020?, 0xc0000117e8?}, {0x1584280?, 0xc00029c8d0?}, {0x12c56c0?, 0xc000011818?})
<https://ci-beam.apache.org/job/beam_LoadTests_Go_SideInput_Flink_Batch/ws/src/sdks/go/pkg/beam/register/register.go>:3371 +0xb6
github.com/apache/beam/sdks/v2/go/pkg/beam/core/runtime/exec.(*invoker).initCall.func13({0x0, 0x0, 0x0, 0x0, 0x0}, {0x2333af0, 0x1, 0x1}, 0x12?)
<https://ci-beam.apache.org/job/beam_LoadTests_Go_SideInput_Flink_Batch/ws/src/sdks/go/pkg/beam/core/runtime/exec/fn_arity.go>:109 +0xad
github.com/apache/beam/sdks/v2/go/pkg/beam/core/runtime/exec.(*invoker).invokeWithOpts(0xc000096280, {0x18778d0?, 0xc000123dc0}, {0x0, 0x0, 0x0, 0x0, 0x0}, {0x2333af0, 0x1, ...}, ...)
<https://ci-beam.apache.org/job/beam_LoadTests_Go_SideInput_Flink_Batch/ws/src/sdks/go/pkg/beam/core/runtime/exec/fn.go>:301 +0x1132
github.com/apache/beam/sdks/v2/go/pkg/beam/core/runtime/exec.(*ParDo).invokeProcessFn(0xc000096140, {0x18778d0, 0xc000123dc0}, {0x0, 0x0, 0x0, 0x0, 0x0}, {0x2333af0, 0x1, ...}, ...)
<https://ci-beam.apache.org/job/beam_LoadTests_Go_SideInput_Flink_Batch/ws/src/sdks/go/pkg/beam/core/runtime/exec/pardo.go>:419 +0x2de
github.com/apache/beam/sdks/v2/go/pkg/beam/core/runtime/exec.(*ParDo).processSingleWindow(0xc000096140, 0xc0002a6cf0)
<https://ci-beam.apache.org/job/beam_LoadTests_Go_SideInput_Flink_Batch/ws/src/sdks/go/pkg/beam/core/runtime/exec/pardo.go>:190 +0x9b
github.com/apache/beam/sdks/v2/go/pkg/beam/core/runtime/exec.(*ProcessSizedElementsAndRestrictions).ProcessElement(0xc0002c8e60, {0x18778d0, 0xc000219800}, 0xc000125d50, {0x0, 0x0, 0x0})
<https://ci-beam.apache.org/job/beam_LoadTests_Go_SideInput_Flink_Batch/ws/src/sdks/go/pkg/beam/core/runtime/exec/sdf.go>:556 +0x63d
github.com/apache/beam/sdks/v2/go/pkg/beam/core/runtime/exec.(*DataSource).Process.func1(0xc00011b3e0, {0xc0002b7340?, 0xc0004bb340?})
<https://ci-beam.apache.org/job/beam_LoadTests_Go_SideInput_Flink_Batch/ws/src/sdks/go/pkg/beam/core/runtime/exec/datasource.go>:241 +0x21e
github.com/apache/beam/sdks/v2/go/pkg/beam/core/runtime/exec.(*DataSource).process(0xc0004a1340, {0x18778d0, 0xc000219800}, 0xc0002b7630, 0xc0002b7610)
<https://ci-beam.apache.org/job/beam_LoadTests_Go_SideInput_Flink_Batch/ws/src/sdks/go/pkg/beam/core/runtime/exec/datasource.go>:147 +0x4f6
github.com/apache/beam/sdks/v2/go/pkg/beam/core/runtime/exec.(*DataSource).Process(0xc0004a1340, {0x18778d0, 0xc000219800})
<https://ci-beam.apache.org/job/beam_LoadTests_Go_SideInput_Flink_Batch/ws/src/sdks/go/pkg/beam/core/runtime/exec/datasource.go>:215 +0x226
github.com/apache/beam/sdks/v2/go/pkg/beam/core/runtime/exec.(*Plan).Execute.func2({0x18778d0?, 0xc000219800?})
<https://ci-beam.apache.org/job/beam_LoadTests_Go_SideInput_Flink_Batch/ws/src/sdks/go/pkg/beam/core/runtime/exec/plan.go>:151 +0x42
github.com/apache/beam/sdks/v2/go/pkg/beam/core/runtime/exec.callNoPanic({0x18778d0?, 0xc000219800?}, 0x415d50?)
<https://ci-beam.apache.org/job/beam_LoadTests_Go_SideInput_Flink_Batch/ws/src/sdks/go/pkg/beam/core/runtime/exec/util.go>:62 +0x6c
github.com/apache/beam/sdks/v2/go/pkg/beam/core/runtime/exec.(*Plan).Execute(0xc0002a6120, {0x18778d0, 0xc000219800}, {0x22daca8, 0x1}, {{0x186a3d0?, 0xc000123bc0?}, {0x189fbd8?, 0xc00021bb90?}})
<https://ci-beam.apache.org/job/beam_LoadTests_Go_SideInput_Flink_Batch/ws/src/sdks/go/pkg/beam/core/runtime/exec/plan.go>:150 +0x3df
github.com/apache/beam/sdks/v2/go/pkg/beam/core/runtime/harness.(*control).handleInstruction(0xc0002c0000, {0x18777b8?, 0xc00021acc0?}, 0xc00010c230)
<https://ci-beam.apache.org/job/beam_LoadTests_Go_SideInput_Flink_Batch/ws/src/sdks/go/pkg/beam/core/runtime/harness/harness.go>:408 +0xa53
github.com/apache/beam/sdks/v2/go/pkg/beam/core/runtime/harness.MainWithOptions.func4({0x18777b8?, 0xc00021acc0?}, 0x3e6?)
<https://ci-beam.apache.org/job/beam_LoadTests_Go_SideInput_Flink_Batch/ws/src/sdks/go/pkg/beam/core/runtime/harness/harness.go>:195 +0x7a
created by github.com/apache/beam/sdks/v2/go/pkg/beam/core/runtime/harness.MainWithOptions
<https://ci-beam.apache.org/job/beam_LoadTests_Go_SideInput_Flink_Batch/ws/src/sdks/go/pkg/beam/core/runtime/harness/harness.go>:213 +0xf1d
at org.apache.beam.runners.fnexecution.control.FnApiControlClient$ResponseStreamObserver.onNext(FnApiControlClient.java:180)
at org.apache.beam.runners.fnexecution.control.FnApiControlClient$ResponseStreamObserver.onNext(FnApiControlClient.java:160)
at org.apache.beam.vendor.grpc.v1p48p1.io.grpc.stub.ServerCalls$StreamingServerCallHandler$StreamingServerCallListener.onMessage(ServerCalls.java:262)
at org.apache.beam.vendor.grpc.v1p48p1.io.grpc.ForwardingServerCallListener.onMessage(ForwardingServerCallListener.java:33)
at org.apache.beam.vendor.grpc.v1p48p1.io.grpc.Contexts$ContextualizedServerCallListener.onMessage(Contexts.java:76)
at org.apache.beam.vendor.grpc.v1p48p1.io.grpc.internal.ServerCallImpl$ServerStreamListenerImpl.messagesAvailableInternal(ServerCallImpl.java:332)
at org.apache.beam.vendor.grpc.v1p48p1.io.grpc.internal.ServerCallImpl$ServerStreamListenerImpl.messagesAvailable(ServerCallImpl.java:315)
at org.apache.beam.vendor.grpc.v1p48p1.io.grpc.internal.ServerImpl$JumpToApplicationThreadServerStreamListener$1MessagesAvailable.runInContext(ServerImpl.java:834)
at org.apache.beam.vendor.grpc.v1p48p1.io.grpc.internal.ContextRunnable.run(ContextRunnable.java:37)
at org.apache.beam.vendor.grpc.v1p48p1.io.grpc.internal.SerializingExecutor.run(SerializingExecutor.java:133)
at java.util.concurrent.ThreadPoolExecutor.runWorker(ThreadPoolExecutor.java:1128)
at java.util.concurrent.ThreadPoolExecutor$Worker.run(ThreadPoolExecutor.java:628)
... 1 more
2023/06/01 14:00:39 (): java.lang.RuntimeException: Error received from SDK harness for instruction 5: process bundle failed for instruction 5 using plan 1-4 : panic: datamgr.go [{5 fn/write/n3:0}]: error flushing buffer of length 3999992
caused by:
rpc error: code = Unknown desc =
Full error:
while executing Process for Plan[1-4]:
2: DataSink[S[fn/write/n3:0@localhost:35729]] Coder:W;fn/wire/n3:0<KV;c2<bytes;c0,bytes;c0>>!GWC
3: PCollection[n3] Out:[2]
4: SDF.ProcessSizedElementsAndRestrictions[synthetic.sourceFn] UID:4 Out:[2]
1: DataSource[S[fn/read/n2/SplitAndSize0:0@localhost:35729], local_output] Out:4 Coder:W;fn/wire/n2/SplitAndSize0:0<KV;c3/SplitAndSize0<KV;c3/PairWithRestriction0<R;c3[synthetic.SourceConfig],KV;c7<offsetrange.Restriction[offsetrange.Restriction;c4];c5,bool;c6>>,double;DoubleCoder0>>!GWC
caused by:
panic: datamgr.go [{5 fn/write/n3:0}]: error flushing buffer of length 3999992
caused by:
rpc error: code = Unknown desc = goroutine 25 [running]:
runtime/debug.Stack()
/home/jenkins/sdk/go1.20.4/src/runtime/debug/stack.go:24 +0x65
github.com/apache/beam/sdks/v2/go/pkg/beam/core/runtime/exec.callNoPanic.func1()
<https://ci-beam.apache.org/job/beam_LoadTests_Go_SideInput_Flink_Batch/ws/src/sdks/go/pkg/beam/core/runtime/exec/util.go>:58 +0xa5
panic({0x1458100, 0xc0004fa140})
/home/jenkins/sdk/go1.20.4/src/runtime/panic.go:884 +0x213
github.com/apache/beam/sdks/v2/go/pkg/beam/register.(*emit2[...]).invoke(0x1878fe0, {0xc000bbd8f0, 0xc0002b6590?, 0x18667b8?}, {0xc000bdd400?, 0x384, 0x384})
<https://ci-beam.apache.org/job/beam_LoadTests_Go_SideInput_Flink_Batch/ws/src/sdks/go/pkg/beam/register/emitter.go>:81 +0x22f
github.com/apache/beam/sdks/v2/go/pkg/beam/io/synthetic.(*sourceFn).ProcessElement(0xc00022b770, 0xc0002b6798?, {0x61a80, 0x1, 0x64, 0x384, 0x0, 0x0}, 0xc000011818)
<https://ci-beam.apache.org/job/beam_LoadTests_Go_SideInput_Flink_Batch/ws/src/sdks/go/pkg/beam/io/synthetic/source.go>:151 +0x123
github.com/apache/beam/sdks/v2/go/pkg/beam/register.registerDoFn3x1StructWrappersAndFuncs[...].func2.1({0x61a80?, 0x1, 0x64, 0x384, 0x0, 0x0}, 0x0)
<https://ci-beam.apache.org/job/beam_LoadTests_Go_SideInput_Flink_Batch/ws/src/sdks/go/pkg/beam/register/register.go>:3382 +0xb0
github.com/apache/beam/sdks/v2/go/pkg/beam/register.(*caller3x1[...]).Call3x1(0x0?, {0x152c020?, 0xc0000117e8?}, {0x1584280?, 0xc00029c8d0?}, {0x12c56c0?, 0xc000011818?})
<https://ci-beam.apache.org/job/beam_LoadTests_Go_SideInput_Flink_Batch/ws/src/sdks/go/pkg/beam/register/register.go>:3371 +0xb6
github.com/apache/beam/sdks/v2/go/pkg/beam/core/runtime/exec.(*invoker).initCall.func13({0x0, 0x0, 0x0, 0x0, 0x0}, {0x2333af0, 0x1, 0x1}, 0x12?)
<https://ci-beam.apache.org/job/beam_LoadTests_Go_SideInput_Flink_Batch/ws/src/sdks/go/pkg/beam/core/runtime/exec/fn_arity.go>:109 +0xad
github.com/apache/beam/sdks/v2/go/pkg/beam/core/runtime/exec.(*invoker).invokeWithOpts(0xc000096280, {0x18778d0?, 0xc000123dc0}, {0x0, 0x0, 0x0, 0x0, 0x0}, {0x2333af0, 0x1, ...}, ...)
<https://ci-beam.apache.org/job/beam_LoadTests_Go_SideInput_Flink_Batch/ws/src/sdks/go/pkg/beam/core/runtime/exec/fn.go>:301 +0x1132
github.com/apache/beam/sdks/v2/go/pkg/beam/core/runtime/exec.(*ParDo).invokeProcessFn(0xc000096140, {0x18778d0, 0xc000123dc0}, {0x0, 0x0, 0x0, 0x0, 0x0}, {0x2333af0, 0x1, ...}, ...)
<https://ci-beam.apache.org/job/beam_LoadTests_Go_SideInput_Flink_Batch/ws/src/sdks/go/pkg/beam/core/runtime/exec/pardo.go>:419 +0x2de
github.com/apache/beam/sdks/v2/go/pkg/beam/core/runtime/exec.(*ParDo).processSingleWindow(0xc000096140, 0xc0002a6cf0)
<https://ci-beam.apache.org/job/beam_LoadTests_Go_SideInput_Flink_Batch/ws/src/sdks/go/pkg/beam/core/runtime/exec/pardo.go>:190 +0x9b
github.com/apache/beam/sdks/v2/go/pkg/beam/core/runtime/exec.(*ProcessSizedElementsAndRestrictions).ProcessElement(0xc0002c8e60, {0x18778d0, 0xc000219800}, 0xc000125d50, {0x0, 0x0, 0x0})
<https://ci-beam.apache.org/job/beam_LoadTests_Go_SideInput_Flink_Batch/ws/src/sdks/go/pkg/beam/core/runtime/exec/sdf.go>:556 +0x63d
github.com/apache/beam/sdks/v2/go/pkg/beam/core/runtime/exec.(*DataSource).Process.func1(0xc00011b3e0, {0xc0002b7340?, 0xc0004bb340?})
<https://ci-beam.apache.org/job/beam_LoadTests_Go_SideInput_Flink_Batch/ws/src/sdks/go/pkg/beam/core/runtime/exec/datasource.go>:241 +0x21e
github.com/apache/beam/sdks/v2/go/pkg/beam/core/runtime/exec.(*DataSource).process(0xc0004a1340, {0x18778d0, 0xc000219800}, 0xc0002b7630, 0xc0002b7610)
<https://ci-beam.apache.org/job/beam_LoadTests_Go_SideInput_Flink_Batch/ws/src/sdks/go/pkg/beam/core/runtime/exec/datasource.go>:147 +0x4f6
github.com/apache/beam/sdks/v2/go/pkg/beam/core/runtime/exec.(*DataSource).Process(0xc0004a1340, {0x18778d0, 0xc000219800})
<https://ci-beam.apache.org/job/beam_LoadTests_Go_SideInput_Flink_Batch/ws/src/sdks/go/pkg/beam/core/runtime/exec/datasource.go>:215 +0x226
github.com/apache/beam/sdks/v2/go/pkg/beam/core/runtime/exec.(*Plan).Execute.func2({0x18778d0?, 0xc000219800?})
<https://ci-beam.apache.org/job/beam_LoadTests_Go_SideInput_Flink_Batch/ws/src/sdks/go/pkg/beam/core/runtime/exec/plan.go>:151 +0x42
github.com/apache/beam/sdks/v2/go/pkg/beam/core/runtime/exec.callNoPanic({0x18778d0?, 0xc000219800?}, 0x415d50?)
<https://ci-beam.apache.org/job/beam_LoadTests_Go_SideInput_Flink_Batch/ws/src/sdks/go/pkg/beam/core/runtime/exec/util.go>:62 +0x6c
github.com/apache/beam/sdks/v2/go/pkg/beam/core/runtime/exec.(*Plan).Execute(0xc0002a6120, {0x18778d0, 0xc000219800}, {0x22daca8, 0x1}, {{0x186a3d0?, 0xc000123bc0?}, {0x189fbd8?, 0xc00021bb90?}})
<https://ci-beam.apache.org/job/beam_LoadTests_Go_SideInput_Flink_Batch/ws/src/sdks/go/pkg/beam/core/runtime/exec/plan.go>:150 +0x3df
github.com/apache/beam/sdks/v2/go/pkg/beam/core/runtime/harness.(*control).handleInstruction(0xc0002c0000, {0x18777b8?, 0xc00021acc0?}, 0xc00010c230)
<https://ci-beam.apache.org/job/beam_LoadTests_Go_SideInput_Flink_Batch/ws/src/sdks/go/pkg/beam/core/runtime/harness/harness.go>:408 +0xa53
github.com/apache/beam/sdks/v2/go/pkg/beam/core/runtime/harness.MainWithOptions.func4({0x18777b8?, 0xc00021acc0?}, 0x3e6?)
<https://ci-beam.apache.org/job/beam_LoadTests_Go_SideInput_Flink_Batch/ws/src/sdks/go/pkg/beam/core/runtime/harness/harness.go>:195 +0x7a
created by github.com/apache/beam/sdks/v2/go/pkg/beam/core/runtime/harness.MainWithOptions
<https://ci-beam.apache.org/job/beam_LoadTests_Go_SideInput_Flink_Batch/ws/src/sdks/go/pkg/beam/core/runtime/harness/harness.go>:213 +0xf1d
2023/06/01 14:00:40 Job state: FAILED
2023/06/01 14:00:40 Failed to execute job: job load0tests0go0flink0batch0sideinput0300601132654-root-0601135941-2088961d_72a9e3f1-af7e-45c8-b1d4-9861aa36197a failed
panic: Failed to execute job: job load0tests0go0flink0batch0sideinput0300601132654-root-0601135941-2088961d_72a9e3f1-af7e-45c8-b1d4-9861aa36197a failed
goroutine 1 [running]:
github.com/apache/beam/sdks/v2/go/pkg/beam/log.Fatalf({0x1877748, 0xc00004c0c0}, {0x16f589b?, 0x23863b0?}, {0xc0005ade60?, 0x0?, 0x0?})
<https://ci-beam.apache.org/job/beam_LoadTests_Go_SideInput_Flink_Batch/ws/src/sdks/go/pkg/beam/log/log.go>:162 +0x8c
main.main()
<https://ci-beam.apache.org/job/beam_LoadTests_Go_SideInput_Flink_Batch/ws/src/sdks/go/test/load/sideinput/sideinput.go>:104 +0x439
> Task :sdks:go:test:load:run FAILED
FAILURE: Build failed with an exception.
* Where:
Build file '<https://ci-beam.apache.org/job/beam_LoadTests_Go_SideInput_Flink_Batch/ws/src/sdks/go/test/load/build.gradle'> line: 31
* What went wrong:
Execution failed for task ':sdks:go:test:load:run'.
> Process 'command 'sh'' finished with non-zero exit value 2
* Try:
> Run with --stacktrace option to get the stack trace.
> Run with --info or --debug option to get more log output.
* Get more help at https://help.gradle.org
BUILD FAILED in 1m 41s
12 actionable tasks: 6 executed, 4 from cache, 2 up-to-date
Publishing build scan...
https://ge.apache.org/s/rdapc4byzaxs6
Build step 'Invoke Gradle script' changed build result to FAILURE
Build step 'Invoke Gradle script' marked build as failure
---------------------------------------------------------------------
To unsubscribe, e-mail: builds-unsubscribe@beam.apache.org
For additional commands, e-mail: builds-help@beam.apache.org
Build failed in Jenkins: beam_LoadTests_Go_SideInput_Flink_Batch #889
Posted by Apache Jenkins Server <je...@builds.apache.org>.
See <https://ci-beam.apache.org/job/beam_LoadTests_Go_SideInput_Flink_Batch/889/display/redirect?page=changes>
Changes:
[noreply] codeblockBackgroundColor in blockquoteDecoration, KeyedTabBar borders
------------------------------------------
[...truncated 41.92 KB...]
at scala.PartialFunction.applyOrElse(PartialFunction.scala:127)
at scala.PartialFunction.applyOrElse$(PartialFunction.scala:126)
at akka.japi.pf.UnitCaseStatement.applyOrElse(CaseStatements.scala:20)
at scala.PartialFunction$OrElse.applyOrElse(PartialFunction.scala:175)
at scala.PartialFunction$OrElse.applyOrElse(PartialFunction.scala:176)
at scala.PartialFunction$OrElse.applyOrElse(PartialFunction.scala:176)
at akka.actor.Actor.aroundReceive(Actor.scala:537)
at akka.actor.Actor.aroundReceive$(Actor.scala:535)
at akka.actor.AbstractActor.aroundReceive(AbstractActor.scala:220)
at akka.actor.ActorCell.receiveMessage(ActorCell.scala:580)
at akka.actor.ActorCell.invoke(ActorCell.scala:548)
at akka.dispatch.Mailbox.processMailbox(Mailbox.scala:270)
at akka.dispatch.Mailbox.run(Mailbox.scala:231)
at akka.dispatch.Mailbox.exec(Mailbox.scala:243)
at java.util.concurrent.ForkJoinTask.doExec(ForkJoinTask.java:290)
at java.util.concurrent.ForkJoinPool$WorkQueue.topLevelExec(ForkJoinPool.java:1020)
at java.util.concurrent.ForkJoinPool.scan(ForkJoinPool.java:1656)
at java.util.concurrent.ForkJoinPool.runWorker(ForkJoinPool.java:1594)
at java.util.concurrent.ForkJoinWorkerThread.run(ForkJoinWorkerThread.java:183)
Caused by: java.util.concurrent.ExecutionException: java.lang.RuntimeException: Error received from SDK harness for instruction 6: process bundle failed for instruction 6 using plan 1-7 : panic: datamgr.go [{6 fn/write/n3:0}]: error flushing buffer of length 3999992
caused by:
rpc error: code = Unknown desc =
Full error:
while executing Process for Plan[1-7]:
2: DataSink[S[fn/write/n3:0@localhost:36983]] Coder:W;fn/wire/n3:0<KV;c2<bytes;c0,bytes;c0>>!GWC
3: PCollection[n3] Out:[2]
4: SDF.ProcessSizedElementsAndRestrictions[synthetic.sourceFn] UID:4 Out:[2]
1: DataSource[S[fn/read/n2/SplitAndSize0:0@localhost:36983], local_output] Out:4 Coder:W;fn/wire/n2/SplitAndSize0:0<KV;c3/SplitAndSize0<KV;c3/PairWithRestriction0<R;c3[synthetic.SourceConfig],KV;c7<offsetrange.Restriction[offsetrange.Restriction;c4];c5,bool;c6>>,double;DoubleCoder0>>!GWC
caused by:
panic: datamgr.go [{6 fn/write/n3:0}]: error flushing buffer of length 3999992
caused by:
rpc error: code = Unknown desc = goroutine 34 [running]:
runtime/debug.Stack()
/home/jenkins/sdk/go1.20.4/src/runtime/debug/stack.go:24 +0x65
github.com/apache/beam/sdks/v2/go/pkg/beam/core/runtime/exec.callNoPanic.func1()
<https://ci-beam.apache.org/job/beam_LoadTests_Go_SideInput_Flink_Batch/ws/src/sdks/go/pkg/beam/core/runtime/exec/util.go>:58 +0xa5
panic({0x1458100, 0xc0004c8ac0})
/home/jenkins/sdk/go1.20.4/src/runtime/panic.go:884 +0x213
github.com/apache/beam/sdks/v2/go/pkg/beam/register.(*emit2[...]).invoke(0x1878fc0, {0xc000b9d8f0, 0xc00029e590?, 0x1866798?}, {0xc000bbd400?, 0x384, 0x384})
<https://ci-beam.apache.org/job/beam_LoadTests_Go_SideInput_Flink_Batch/ws/src/sdks/go/pkg/beam/register/emitter.go>:81 +0x22f
github.com/apache/beam/sdks/v2/go/pkg/beam/io/synthetic.(*sourceFn).ProcessElement(0xc000496b50, 0xc00029e798?, {0x61a80, 0x1, 0x64, 0x384, 0x0, 0x0}, 0xc0002f7890)
<https://ci-beam.apache.org/job/beam_LoadTests_Go_SideInput_Flink_Batch/ws/src/sdks/go/pkg/beam/io/synthetic/source.go>:151 +0x123
github.com/apache/beam/sdks/v2/go/pkg/beam/register.registerDoFn3x1StructWrappersAndFuncs[...].func2.1({0x61a80?, 0x1, 0x64, 0x384, 0x0, 0x0}, 0x0)
<https://ci-beam.apache.org/job/beam_LoadTests_Go_SideInput_Flink_Batch/ws/src/sdks/go/pkg/beam/register/register.go>:3382 +0xb0
github.com/apache/beam/sdks/v2/go/pkg/beam/register.(*caller3x1[...]).Call3x1(0x0?, {0x152c020?, 0xc0002f7860?}, {0x1584280?, 0xc00009b500?}, {0x12c56c0?, 0xc0002f7890?})
<https://ci-beam.apache.org/job/beam_LoadTests_Go_SideInput_Flink_Batch/ws/src/sdks/go/pkg/beam/register/register.go>:3371 +0xb6
github.com/apache/beam/sdks/v2/go/pkg/beam/core/runtime/exec.(*invoker).initCall.func13({0x0, 0x0, 0x0, 0x0, 0x0}, {0x23339d0, 0x1, 0x1}, 0x12?)
<https://ci-beam.apache.org/job/beam_LoadTests_Go_SideInput_Flink_Batch/ws/src/sdks/go/pkg/beam/core/runtime/exec/fn_arity.go>:109 +0xad
github.com/apache/beam/sdks/v2/go/pkg/beam/core/runtime/exec.(*invoker).invokeWithOpts(0xc000167040, {0x18778b0?, 0xc000414400}, {0x0, 0x0, 0x0, 0x0, 0x0}, {0x23339d0, 0x1, ...}, ...)
<https://ci-beam.apache.org/job/beam_LoadTests_Go_SideInput_Flink_Batch/ws/src/sdks/go/pkg/beam/core/runtime/exec/fn.go>:301 +0x1132
github.com/apache/beam/sdks/v2/go/pkg/beam/core/runtime/exec.(*ParDo).invokeProcessFn(0xc000166f00, {0x18778b0, 0xc000414400}, {0x0, 0x0, 0x0, 0x0, 0x0}, {0x23339d0, 0x1, ...}, ...)
<https://ci-beam.apache.org/job/beam_LoadTests_Go_SideInput_Flink_Batch/ws/src/sdks/go/pkg/beam/core/runtime/exec/pardo.go>:419 +0x2de
github.com/apache/beam/sdks/v2/go/pkg/beam/core/runtime/exec.(*ParDo).processSingleWindow(0xc000166f00, 0xc00034f7a0)
<https://ci-beam.apache.org/job/beam_LoadTests_Go_SideInput_Flink_Batch/ws/src/sdks/go/pkg/beam/core/runtime/exec/pardo.go>:190 +0x9b
github.com/apache/beam/sdks/v2/go/pkg/beam/core/runtime/exec.(*ProcessSizedElementsAndRestrictions).ProcessElement(0xc0004163c0, {0x18778b0, 0xc000123f00}, 0xc0002fbd50, {0x0, 0x0, 0x0})
<https://ci-beam.apache.org/job/beam_LoadTests_Go_SideInput_Flink_Batch/ws/src/sdks/go/pkg/beam/core/runtime/exec/sdf.go>:556 +0x63d
github.com/apache/beam/sdks/v2/go/pkg/beam/core/runtime/exec.(*DataSource).Process.func1(0xc0002f63c0, {0xc00029f340?, 0xc0004b8b00?})
<https://ci-beam.apache.org/job/beam_LoadTests_Go_SideInput_Flink_Batch/ws/src/sdks/go/pkg/beam/core/runtime/exec/datasource.go>:241 +0x21e
github.com/apache/beam/sdks/v2/go/pkg/beam/core/runtime/exec.(*DataSource).process(0xc000272840, {0x18778b0, 0xc000123f00}, 0xc00029f630, 0xc00029f610)
<https://ci-beam.apache.org/job/beam_LoadTests_Go_SideInput_Flink_Batch/ws/src/sdks/go/pkg/beam/core/runtime/exec/datasource.go>:147 +0x4f6
github.com/apache/beam/sdks/v2/go/pkg/beam/core/runtime/exec.(*DataSource).Process(0xc000272840, {0x18778b0, 0xc000123f00})
<https://ci-beam.apache.org/job/beam_LoadTests_Go_SideInput_Flink_Batch/ws/src/sdks/go/pkg/beam/core/runtime/exec/datasource.go>:215 +0x226
github.com/apache/beam/sdks/v2/go/pkg/beam/core/runtime/exec.(*Plan).Execute.func2({0x18778b0?, 0xc000123f00?})
<https://ci-beam.apache.org/job/beam_LoadTests_Go_SideInput_Flink_Batch/ws/src/sdks/go/pkg/beam/core/runtime/exec/plan.go>:151 +0x42
github.com/apache/beam/sdks/v2/go/pkg/beam/core/runtime/exec.callNoPanic({0x18778b0?, 0xc000123f00?}, 0x415d50?)
<https://ci-beam.apache.org/job/beam_LoadTests_Go_SideInput_Flink_Batch/ws/src/sdks/go/pkg/beam/core/runtime/exec/util.go>:62 +0x6c
github.com/apache/beam/sdks/v2/go/pkg/beam/core/runtime/exec.(*Plan).Execute(0xc00034e900, {0x18778b0, 0xc000123f00}, {0x22dabb0, 0x1}, {{0x186a3b0?, 0xc000414380?}, {0x189fbb8?, 0xc00034bb60?}})
<https://ci-beam.apache.org/job/beam_LoadTests_Go_SideInput_Flink_Batch/ws/src/sdks/go/pkg/beam/core/runtime/exec/plan.go>:150 +0x3df
github.com/apache/beam/sdks/v2/go/pkg/beam/core/runtime/harness.(*control).handleInstruction(0xc00067a000, {0x1877798?, 0xc000609cb0?}, 0xc0000984b0)
<https://ci-beam.apache.org/job/beam_LoadTests_Go_SideInput_Flink_Batch/ws/src/sdks/go/pkg/beam/core/runtime/harness/harness.go>:408 +0xa53
github.com/apache/beam/sdks/v2/go/pkg/beam/core/runtime/harness.MainWithOptions.func4({0x1877798?, 0xc000609cb0?}, 0xc0004c1b00?)
<https://ci-beam.apache.org/job/beam_LoadTests_Go_SideInput_Flink_Batch/ws/src/sdks/go/pkg/beam/core/runtime/harness/harness.go>:195 +0x7a
created by github.com/apache/beam/sdks/v2/go/pkg/beam/core/runtime/harness.MainWithOptions
<https://ci-beam.apache.org/job/beam_LoadTests_Go_SideInput_Flink_Batch/ws/src/sdks/go/pkg/beam/core/runtime/harness/harness.go>:213 +0xf1d
at java.util.concurrent.CompletableFuture.reportGet(CompletableFuture.java:395)
at java.util.concurrent.CompletableFuture.get(CompletableFuture.java:1999)
at org.apache.beam.sdk.util.MoreFutures.get(MoreFutures.java:61)
at org.apache.beam.runners.fnexecution.control.SdkHarnessClient$BundleProcessor$ActiveBundle.close(SdkHarnessClient.java:522)
at org.apache.beam.runners.fnexecution.control.DefaultJobBundleFactory$SimpleStageBundleFactory$1.close(DefaultJobBundleFactory.java:556)
at org.apache.beam.runners.flink.translation.functions.FlinkExecutableStageFunction.$closeResource(FlinkExecutableStageFunction.java:269)
at org.apache.beam.runners.flink.translation.functions.FlinkExecutableStageFunction.mapPartition(FlinkExecutableStageFunction.java:269)
at org.apache.flink.runtime.operators.MapPartitionDriver.run(MapPartitionDriver.java:113)
at org.apache.flink.runtime.operators.BatchTask.run(BatchTask.java:514)
at org.apache.flink.runtime.operators.BatchTask.invoke(BatchTask.java:357)
at org.apache.flink.runtime.taskmanager.Task.runWithSystemExitMonitoring(Task.java:948)
at org.apache.flink.runtime.taskmanager.Task.restoreAndInvoke(Task.java:927)
at org.apache.flink.runtime.taskmanager.Task.doRun(Task.java:741)
at org.apache.flink.runtime.taskmanager.Task.run(Task.java:563)
at java.lang.Thread.run(Thread.java:829)
Caused by: java.lang.RuntimeException: Error received from SDK harness for instruction 6: process bundle failed for instruction 6 using plan 1-7 : panic: datamgr.go [{6 fn/write/n3:0}]: error flushing buffer of length 3999992
caused by:
rpc error: code = Unknown desc =
Full error:
while executing Process for Plan[1-7]:
2: DataSink[S[fn/write/n3:0@localhost:36983]] Coder:W;fn/wire/n3:0<KV;c2<bytes;c0,bytes;c0>>!GWC
3: PCollection[n3] Out:[2]
4: SDF.ProcessSizedElementsAndRestrictions[synthetic.sourceFn] UID:4 Out:[2]
1: DataSource[S[fn/read/n2/SplitAndSize0:0@localhost:36983], local_output] Out:4 Coder:W;fn/wire/n2/SplitAndSize0:0<KV;c3/SplitAndSize0<KV;c3/PairWithRestriction0<R;c3[synthetic.SourceConfig],KV;c7<offsetrange.Restriction[offsetrange.Restriction;c4];c5,bool;c6>>,double;DoubleCoder0>>!GWC
caused by:
panic: datamgr.go [{6 fn/write/n3:0}]: error flushing buffer of length 3999992
caused by:
rpc error: code = Unknown desc = goroutine 34 [running]:
runtime/debug.Stack()
/home/jenkins/sdk/go1.20.4/src/runtime/debug/stack.go:24 +0x65
github.com/apache/beam/sdks/v2/go/pkg/beam/core/runtime/exec.callNoPanic.func1()
<https://ci-beam.apache.org/job/beam_LoadTests_Go_SideInput_Flink_Batch/ws/src/sdks/go/pkg/beam/core/runtime/exec/util.go>:58 +0xa5
panic({0x1458100, 0xc0004c8ac0})
/home/jenkins/sdk/go1.20.4/src/runtime/panic.go:884 +0x213
github.com/apache/beam/sdks/v2/go/pkg/beam/register.(*emit2[...]).invoke(0x1878fc0, {0xc000b9d8f0, 0xc00029e590?, 0x1866798?}, {0xc000bbd400?, 0x384, 0x384})
<https://ci-beam.apache.org/job/beam_LoadTests_Go_SideInput_Flink_Batch/ws/src/sdks/go/pkg/beam/register/emitter.go>:81 +0x22f
github.com/apache/beam/sdks/v2/go/pkg/beam/io/synthetic.(*sourceFn).ProcessElement(0xc000496b50, 0xc00029e798?, {0x61a80, 0x1, 0x64, 0x384, 0x0, 0x0}, 0xc0002f7890)
<https://ci-beam.apache.org/job/beam_LoadTests_Go_SideInput_Flink_Batch/ws/src/sdks/go/pkg/beam/io/synthetic/source.go>:151 +0x123
github.com/apache/beam/sdks/v2/go/pkg/beam/register.registerDoFn3x1StructWrappersAndFuncs[...].func2.1({0x61a80?, 0x1, 0x64, 0x384, 0x0, 0x0}, 0x0)
<https://ci-beam.apache.org/job/beam_LoadTests_Go_SideInput_Flink_Batch/ws/src/sdks/go/pkg/beam/register/register.go>:3382 +0xb0
github.com/apache/beam/sdks/v2/go/pkg/beam/register.(*caller3x1[...]).Call3x1(0x0?, {0x152c020?, 0xc0002f7860?}, {0x1584280?, 0xc00009b500?}, {0x12c56c0?, 0xc0002f7890?})
<https://ci-beam.apache.org/job/beam_LoadTests_Go_SideInput_Flink_Batch/ws/src/sdks/go/pkg/beam/register/register.go>:3371 +0xb6
github.com/apache/beam/sdks/v2/go/pkg/beam/core/runtime/exec.(*invoker).initCall.func13({0x0, 0x0, 0x0, 0x0, 0x0}, {0x23339d0, 0x1, 0x1}, 0x12?)
<https://ci-beam.apache.org/job/beam_LoadTests_Go_SideInput_Flink_Batch/ws/src/sdks/go/pkg/beam/core/runtime/exec/fn_arity.go>:109 +0xad
github.com/apache/beam/sdks/v2/go/pkg/beam/core/runtime/exec.(*invoker).invokeWithOpts(0xc000167040, {0x18778b0?, 0xc000414400}, {0x0, 0x0, 0x0, 0x0, 0x0}, {0x23339d0, 0x1, ...}, ...)
<https://ci-beam.apache.org/job/beam_LoadTests_Go_SideInput_Flink_Batch/ws/src/sdks/go/pkg/beam/core/runtime/exec/fn.go>:301 +0x1132
github.com/apache/beam/sdks/v2/go/pkg/beam/core/runtime/exec.(*ParDo).invokeProcessFn(0xc000166f00, {0x18778b0, 0xc000414400}, {0x0, 0x0, 0x0, 0x0, 0x0}, {0x23339d0, 0x1, ...}, ...)
<https://ci-beam.apache.org/job/beam_LoadTests_Go_SideInput_Flink_Batch/ws/src/sdks/go/pkg/beam/core/runtime/exec/pardo.go>:419 +0x2de
github.com/apache/beam/sdks/v2/go/pkg/beam/core/runtime/exec.(*ParDo).processSingleWindow(0xc000166f00, 0xc00034f7a0)
<https://ci-beam.apache.org/job/beam_LoadTests_Go_SideInput_Flink_Batch/ws/src/sdks/go/pkg/beam/core/runtime/exec/pardo.go>:190 +0x9b
github.com/apache/beam/sdks/v2/go/pkg/beam/core/runtime/exec.(*ProcessSizedElementsAndRestrictions).ProcessElement(0xc0004163c0, {0x18778b0, 0xc000123f00}, 0xc0002fbd50, {0x0, 0x0, 0x0})
<https://ci-beam.apache.org/job/beam_LoadTests_Go_SideInput_Flink_Batch/ws/src/sdks/go/pkg/beam/core/runtime/exec/sdf.go>:556 +0x63d
github.com/apache/beam/sdks/v2/go/pkg/beam/core/runtime/exec.(*DataSource).Process.func1(0xc0002f63c0, {0xc00029f340?, 0xc0004b8b00?})
<https://ci-beam.apache.org/job/beam_LoadTests_Go_SideInput_Flink_Batch/ws/src/sdks/go/pkg/beam/core/runtime/exec/datasource.go>:241 +0x21e
github.com/apache/beam/sdks/v2/go/pkg/beam/core/runtime/exec.(*DataSource).process(0xc000272840, {0x18778b0, 0xc000123f00}, 0xc00029f630, 0xc00029f610)
<https://ci-beam.apache.org/job/beam_LoadTests_Go_SideInput_Flink_Batch/ws/src/sdks/go/pkg/beam/core/runtime/exec/datasource.go>:147 +0x4f6
github.com/apache/beam/sdks/v2/go/pkg/beam/core/runtime/exec.(*DataSource).Process(0xc000272840, {0x18778b0, 0xc000123f00})
<https://ci-beam.apache.org/job/beam_LoadTests_Go_SideInput_Flink_Batch/ws/src/sdks/go/pkg/beam/core/runtime/exec/datasource.go>:215 +0x226
github.com/apache/beam/sdks/v2/go/pkg/beam/core/runtime/exec.(*Plan).Execute.func2({0x18778b0?, 0xc000123f00?})
<https://ci-beam.apache.org/job/beam_LoadTests_Go_SideInput_Flink_Batch/ws/src/sdks/go/pkg/beam/core/runtime/exec/plan.go>:151 +0x42
github.com/apache/beam/sdks/v2/go/pkg/beam/core/runtime/exec.callNoPanic({0x18778b0?, 0xc000123f00?}, 0x415d50?)
<https://ci-beam.apache.org/job/beam_LoadTests_Go_SideInput_Flink_Batch/ws/src/sdks/go/pkg/beam/core/runtime/exec/util.go>:62 +0x6c
github.com/apache/beam/sdks/v2/go/pkg/beam/core/runtime/exec.(*Plan).Execute(0xc00034e900, {0x18778b0, 0xc000123f00}, {0x22dabb0, 0x1}, {{0x186a3b0?, 0xc000414380?}, {0x189fbb8?, 0xc00034bb60?}})
<https://ci-beam.apache.org/job/beam_LoadTests_Go_SideInput_Flink_Batch/ws/src/sdks/go/pkg/beam/core/runtime/exec/plan.go>:150 +0x3df
github.com/apache/beam/sdks/v2/go/pkg/beam/core/runtime/harness.(*control).handleInstruction(0xc00067a000, {0x1877798?, 0xc000609cb0?}, 0xc0000984b0)
<https://ci-beam.apache.org/job/beam_LoadTests_Go_SideInput_Flink_Batch/ws/src/sdks/go/pkg/beam/core/runtime/harness/harness.go>:408 +0xa53
github.com/apache/beam/sdks/v2/go/pkg/beam/core/runtime/harness.MainWithOptions.func4({0x1877798?, 0xc000609cb0?}, 0xc0004c1b00?)
<https://ci-beam.apache.org/job/beam_LoadTests_Go_SideInput_Flink_Batch/ws/src/sdks/go/pkg/beam/core/runtime/harness/harness.go>:195 +0x7a
created by github.com/apache/beam/sdks/v2/go/pkg/beam/core/runtime/harness.MainWithOptions
<https://ci-beam.apache.org/job/beam_LoadTests_Go_SideInput_Flink_Batch/ws/src/sdks/go/pkg/beam/core/runtime/harness/harness.go>:213 +0xf1d
at org.apache.beam.runners.fnexecution.control.FnApiControlClient$ResponseStreamObserver.onNext(FnApiControlClient.java:180)
at org.apache.beam.runners.fnexecution.control.FnApiControlClient$ResponseStreamObserver.onNext(FnApiControlClient.java:160)
at org.apache.beam.vendor.grpc.v1p48p1.io.grpc.stub.ServerCalls$StreamingServerCallHandler$StreamingServerCallListener.onMessage(ServerCalls.java:262)
at org.apache.beam.vendor.grpc.v1p48p1.io.grpc.ForwardingServerCallListener.onMessage(ForwardingServerCallListener.java:33)
at org.apache.beam.vendor.grpc.v1p48p1.io.grpc.Contexts$ContextualizedServerCallListener.onMessage(Contexts.java:76)
at org.apache.beam.vendor.grpc.v1p48p1.io.grpc.internal.ServerCallImpl$ServerStreamListenerImpl.messagesAvailableInternal(ServerCallImpl.java:332)
at org.apache.beam.vendor.grpc.v1p48p1.io.grpc.internal.ServerCallImpl$ServerStreamListenerImpl.messagesAvailable(ServerCallImpl.java:315)
at org.apache.beam.vendor.grpc.v1p48p1.io.grpc.internal.ServerImpl$JumpToApplicationThreadServerStreamListener$1MessagesAvailable.runInContext(ServerImpl.java:834)
at org.apache.beam.vendor.grpc.v1p48p1.io.grpc.internal.ContextRunnable.run(ContextRunnable.java:37)
at org.apache.beam.vendor.grpc.v1p48p1.io.grpc.internal.SerializingExecutor.run(SerializingExecutor.java:133)
at java.util.concurrent.ThreadPoolExecutor.runWorker(ThreadPoolExecutor.java:1128)
at java.util.concurrent.ThreadPoolExecutor$Worker.run(ThreadPoolExecutor.java:628)
... 1 more
2023/05/31 14:00:34 (): java.lang.RuntimeException: Error received from SDK harness for instruction 6: process bundle failed for instruction 6 using plan 1-7 : panic: datamgr.go [{6 fn/write/n3:0}]: error flushing buffer of length 3999992
caused by:
rpc error: code = Unknown desc =
Full error:
while executing Process for Plan[1-7]:
2: DataSink[S[fn/write/n3:0@localhost:36983]] Coder:W;fn/wire/n3:0<KV;c2<bytes;c0,bytes;c0>>!GWC
3: PCollection[n3] Out:[2]
4: SDF.ProcessSizedElementsAndRestrictions[synthetic.sourceFn] UID:4 Out:[2]
1: DataSource[S[fn/read/n2/SplitAndSize0:0@localhost:36983], local_output] Out:4 Coder:W;fn/wire/n2/SplitAndSize0:0<KV;c3/SplitAndSize0<KV;c3/PairWithRestriction0<R;c3[synthetic.SourceConfig],KV;c7<offsetrange.Restriction[offsetrange.Restriction;c4];c5,bool;c6>>,double;DoubleCoder0>>!GWC
caused by:
panic: datamgr.go [{6 fn/write/n3:0}]: error flushing buffer of length 3999992
caused by:
rpc error: code = Unknown desc = goroutine 34 [running]:
runtime/debug.Stack()
/home/jenkins/sdk/go1.20.4/src/runtime/debug/stack.go:24 +0x65
github.com/apache/beam/sdks/v2/go/pkg/beam/core/runtime/exec.callNoPanic.func1()
<https://ci-beam.apache.org/job/beam_LoadTests_Go_SideInput_Flink_Batch/ws/src/sdks/go/pkg/beam/core/runtime/exec/util.go>:58 +0xa5
panic({0x1458100, 0xc0004c8ac0})
/home/jenkins/sdk/go1.20.4/src/runtime/panic.go:884 +0x213
github.com/apache/beam/sdks/v2/go/pkg/beam/register.(*emit2[...]).invoke(0x1878fc0, {0xc000b9d8f0, 0xc00029e590?, 0x1866798?}, {0xc000bbd400?, 0x384, 0x384})
<https://ci-beam.apache.org/job/beam_LoadTests_Go_SideInput_Flink_Batch/ws/src/sdks/go/pkg/beam/register/emitter.go>:81 +0x22f
github.com/apache/beam/sdks/v2/go/pkg/beam/io/synthetic.(*sourceFn).ProcessElement(0xc000496b50, 0xc00029e798?, {0x61a80, 0x1, 0x64, 0x384, 0x0, 0x0}, 0xc0002f7890)
<https://ci-beam.apache.org/job/beam_LoadTests_Go_SideInput_Flink_Batch/ws/src/sdks/go/pkg/beam/io/synthetic/source.go>:151 +0x123
github.com/apache/beam/sdks/v2/go/pkg/beam/register.registerDoFn3x1StructWrappersAndFuncs[...].func2.1({0x61a80?, 0x1, 0x64, 0x384, 0x0, 0x0}, 0x0)
<https://ci-beam.apache.org/job/beam_LoadTests_Go_SideInput_Flink_Batch/ws/src/sdks/go/pkg/beam/register/register.go>:3382 +0xb0
github.com/apache/beam/sdks/v2/go/pkg/beam/register.(*caller3x1[...]).Call3x1(0x0?, {0x152c020?, 0xc0002f7860?}, {0x1584280?, 0xc00009b500?}, {0x12c56c0?, 0xc0002f7890?})
<https://ci-beam.apache.org/job/beam_LoadTests_Go_SideInput_Flink_Batch/ws/src/sdks/go/pkg/beam/register/register.go>:3371 +0xb6
github.com/apache/beam/sdks/v2/go/pkg/beam/core/runtime/exec.(*invoker).initCall.func13({0x0, 0x0, 0x0, 0x0, 0x0}, {0x23339d0, 0x1, 0x1}, 0x12?)
<https://ci-beam.apache.org/job/beam_LoadTests_Go_SideInput_Flink_Batch/ws/src/sdks/go/pkg/beam/core/runtime/exec/fn_arity.go>:109 +0xad
github.com/apache/beam/sdks/v2/go/pkg/beam/core/runtime/exec.(*invoker).invokeWithOpts(0xc000167040, {0x18778b0?, 0xc000414400}, {0x0, 0x0, 0x0, 0x0, 0x0}, {0x23339d0, 0x1, ...}, ...)
<https://ci-beam.apache.org/job/beam_LoadTests_Go_SideInput_Flink_Batch/ws/src/sdks/go/pkg/beam/core/runtime/exec/fn.go>:301 +0x1132
github.com/apache/beam/sdks/v2/go/pkg/beam/core/runtime/exec.(*ParDo).invokeProcessFn(0xc000166f00, {0x18778b0, 0xc000414400}, {0x0, 0x0, 0x0, 0x0, 0x0}, {0x23339d0, 0x1, ...}, ...)
<https://ci-beam.apache.org/job/beam_LoadTests_Go_SideInput_Flink_Batch/ws/src/sdks/go/pkg/beam/core/runtime/exec/pardo.go>:419 +0x2de
github.com/apache/beam/sdks/v2/go/pkg/beam/core/runtime/exec.(*ParDo).processSingleWindow(0xc000166f00, 0xc00034f7a0)
<https://ci-beam.apache.org/job/beam_LoadTests_Go_SideInput_Flink_Batch/ws/src/sdks/go/pkg/beam/core/runtime/exec/pardo.go>:190 +0x9b
github.com/apache/beam/sdks/v2/go/pkg/beam/core/runtime/exec.(*ProcessSizedElementsAndRestrictions).ProcessElement(0xc0004163c0, {0x18778b0, 0xc000123f00}, 0xc0002fbd50, {0x0, 0x0, 0x0})
<https://ci-beam.apache.org/job/beam_LoadTests_Go_SideInput_Flink_Batch/ws/src/sdks/go/pkg/beam/core/runtime/exec/sdf.go>:556 +0x63d
github.com/apache/beam/sdks/v2/go/pkg/beam/core/runtime/exec.(*DataSource).Process.func1(0xc0002f63c0, {0xc00029f340?, 0xc0004b8b00?})
<https://ci-beam.apache.org/job/beam_LoadTests_Go_SideInput_Flink_Batch/ws/src/sdks/go/pkg/beam/core/runtime/exec/datasource.go>:241 +0x21e
github.com/apache/beam/sdks/v2/go/pkg/beam/core/runtime/exec.(*DataSource).process(0xc000272840, {0x18778b0, 0xc000123f00}, 0xc00029f630, 0xc00029f610)
<https://ci-beam.apache.org/job/beam_LoadTests_Go_SideInput_Flink_Batch/ws/src/sdks/go/pkg/beam/core/runtime/exec/datasource.go>:147 +0x4f6
github.com/apache/beam/sdks/v2/go/pkg/beam/core/runtime/exec.(*DataSource).Process(0xc000272840, {0x18778b0, 0xc000123f00})
<https://ci-beam.apache.org/job/beam_LoadTests_Go_SideInput_Flink_Batch/ws/src/sdks/go/pkg/beam/core/runtime/exec/datasource.go>:215 +0x226
github.com/apache/beam/sdks/v2/go/pkg/beam/core/runtime/exec.(*Plan).Execute.func2({0x18778b0?, 0xc000123f00?})
<https://ci-beam.apache.org/job/beam_LoadTests_Go_SideInput_Flink_Batch/ws/src/sdks/go/pkg/beam/core/runtime/exec/plan.go>:151 +0x42
github.com/apache/beam/sdks/v2/go/pkg/beam/core/runtime/exec.callNoPanic({0x18778b0?, 0xc000123f00?}, 0x415d50?)
<https://ci-beam.apache.org/job/beam_LoadTests_Go_SideInput_Flink_Batch/ws/src/sdks/go/pkg/beam/core/runtime/exec/util.go>:62 +0x6c
github.com/apache/beam/sdks/v2/go/pkg/beam/core/runtime/exec.(*Plan).Execute(0xc00034e900, {0x18778b0, 0xc000123f00}, {0x22dabb0, 0x1}, {{0x186a3b0?, 0xc000414380?}, {0x189fbb8?, 0xc00034bb60?}})
<https://ci-beam.apache.org/job/beam_LoadTests_Go_SideInput_Flink_Batch/ws/src/sdks/go/pkg/beam/core/runtime/exec/plan.go>:150 +0x3df
github.com/apache/beam/sdks/v2/go/pkg/beam/core/runtime/harness.(*control).handleInstruction(0xc00067a000, {0x1877798?, 0xc000609cb0?}, 0xc0000984b0)
<https://ci-beam.apache.org/job/beam_LoadTests_Go_SideInput_Flink_Batch/ws/src/sdks/go/pkg/beam/core/runtime/harness/harness.go>:408 +0xa53
github.com/apache/beam/sdks/v2/go/pkg/beam/core/runtime/harness.MainWithOptions.func4({0x1877798?, 0xc000609cb0?}, 0xc0004c1b00?)
<https://ci-beam.apache.org/job/beam_LoadTests_Go_SideInput_Flink_Batch/ws/src/sdks/go/pkg/beam/core/runtime/harness/harness.go>:195 +0x7a
created by github.com/apache/beam/sdks/v2/go/pkg/beam/core/runtime/harness.MainWithOptions
<https://ci-beam.apache.org/job/beam_LoadTests_Go_SideInput_Flink_Batch/ws/src/sdks/go/pkg/beam/core/runtime/harness/harness.go>:213 +0xf1d
2023/05/31 14:00:35 Job state: FAILED
2023/05/31 14:00:35 Failed to execute job: job load0tests0go0flink0batch0sideinput0300531125529-root-0531135941-ee26a948_0a0d6129-25b0-4d0a-b1ad-9c540a5fd736 failed
panic: Failed to execute job: job load0tests0go0flink0batch0sideinput0300531125529-root-0531135941-ee26a948_0a0d6129-25b0-4d0a-b1ad-9c540a5fd736 failed
goroutine 1 [running]:
github.com/apache/beam/sdks/v2/go/pkg/beam/log.Fatalf({0x1877728, 0xc00004c0c0}, {0x16f5882?, 0x2386290?}, {0xc0005ffe60?, 0x0?, 0x0?})
<https://ci-beam.apache.org/job/beam_LoadTests_Go_SideInput_Flink_Batch/ws/src/sdks/go/pkg/beam/log/log.go>:162 +0x8c
main.main()
<https://ci-beam.apache.org/job/beam_LoadTests_Go_SideInput_Flink_Batch/ws/src/sdks/go/test/load/sideinput/sideinput.go>:104 +0x439
> Task :sdks:go:test:load:run FAILED
FAILURE: Build failed with an exception.
* Where:
Build file '<https://ci-beam.apache.org/job/beam_LoadTests_Go_SideInput_Flink_Batch/ws/src/sdks/go/test/load/build.gradle'> line: 31
* What went wrong:
Execution failed for task ':sdks:go:test:load:run'.
> Process 'command 'sh'' finished with non-zero exit value 2
* Try:
> Run with --stacktrace option to get the stack trace.
> Run with --info or --debug option to get more log output.
* Get more help at https://help.gradle.org
BUILD FAILED in 1m 25s
12 actionable tasks: 6 executed, 4 from cache, 2 up-to-date
Publishing build scan...
https://ge.apache.org/s/7r4chwvdrefm2
Build step 'Invoke Gradle script' changed build result to FAILURE
Build step 'Invoke Gradle script' marked build as failure
---------------------------------------------------------------------
To unsubscribe, e-mail: builds-unsubscribe@beam.apache.org
For additional commands, e-mail: builds-help@beam.apache.org
Build failed in Jenkins: beam_LoadTests_Go_SideInput_Flink_Batch #888
Posted by Apache Jenkins Server <je...@builds.apache.org>.
See <https://ci-beam.apache.org/job/beam_LoadTests_Go_SideInput_Flink_Batch/888/display/redirect>
Changes:
------------------------------------------
[...truncated 41.98 KB...]
at scala.PartialFunction.applyOrElse(PartialFunction.scala:127)
at scala.PartialFunction.applyOrElse$(PartialFunction.scala:126)
at akka.japi.pf.UnitCaseStatement.applyOrElse(CaseStatements.scala:20)
at scala.PartialFunction$OrElse.applyOrElse(PartialFunction.scala:175)
at scala.PartialFunction$OrElse.applyOrElse(PartialFunction.scala:176)
at scala.PartialFunction$OrElse.applyOrElse(PartialFunction.scala:176)
at akka.actor.Actor.aroundReceive(Actor.scala:537)
at akka.actor.Actor.aroundReceive$(Actor.scala:535)
at akka.actor.AbstractActor.aroundReceive(AbstractActor.scala:220)
at akka.actor.ActorCell.receiveMessage(ActorCell.scala:580)
at akka.actor.ActorCell.invoke(ActorCell.scala:548)
at akka.dispatch.Mailbox.processMailbox(Mailbox.scala:270)
at akka.dispatch.Mailbox.run(Mailbox.scala:231)
at akka.dispatch.Mailbox.exec(Mailbox.scala:243)
at java.util.concurrent.ForkJoinTask.doExec(ForkJoinTask.java:290)
at java.util.concurrent.ForkJoinPool$WorkQueue.topLevelExec(ForkJoinPool.java:1020)
at java.util.concurrent.ForkJoinPool.scan(ForkJoinPool.java:1656)
at java.util.concurrent.ForkJoinPool.runWorker(ForkJoinPool.java:1594)
at java.util.concurrent.ForkJoinWorkerThread.run(ForkJoinWorkerThread.java:183)
Caused by: java.util.concurrent.ExecutionException: java.lang.RuntimeException: Error received from SDK harness for instruction 6: process bundle failed for instruction 6 using plan 1-2 : panic: datamgr.go [{6 fn/write/n3:0}]: error flushing buffer of length 3999992
caused by:
rpc error: code = Unknown desc =
Full error:
while executing Process for Plan[1-2]:
2: DataSink[S[fn/write/n3:0@localhost:33171]] Coder:W;fn/wire/n3:0<KV;c2<bytes;c0,bytes;c0>>!GWC
3: PCollection[n3] Out:[2]
4: SDF.ProcessSizedElementsAndRestrictions[synthetic.sourceFn] UID:4 Out:[2]
1: DataSource[S[fn/read/n2/SplitAndSize0:0@localhost:33171], local_output] Out:4 Coder:W;fn/wire/n2/SplitAndSize0:0<KV;c3/SplitAndSize0<KV;c3/PairWithRestriction0<R;c3[synthetic.SourceConfig],KV;c7<offsetrange.Restriction[offsetrange.Restriction;c4];c5,bool;c6>>,double;DoubleCoder0>>!GWC
caused by:
panic: datamgr.go [{6 fn/write/n3:0}]: error flushing buffer of length 3999992
caused by:
rpc error: code = Unknown desc = goroutine 25 [running]:
runtime/debug.Stack()
/home/jenkins/sdk/go1.20.4/src/runtime/debug/stack.go:24 +0x65
github.com/apache/beam/sdks/v2/go/pkg/beam/core/runtime/exec.callNoPanic.func1()
<https://ci-beam.apache.org/job/beam_LoadTests_Go_SideInput_Flink_Batch/ws/src/sdks/go/pkg/beam/core/runtime/exec/util.go>:58 +0xa5
panic({0x14580e0, 0xc00057a3c0})
/home/jenkins/sdk/go1.20.4/src/runtime/panic.go:884 +0x213
github.com/apache/beam/sdks/v2/go/pkg/beam/register.(*emit2[...]).invoke(0x1878fa0, {0xc000bb2700, 0xc0004f0590?, 0x1866778?}, {0xc000bbb400?, 0x384, 0x384})
<https://ci-beam.apache.org/job/beam_LoadTests_Go_SideInput_Flink_Batch/ws/src/sdks/go/pkg/beam/register/emitter.go>:81 +0x22f
github.com/apache/beam/sdks/v2/go/pkg/beam/io/synthetic.(*sourceFn).ProcessElement(0xc00004a670, 0xc0004f0798?, {0x61a80, 0x1, 0x64, 0x384, 0x0, 0x0}, 0xc00011bd40)
<https://ci-beam.apache.org/job/beam_LoadTests_Go_SideInput_Flink_Batch/ws/src/sdks/go/pkg/beam/io/synthetic/source.go>:151 +0x123
github.com/apache/beam/sdks/v2/go/pkg/beam/register.registerDoFn3x1StructWrappersAndFuncs[...].func2.1({0x61a80?, 0x1, 0x64, 0x384, 0x0, 0x0}, 0x0)
<https://ci-beam.apache.org/job/beam_LoadTests_Go_SideInput_Flink_Batch/ws/src/sdks/go/pkg/beam/register/register.go>:3382 +0xb0
github.com/apache/beam/sdks/v2/go/pkg/beam/register.(*caller3x1[...]).Call3x1(0x0?, {0x152c000?, 0xc00011bd10?}, {0x1584260?, 0xc00020e7e0?}, {0x12c56a0?, 0xc00011bd40?})
<https://ci-beam.apache.org/job/beam_LoadTests_Go_SideInput_Flink_Batch/ws/src/sdks/go/pkg/beam/register/register.go>:3371 +0xb6
github.com/apache/beam/sdks/v2/go/pkg/beam/core/runtime/exec.(*invoker).initCall.func13({0x0, 0x0, 0x0, 0x0, 0x0}, {0x23339d0, 0x1, 0x1}, 0x12?)
<https://ci-beam.apache.org/job/beam_LoadTests_Go_SideInput_Flink_Batch/ws/src/sdks/go/pkg/beam/core/runtime/exec/fn_arity.go>:109 +0xad
github.com/apache/beam/sdks/v2/go/pkg/beam/core/runtime/exec.(*invoker).invokeWithOpts(0xc0002f8500, {0x1877890?, 0xc000218f80}, {0x0, 0x0, 0x0, 0x0, 0x0}, {0x23339d0, 0x1, ...}, ...)
<https://ci-beam.apache.org/job/beam_LoadTests_Go_SideInput_Flink_Batch/ws/src/sdks/go/pkg/beam/core/runtime/exec/fn.go>:301 +0x1132
github.com/apache/beam/sdks/v2/go/pkg/beam/core/runtime/exec.(*ParDo).invokeProcessFn(0xc0002f83c0, {0x1877890, 0xc000218f80}, {0x0, 0x0, 0x0, 0x0, 0x0}, {0x23339d0, 0x1, ...}, ...)
<https://ci-beam.apache.org/job/beam_LoadTests_Go_SideInput_Flink_Batch/ws/src/sdks/go/pkg/beam/core/runtime/exec/pardo.go>:419 +0x2de
github.com/apache/beam/sdks/v2/go/pkg/beam/core/runtime/exec.(*ParDo).processSingleWindow(0xc0002f83c0, 0xc00060a120)
<https://ci-beam.apache.org/job/beam_LoadTests_Go_SideInput_Flink_Batch/ws/src/sdks/go/pkg/beam/core/runtime/exec/pardo.go>:190 +0x9b
github.com/apache/beam/sdks/v2/go/pkg/beam/core/runtime/exec.(*ProcessSizedElementsAndRestrictions).ProcessElement(0xc00035dd60, {0x1877890, 0xc0000b1740}, 0xc00003fa40, {0x0, 0x0, 0x0})
<https://ci-beam.apache.org/job/beam_LoadTests_Go_SideInput_Flink_Batch/ws/src/sdks/go/pkg/beam/core/runtime/exec/sdf.go>:556 +0x63d
github.com/apache/beam/sdks/v2/go/pkg/beam/core/runtime/exec.(*DataSource).Process.func1(0xc000211c20, {0xc0004f1340?, 0xc0004ba700?})
<https://ci-beam.apache.org/job/beam_LoadTests_Go_SideInput_Flink_Batch/ws/src/sdks/go/pkg/beam/core/runtime/exec/datasource.go>:241 +0x21e
github.com/apache/beam/sdks/v2/go/pkg/beam/core/runtime/exec.(*DataSource).process(0xc0004a18c0, {0x1877890, 0xc0000b1740}, 0xc0004f1630, 0xc0004f1610)
<https://ci-beam.apache.org/job/beam_LoadTests_Go_SideInput_Flink_Batch/ws/src/sdks/go/pkg/beam/core/runtime/exec/datasource.go>:147 +0x4f6
github.com/apache/beam/sdks/v2/go/pkg/beam/core/runtime/exec.(*DataSource).Process(0xc0004a18c0, {0x1877890, 0xc0000b1740})
<https://ci-beam.apache.org/job/beam_LoadTests_Go_SideInput_Flink_Batch/ws/src/sdks/go/pkg/beam/core/runtime/exec/datasource.go>:215 +0x226
github.com/apache/beam/sdks/v2/go/pkg/beam/core/runtime/exec.(*Plan).Execute.func2({0x1877890?, 0xc0000b1740?})
<https://ci-beam.apache.org/job/beam_LoadTests_Go_SideInput_Flink_Batch/ws/src/sdks/go/pkg/beam/core/runtime/exec/plan.go>:151 +0x42
github.com/apache/beam/sdks/v2/go/pkg/beam/core/runtime/exec.callNoPanic({0x1877890?, 0xc0000b1740?}, 0x415d50?)
<https://ci-beam.apache.org/job/beam_LoadTests_Go_SideInput_Flink_Batch/ws/src/sdks/go/pkg/beam/core/runtime/exec/util.go>:62 +0x6c
github.com/apache/beam/sdks/v2/go/pkg/beam/core/runtime/exec.(*Plan).Execute(0xc00037c630, {0x1877890, 0xc0000b1740}, {0x22dabb0, 0x1}, {{0x186a390?, 0xc000218f00?}, {0x189fb98?, 0xc000376ea0?}})
<https://ci-beam.apache.org/job/beam_LoadTests_Go_SideInput_Flink_Batch/ws/src/sdks/go/pkg/beam/core/runtime/exec/plan.go>:150 +0x3df
github.com/apache/beam/sdks/v2/go/pkg/beam/core/runtime/harness.(*control).handleInstruction(0xc000348000, {0x1877778?, 0xc0001e4cc0?}, 0xc0002b6730)
<https://ci-beam.apache.org/job/beam_LoadTests_Go_SideInput_Flink_Batch/ws/src/sdks/go/pkg/beam/core/runtime/harness/harness.go>:408 +0xa53
github.com/apache/beam/sdks/v2/go/pkg/beam/core/runtime/harness.MainWithOptions.func4({0x1877778?, 0xc0001e4cc0?}, 0xc00011da60?)
<https://ci-beam.apache.org/job/beam_LoadTests_Go_SideInput_Flink_Batch/ws/src/sdks/go/pkg/beam/core/runtime/harness/harness.go>:195 +0x7a
created by github.com/apache/beam/sdks/v2/go/pkg/beam/core/runtime/harness.MainWithOptions
<https://ci-beam.apache.org/job/beam_LoadTests_Go_SideInput_Flink_Batch/ws/src/sdks/go/pkg/beam/core/runtime/harness/harness.go>:213 +0xf1d
at java.util.concurrent.CompletableFuture.reportGet(CompletableFuture.java:395)
at java.util.concurrent.CompletableFuture.get(CompletableFuture.java:1999)
at org.apache.beam.sdk.util.MoreFutures.get(MoreFutures.java:61)
at org.apache.beam.runners.fnexecution.control.SdkHarnessClient$BundleProcessor$ActiveBundle.close(SdkHarnessClient.java:522)
at org.apache.beam.runners.fnexecution.control.DefaultJobBundleFactory$SimpleStageBundleFactory$1.close(DefaultJobBundleFactory.java:556)
at org.apache.beam.runners.flink.translation.functions.FlinkExecutableStageFunction.$closeResource(FlinkExecutableStageFunction.java:269)
at org.apache.beam.runners.flink.translation.functions.FlinkExecutableStageFunction.mapPartition(FlinkExecutableStageFunction.java:269)
at org.apache.flink.runtime.operators.MapPartitionDriver.run(MapPartitionDriver.java:113)
at org.apache.flink.runtime.operators.BatchTask.run(BatchTask.java:514)
at org.apache.flink.runtime.operators.BatchTask.invoke(BatchTask.java:357)
at org.apache.flink.runtime.taskmanager.Task.runWithSystemExitMonitoring(Task.java:948)
at org.apache.flink.runtime.taskmanager.Task.restoreAndInvoke(Task.java:927)
at org.apache.flink.runtime.taskmanager.Task.doRun(Task.java:741)
at org.apache.flink.runtime.taskmanager.Task.run(Task.java:563)
at java.lang.Thread.run(Thread.java:829)
Caused by: java.lang.RuntimeException: Error received from SDK harness for instruction 6: process bundle failed for instruction 6 using plan 1-2 : panic: datamgr.go [{6 fn/write/n3:0}]: error flushing buffer of length 3999992
caused by:
rpc error: code = Unknown desc =
Full error:
while executing Process for Plan[1-2]:
2: DataSink[S[fn/write/n3:0@localhost:33171]] Coder:W;fn/wire/n3:0<KV;c2<bytes;c0,bytes;c0>>!GWC
3: PCollection[n3] Out:[2]
4: SDF.ProcessSizedElementsAndRestrictions[synthetic.sourceFn] UID:4 Out:[2]
1: DataSource[S[fn/read/n2/SplitAndSize0:0@localhost:33171], local_output] Out:4 Coder:W;fn/wire/n2/SplitAndSize0:0<KV;c3/SplitAndSize0<KV;c3/PairWithRestriction0<R;c3[synthetic.SourceConfig],KV;c7<offsetrange.Restriction[offsetrange.Restriction;c4];c5,bool;c6>>,double;DoubleCoder0>>!GWC
caused by:
panic: datamgr.go [{6 fn/write/n3:0}]: error flushing buffer of length 3999992
caused by:
rpc error: code = Unknown desc = goroutine 25 [running]:
runtime/debug.Stack()
/home/jenkins/sdk/go1.20.4/src/runtime/debug/stack.go:24 +0x65
github.com/apache/beam/sdks/v2/go/pkg/beam/core/runtime/exec.callNoPanic.func1()
<https://ci-beam.apache.org/job/beam_LoadTests_Go_SideInput_Flink_Batch/ws/src/sdks/go/pkg/beam/core/runtime/exec/util.go>:58 +0xa5
panic({0x14580e0, 0xc00057a3c0})
/home/jenkins/sdk/go1.20.4/src/runtime/panic.go:884 +0x213
github.com/apache/beam/sdks/v2/go/pkg/beam/register.(*emit2[...]).invoke(0x1878fa0, {0xc000bb2700, 0xc0004f0590?, 0x1866778?}, {0xc000bbb400?, 0x384, 0x384})
<https://ci-beam.apache.org/job/beam_LoadTests_Go_SideInput_Flink_Batch/ws/src/sdks/go/pkg/beam/register/emitter.go>:81 +0x22f
github.com/apache/beam/sdks/v2/go/pkg/beam/io/synthetic.(*sourceFn).ProcessElement(0xc00004a670, 0xc0004f0798?, {0x61a80, 0x1, 0x64, 0x384, 0x0, 0x0}, 0xc00011bd40)
<https://ci-beam.apache.org/job/beam_LoadTests_Go_SideInput_Flink_Batch/ws/src/sdks/go/pkg/beam/io/synthetic/source.go>:151 +0x123
github.com/apache/beam/sdks/v2/go/pkg/beam/register.registerDoFn3x1StructWrappersAndFuncs[...].func2.1({0x61a80?, 0x1, 0x64, 0x384, 0x0, 0x0}, 0x0)
<https://ci-beam.apache.org/job/beam_LoadTests_Go_SideInput_Flink_Batch/ws/src/sdks/go/pkg/beam/register/register.go>:3382 +0xb0
github.com/apache/beam/sdks/v2/go/pkg/beam/register.(*caller3x1[...]).Call3x1(0x0?, {0x152c000?, 0xc00011bd10?}, {0x1584260?, 0xc00020e7e0?}, {0x12c56a0?, 0xc00011bd40?})
<https://ci-beam.apache.org/job/beam_LoadTests_Go_SideInput_Flink_Batch/ws/src/sdks/go/pkg/beam/register/register.go>:3371 +0xb6
github.com/apache/beam/sdks/v2/go/pkg/beam/core/runtime/exec.(*invoker).initCall.func13({0x0, 0x0, 0x0, 0x0, 0x0}, {0x23339d0, 0x1, 0x1}, 0x12?)
<https://ci-beam.apache.org/job/beam_LoadTests_Go_SideInput_Flink_Batch/ws/src/sdks/go/pkg/beam/core/runtime/exec/fn_arity.go>:109 +0xad
github.com/apache/beam/sdks/v2/go/pkg/beam/core/runtime/exec.(*invoker).invokeWithOpts(0xc0002f8500, {0x1877890?, 0xc000218f80}, {0x0, 0x0, 0x0, 0x0, 0x0}, {0x23339d0, 0x1, ...}, ...)
<https://ci-beam.apache.org/job/beam_LoadTests_Go_SideInput_Flink_Batch/ws/src/sdks/go/pkg/beam/core/runtime/exec/fn.go>:301 +0x1132
github.com/apache/beam/sdks/v2/go/pkg/beam/core/runtime/exec.(*ParDo).invokeProcessFn(0xc0002f83c0, {0x1877890, 0xc000218f80}, {0x0, 0x0, 0x0, 0x0, 0x0}, {0x23339d0, 0x1, ...}, ...)
<https://ci-beam.apache.org/job/beam_LoadTests_Go_SideInput_Flink_Batch/ws/src/sdks/go/pkg/beam/core/runtime/exec/pardo.go>:419 +0x2de
github.com/apache/beam/sdks/v2/go/pkg/beam/core/runtime/exec.(*ParDo).processSingleWindow(0xc0002f83c0, 0xc00060a120)
<https://ci-beam.apache.org/job/beam_LoadTests_Go_SideInput_Flink_Batch/ws/src/sdks/go/pkg/beam/core/runtime/exec/pardo.go>:190 +0x9b
github.com/apache/beam/sdks/v2/go/pkg/beam/core/runtime/exec.(*ProcessSizedElementsAndRestrictions).ProcessElement(0xc00035dd60, {0x1877890, 0xc0000b1740}, 0xc00003fa40, {0x0, 0x0, 0x0})
<https://ci-beam.apache.org/job/beam_LoadTests_Go_SideInput_Flink_Batch/ws/src/sdks/go/pkg/beam/core/runtime/exec/sdf.go>:556 +0x63d
github.com/apache/beam/sdks/v2/go/pkg/beam/core/runtime/exec.(*DataSource).Process.func1(0xc000211c20, {0xc0004f1340?, 0xc0004ba700?})
<https://ci-beam.apache.org/job/beam_LoadTests_Go_SideInput_Flink_Batch/ws/src/sdks/go/pkg/beam/core/runtime/exec/datasource.go>:241 +0x21e
github.com/apache/beam/sdks/v2/go/pkg/beam/core/runtime/exec.(*DataSource).process(0xc0004a18c0, {0x1877890, 0xc0000b1740}, 0xc0004f1630, 0xc0004f1610)
<https://ci-beam.apache.org/job/beam_LoadTests_Go_SideInput_Flink_Batch/ws/src/sdks/go/pkg/beam/core/runtime/exec/datasource.go>:147 +0x4f6
github.com/apache/beam/sdks/v2/go/pkg/beam/core/runtime/exec.(*DataSource).Process(0xc0004a18c0, {0x1877890, 0xc0000b1740})
<https://ci-beam.apache.org/job/beam_LoadTests_Go_SideInput_Flink_Batch/ws/src/sdks/go/pkg/beam/core/runtime/exec/datasource.go>:215 +0x226
github.com/apache/beam/sdks/v2/go/pkg/beam/core/runtime/exec.(*Plan).Execute.func2({0x1877890?, 0xc0000b1740?})
<https://ci-beam.apache.org/job/beam_LoadTests_Go_SideInput_Flink_Batch/ws/src/sdks/go/pkg/beam/core/runtime/exec/plan.go>:151 +0x42
github.com/apache/beam/sdks/v2/go/pkg/beam/core/runtime/exec.callNoPanic({0x1877890?, 0xc0000b1740?}, 0x415d50?)
<https://ci-beam.apache.org/job/beam_LoadTests_Go_SideInput_Flink_Batch/ws/src/sdks/go/pkg/beam/core/runtime/exec/util.go>:62 +0x6c
github.com/apache/beam/sdks/v2/go/pkg/beam/core/runtime/exec.(*Plan).Execute(0xc00037c630, {0x1877890, 0xc0000b1740}, {0x22dabb0, 0x1}, {{0x186a390?, 0xc000218f00?}, {0x189fb98?, 0xc000376ea0?}})
<https://ci-beam.apache.org/job/beam_LoadTests_Go_SideInput_Flink_Batch/ws/src/sdks/go/pkg/beam/core/runtime/exec/plan.go>:150 +0x3df
github.com/apache/beam/sdks/v2/go/pkg/beam/core/runtime/harness.(*control).handleInstruction(0xc000348000, {0x1877778?, 0xc0001e4cc0?}, 0xc0002b6730)
<https://ci-beam.apache.org/job/beam_LoadTests_Go_SideInput_Flink_Batch/ws/src/sdks/go/pkg/beam/core/runtime/harness/harness.go>:408 +0xa53
github.com/apache/beam/sdks/v2/go/pkg/beam/core/runtime/harness.MainWithOptions.func4({0x1877778?, 0xc0001e4cc0?}, 0xc00011da60?)
<https://ci-beam.apache.org/job/beam_LoadTests_Go_SideInput_Flink_Batch/ws/src/sdks/go/pkg/beam/core/runtime/harness/harness.go>:195 +0x7a
created by github.com/apache/beam/sdks/v2/go/pkg/beam/core/runtime/harness.MainWithOptions
<https://ci-beam.apache.org/job/beam_LoadTests_Go_SideInput_Flink_Batch/ws/src/sdks/go/pkg/beam/core/runtime/harness/harness.go>:213 +0xf1d
at org.apache.beam.runners.fnexecution.control.FnApiControlClient$ResponseStreamObserver.onNext(FnApiControlClient.java:180)
at org.apache.beam.runners.fnexecution.control.FnApiControlClient$ResponseStreamObserver.onNext(FnApiControlClient.java:160)
at org.apache.beam.vendor.grpc.v1p48p1.io.grpc.stub.ServerCalls$StreamingServerCallHandler$StreamingServerCallListener.onMessage(ServerCalls.java:262)
at org.apache.beam.vendor.grpc.v1p48p1.io.grpc.ForwardingServerCallListener.onMessage(ForwardingServerCallListener.java:33)
at org.apache.beam.vendor.grpc.v1p48p1.io.grpc.Contexts$ContextualizedServerCallListener.onMessage(Contexts.java:76)
at org.apache.beam.vendor.grpc.v1p48p1.io.grpc.internal.ServerCallImpl$ServerStreamListenerImpl.messagesAvailableInternal(ServerCallImpl.java:332)
at org.apache.beam.vendor.grpc.v1p48p1.io.grpc.internal.ServerCallImpl$ServerStreamListenerImpl.messagesAvailable(ServerCallImpl.java:315)
at org.apache.beam.vendor.grpc.v1p48p1.io.grpc.internal.ServerImpl$JumpToApplicationThreadServerStreamListener$1MessagesAvailable.runInContext(ServerImpl.java:834)
at org.apache.beam.vendor.grpc.v1p48p1.io.grpc.internal.ContextRunnable.run(ContextRunnable.java:37)
at org.apache.beam.vendor.grpc.v1p48p1.io.grpc.internal.SerializingExecutor.run(SerializingExecutor.java:133)
at java.util.concurrent.ThreadPoolExecutor.runWorker(ThreadPoolExecutor.java:1128)
at java.util.concurrent.ThreadPoolExecutor$Worker.run(ThreadPoolExecutor.java:628)
... 1 more
2023/05/30 14:00:52 (): java.lang.RuntimeException: Error received from SDK harness for instruction 6: process bundle failed for instruction 6 using plan 1-2 : panic: datamgr.go [{6 fn/write/n3:0}]: error flushing buffer of length 3999992
caused by:
rpc error: code = Unknown desc =
Full error:
while executing Process for Plan[1-2]:
2: DataSink[S[fn/write/n3:0@localhost:33171]] Coder:W;fn/wire/n3:0<KV;c2<bytes;c0,bytes;c0>>!GWC
3: PCollection[n3] Out:[2]
4: SDF.ProcessSizedElementsAndRestrictions[synthetic.sourceFn] UID:4 Out:[2]
1: DataSource[S[fn/read/n2/SplitAndSize0:0@localhost:33171], local_output] Out:4 Coder:W;fn/wire/n2/SplitAndSize0:0<KV;c3/SplitAndSize0<KV;c3/PairWithRestriction0<R;c3[synthetic.SourceConfig],KV;c7<offsetrange.Restriction[offsetrange.Restriction;c4];c5,bool;c6>>,double;DoubleCoder0>>!GWC
caused by:
panic: datamgr.go [{6 fn/write/n3:0}]: error flushing buffer of length 3999992
caused by:
rpc error: code = Unknown desc = goroutine 25 [running]:
runtime/debug.Stack()
/home/jenkins/sdk/go1.20.4/src/runtime/debug/stack.go:24 +0x65
github.com/apache/beam/sdks/v2/go/pkg/beam/core/runtime/exec.callNoPanic.func1()
<https://ci-beam.apache.org/job/beam_LoadTests_Go_SideInput_Flink_Batch/ws/src/sdks/go/pkg/beam/core/runtime/exec/util.go>:58 +0xa5
panic({0x14580e0, 0xc00057a3c0})
/home/jenkins/sdk/go1.20.4/src/runtime/panic.go:884 +0x213
github.com/apache/beam/sdks/v2/go/pkg/beam/register.(*emit2[...]).invoke(0x1878fa0, {0xc000bb2700, 0xc0004f0590?, 0x1866778?}, {0xc000bbb400?, 0x384, 0x384})
<https://ci-beam.apache.org/job/beam_LoadTests_Go_SideInput_Flink_Batch/ws/src/sdks/go/pkg/beam/register/emitter.go>:81 +0x22f
github.com/apache/beam/sdks/v2/go/pkg/beam/io/synthetic.(*sourceFn).ProcessElement(0xc00004a670, 0xc0004f0798?, {0x61a80, 0x1, 0x64, 0x384, 0x0, 0x0}, 0xc00011bd40)
<https://ci-beam.apache.org/job/beam_LoadTests_Go_SideInput_Flink_Batch/ws/src/sdks/go/pkg/beam/io/synthetic/source.go>:151 +0x123
github.com/apache/beam/sdks/v2/go/pkg/beam/register.registerDoFn3x1StructWrappersAndFuncs[...].func2.1({0x61a80?, 0x1, 0x64, 0x384, 0x0, 0x0}, 0x0)
<https://ci-beam.apache.org/job/beam_LoadTests_Go_SideInput_Flink_Batch/ws/src/sdks/go/pkg/beam/register/register.go>:3382 +0xb0
github.com/apache/beam/sdks/v2/go/pkg/beam/register.(*caller3x1[...]).Call3x1(0x0?, {0x152c000?, 0xc00011bd10?}, {0x1584260?, 0xc00020e7e0?}, {0x12c56a0?, 0xc00011bd40?})
<https://ci-beam.apache.org/job/beam_LoadTests_Go_SideInput_Flink_Batch/ws/src/sdks/go/pkg/beam/register/register.go>:3371 +0xb6
github.com/apache/beam/sdks/v2/go/pkg/beam/core/runtime/exec.(*invoker).initCall.func13({0x0, 0x0, 0x0, 0x0, 0x0}, {0x23339d0, 0x1, 0x1}, 0x12?)
<https://ci-beam.apache.org/job/beam_LoadTests_Go_SideInput_Flink_Batch/ws/src/sdks/go/pkg/beam/core/runtime/exec/fn_arity.go>:109 +0xad
github.com/apache/beam/sdks/v2/go/pkg/beam/core/runtime/exec.(*invoker).invokeWithOpts(0xc0002f8500, {0x1877890?, 0xc000218f80}, {0x0, 0x0, 0x0, 0x0, 0x0}, {0x23339d0, 0x1, ...}, ...)
<https://ci-beam.apache.org/job/beam_LoadTests_Go_SideInput_Flink_Batch/ws/src/sdks/go/pkg/beam/core/runtime/exec/fn.go>:301 +0x1132
github.com/apache/beam/sdks/v2/go/pkg/beam/core/runtime/exec.(*ParDo).invokeProcessFn(0xc0002f83c0, {0x1877890, 0xc000218f80}, {0x0, 0x0, 0x0, 0x0, 0x0}, {0x23339d0, 0x1, ...}, ...)
<https://ci-beam.apache.org/job/beam_LoadTests_Go_SideInput_Flink_Batch/ws/src/sdks/go/pkg/beam/core/runtime/exec/pardo.go>:419 +0x2de
github.com/apache/beam/sdks/v2/go/pkg/beam/core/runtime/exec.(*ParDo).processSingleWindow(0xc0002f83c0, 0xc00060a120)
<https://ci-beam.apache.org/job/beam_LoadTests_Go_SideInput_Flink_Batch/ws/src/sdks/go/pkg/beam/core/runtime/exec/pardo.go>:190 +0x9b
github.com/apache/beam/sdks/v2/go/pkg/beam/core/runtime/exec.(*ProcessSizedElementsAndRestrictions).ProcessElement(0xc00035dd60, {0x1877890, 0xc0000b1740}, 0xc00003fa40, {0x0, 0x0, 0x0})
<https://ci-beam.apache.org/job/beam_LoadTests_Go_SideInput_Flink_Batch/ws/src/sdks/go/pkg/beam/core/runtime/exec/sdf.go>:556 +0x63d
github.com/apache/beam/sdks/v2/go/pkg/beam/core/runtime/exec.(*DataSource).Process.func1(0xc000211c20, {0xc0004f1340?, 0xc0004ba700?})
<https://ci-beam.apache.org/job/beam_LoadTests_Go_SideInput_Flink_Batch/ws/src/sdks/go/pkg/beam/core/runtime/exec/datasource.go>:241 +0x21e
github.com/apache/beam/sdks/v2/go/pkg/beam/core/runtime/exec.(*DataSource).process(0xc0004a18c0, {0x1877890, 0xc0000b1740}, 0xc0004f1630, 0xc0004f1610)
<https://ci-beam.apache.org/job/beam_LoadTests_Go_SideInput_Flink_Batch/ws/src/sdks/go/pkg/beam/core/runtime/exec/datasource.go>:147 +0x4f6
github.com/apache/beam/sdks/v2/go/pkg/beam/core/runtime/exec.(*DataSource).Process(0xc0004a18c0, {0x1877890, 0xc0000b1740})
<https://ci-beam.apache.org/job/beam_LoadTests_Go_SideInput_Flink_Batch/ws/src/sdks/go/pkg/beam/core/runtime/exec/datasource.go>:215 +0x226
github.com/apache/beam/sdks/v2/go/pkg/beam/core/runtime/exec.(*Plan).Execute.func2({0x1877890?, 0xc0000b1740?})
<https://ci-beam.apache.org/job/beam_LoadTests_Go_SideInput_Flink_Batch/ws/src/sdks/go/pkg/beam/core/runtime/exec/plan.go>:151 +0x42
github.com/apache/beam/sdks/v2/go/pkg/beam/core/runtime/exec.callNoPanic({0x1877890?, 0xc0000b1740?}, 0x415d50?)
<https://ci-beam.apache.org/job/beam_LoadTests_Go_SideInput_Flink_Batch/ws/src/sdks/go/pkg/beam/core/runtime/exec/util.go>:62 +0x6c
github.com/apache/beam/sdks/v2/go/pkg/beam/core/runtime/exec.(*Plan).Execute(0xc00037c630, {0x1877890, 0xc0000b1740}, {0x22dabb0, 0x1}, {{0x186a390?, 0xc000218f00?}, {0x189fb98?, 0xc000376ea0?}})
<https://ci-beam.apache.org/job/beam_LoadTests_Go_SideInput_Flink_Batch/ws/src/sdks/go/pkg/beam/core/runtime/exec/plan.go>:150 +0x3df
github.com/apache/beam/sdks/v2/go/pkg/beam/core/runtime/harness.(*control).handleInstruction(0xc000348000, {0x1877778?, 0xc0001e4cc0?}, 0xc0002b6730)
<https://ci-beam.apache.org/job/beam_LoadTests_Go_SideInput_Flink_Batch/ws/src/sdks/go/pkg/beam/core/runtime/harness/harness.go>:408 +0xa53
github.com/apache/beam/sdks/v2/go/pkg/beam/core/runtime/harness.MainWithOptions.func4({0x1877778?, 0xc0001e4cc0?}, 0xc00011da60?)
<https://ci-beam.apache.org/job/beam_LoadTests_Go_SideInput_Flink_Batch/ws/src/sdks/go/pkg/beam/core/runtime/harness/harness.go>:195 +0x7a
created by github.com/apache/beam/sdks/v2/go/pkg/beam/core/runtime/harness.MainWithOptions
<https://ci-beam.apache.org/job/beam_LoadTests_Go_SideInput_Flink_Batch/ws/src/sdks/go/pkg/beam/core/runtime/harness/harness.go>:213 +0xf1d
2023/05/30 14:00:52 Job state: FAILED
2023/05/30 14:00:52 Failed to execute job: job load0tests0go0flink0batch0sideinput0300530125521-root-0530135959-f637ba70_e05a9f02-31ef-4f70-941e-d02339769406 failed
panic: Failed to execute job: job load0tests0go0flink0batch0sideinput0300530125521-root-0530135959-f637ba70_e05a9f02-31ef-4f70-941e-d02339769406 failed
goroutine 1 [running]:
github.com/apache/beam/sdks/v2/go/pkg/beam/log.Fatalf({0x1877708, 0xc00004c0c0}, {0x16f5862?, 0x2386290?}, {0xc0002dde60?, 0x0?, 0x0?})
<https://ci-beam.apache.org/job/beam_LoadTests_Go_SideInput_Flink_Batch/ws/src/sdks/go/pkg/beam/log/log.go>:162 +0x8c
main.main()
<https://ci-beam.apache.org/job/beam_LoadTests_Go_SideInput_Flink_Batch/ws/src/sdks/go/test/load/sideinput/sideinput.go>:104 +0x439
> Task :sdks:go:test:load:run FAILED
FAILURE: Build failed with an exception.
* Where:
Build file '<https://ci-beam.apache.org/job/beam_LoadTests_Go_SideInput_Flink_Batch/ws/src/sdks/go/test/load/build.gradle'> line: 31
* What went wrong:
Execution failed for task ':sdks:go:test:load:run'.
> Process 'command 'sh'' finished with non-zero exit value 2
* Try:
> Run with --stacktrace option to get the stack trace.
> Run with --info or --debug option to get more log output.
* Get more help at https://help.gradle.org
BUILD FAILED in 1m 24s
12 actionable tasks: 6 executed, 4 from cache, 2 up-to-date
Publishing build scan...
https://ge.apache.org/s/fhwthr7br6qr6
Build step 'Invoke Gradle script' changed build result to FAILURE
Build step 'Invoke Gradle script' marked build as failure
---------------------------------------------------------------------
To unsubscribe, e-mail: builds-unsubscribe@beam.apache.org
For additional commands, e-mail: builds-help@beam.apache.org
beam_LoadTests_Go_SideInput_Flink_Batch - Build # 887 - Aborted!
Posted by Apache Jenkins Server <je...@builds.apache.org>.
beam_LoadTests_Go_SideInput_Flink_Batch - Build # 887 - Aborted:
Check console output at https://ci-beam.apache.org/job/beam_LoadTests_Go_SideInput_Flink_Batch/887/ to view the results.
beam_LoadTests_Go_SideInput_Flink_Batch - Build # 886 - Aborted!
Posted by Apache Jenkins Server <je...@builds.apache.org>.
beam_LoadTests_Go_SideInput_Flink_Batch - Build # 886 - Aborted:
Check console output at https://ci-beam.apache.org/job/beam_LoadTests_Go_SideInput_Flink_Batch/886/ to view the results.
beam_LoadTests_Go_SideInput_Flink_Batch - Build # 885 - Aborted!
Posted by Apache Jenkins Server <je...@builds.apache.org>.
beam_LoadTests_Go_SideInput_Flink_Batch - Build # 885 - Aborted:
Check console output at https://ci-beam.apache.org/job/beam_LoadTests_Go_SideInput_Flink_Batch/885/ to view the results.