You are viewing a plain text version of this content. The canonical link for it is here.
Posted to commits@cayenne.apache.org by Apache Hudson Server <hu...@hudson.apache.org> on 2010/08/25 02:43:45 UTC

Build failed in Hudson: Cayenne-doc #133

See <https://hudson.apache.org/hudson/job/Cayenne-doc/133/changes>

Changes:

[aadamchik] CAY-1475 Move cayenne-modeler module out of framework/ and out of the assembly binary

[aadamchik] CAY-1475 Move cayenne-modeler module out of framework/ and out of the assembly binary

* post move - fixing the poms

[aadamchik] CAY-1475 Move cayenne-modeler module out of framework/ and out of the assembly binary

[aadamchik] undoing previous move.. the wrong plugin got moved

[aadamchik] CAY-1475 Move cayenne-modeler module out of framework/ and out of the assembly binary

[aadamchik] CAY-1475 Move cayenne-modeler module out of framework/ and out of the assembly binary

[aadamchik] CAY-1475 Move cayenne-modeler module out of framework/ and out of the assembly binary

[aadamchik] fixing build time property

[aadamchik] CAY-1474 Straightening CayenneModeler platform-specific builds

* generic/win launcher
* refactoring OSX packages
* adding missing license headers
* fixing Embeddable validation
* refactoring WidgetFactory to take out os-specific code

[aadamchik] CAY-1474 Straightening CayenneModeler platform-specific builds

* removing unused modeler.sh
* removing modeler.log creation code. Modeler hasn't been logging to this file since 3.0
* removing Java version check... The code is compiled with Java 1.5 setttings, so that code is a complete noop

* starting Modeler via Injector
* Switching ActionManager to DI, implementing type-safe action lookup
* DI based Launcher and PlatformInitializer services
* Mac-based assembly does the right thing

[aadamchik] generics cleanup, no other changes

------------------------------------------
[...truncated 980 lines...]
[INFO] Creating new database at '/zonestorage/hudson_solaris/home/hudson/hudson-slave/workspace/Cayenne-doc/trunk/build-tools/maven-cayenne-build-plugin/target/clover/clover.db'.
[INFO] Processing files at 1.6 source level.
[INFO] Clover all over. Instrumented 6 files (3 packages).
[INFO] Elapsed time = 0.071 secs. (84.507 files/sec, 11,112.676 srclines/sec)
[INFO] No Clover instrumentation done on source files in: [/zonestorage/hudson_solaris/home/hudson/hudson-slave/workspace/Cayenne-doc/trunk/build-tools/maven-cayenne-build-plugin/src/test/java] as no matching sources files found
[INFO] [plugin:descriptor {execution: default-descriptor}]
[INFO] Using 2 extractors.
[INFO] Applying extractor for language: java
[INFO] Extractor for language: java found 3 mojo descriptors.
[INFO] Applying extractor for language: bsh
[INFO] Extractor for language: bsh found 0 mojo descriptors.
[INFO] [resources:resources {execution: default-resources}]
[INFO] Using 'UTF-8' encoding to copy filtered resources.
[INFO] skip non existing resourceDirectory /zonestorage/hudson_solaris/home/hudson/hudson-slave/workspace/Cayenne-doc/trunk/build-tools/maven-cayenne-build-plugin/src/main/resources
[INFO] [compiler:compile {execution: default-compile}]
[INFO] Compiling 6 source files to /zonestorage/hudson_solaris/home/hudson/hudson-slave/workspace/Cayenne-doc/trunk/build-tools/maven-cayenne-build-plugin/target/classes
[INFO] [resources:testResources {execution: default-testResources}]
[INFO] Using 'UTF-8' encoding to copy filtered resources.
[INFO] skip non existing resourceDirectory /zonestorage/hudson_solaris/home/hudson/hudson-slave/workspace/Cayenne-doc/trunk/build-tools/maven-cayenne-build-plugin/src/test/resources
[INFO] [compiler:testCompile {execution: default-testCompile}]
[INFO] No sources to compile
[INFO] [surefire:test {execution: default-test}]
[INFO] No tests to run.
[INFO] ------------------------------------------------------------------------
[INFO] Building Cayenne Internal Documentation Build Plugin
[INFO]    task-segment: [clean, install, javadoc:javadoc, checkstyle:checkstyle, findbugs:findbugs, clover2:setup, test]
[INFO] ------------------------------------------------------------------------
[INFO] [clean:clean {execution: default-clean}]
[INFO] Deleting directory /zonestorage/hudson_solaris/home/hudson/hudson-slave/workspace/Cayenne-doc/trunk/build-tools/maven-cayenne-doc-plugin/target
Downloading: http://objectstyle.org/maven2/com/atlassian/confluence/confluence-soap/2.0/confluence-soap-2.0.pom
[INFO] Unable to find resource 'com.atlassian.confluence:confluence-soap:pom:2.0' in repository objectstyle (http://objectstyle.org/maven2)
Downloading: http://repo1.maven.org/maven2/com/atlassian/confluence/confluence-soap/2.0/confluence-soap-2.0.pom
[INFO] Unable to find resource 'com.atlassian.confluence:confluence-soap:pom:2.0' in repository central (http://repo1.maven.org/maven2)
[INFO] [plugin:descriptor {execution: default-descriptor}]
[INFO] Using 2 extractors.
[INFO] Applying extractor for language: java
[INFO] Extractor for language: java found 1 mojo descriptors.
[INFO] Applying extractor for language: bsh
[INFO] Extractor for language: bsh found 0 mojo descriptors.
[INFO] [resources:resources {execution: default-resources}]
[INFO] Using 'UTF-8' encoding to copy filtered resources.
[INFO] Copying 1 resource
[INFO] [compiler:compile {execution: default-compile}]
[INFO] Compiling 6 source files to /zonestorage/hudson_solaris/home/hudson/hudson-slave/workspace/Cayenne-doc/trunk/build-tools/maven-cayenne-doc-plugin/target/classes
[INFO] [resources:testResources {execution: default-testResources}]
[INFO] Using 'UTF-8' encoding to copy filtered resources.
[INFO] skip non existing resourceDirectory /zonestorage/hudson_solaris/home/hudson/hudson-slave/workspace/Cayenne-doc/trunk/build-tools/maven-cayenne-doc-plugin/src/test/resources
[INFO] [compiler:testCompile {execution: default-testCompile}]
[INFO] Compiling 1 source file to /zonestorage/hudson_solaris/home/hudson/hudson-slave/workspace/Cayenne-doc/trunk/build-tools/maven-cayenne-doc-plugin/target/test-classes
[INFO] [surefire:test {execution: default-test}]
[INFO] Surefire report directory: /zonestorage/hudson_solaris/home/hudson/hudson-slave/workspace/Cayenne-doc/trunk/build-tools/maven-cayenne-doc-plugin/target/surefire-reports

-------------------------------------------------------
 T E S T S
-------------------------------------------------------
Running org.apache.cayenne.maven.plugin.confluence.DocPageTest
Tests run: 5, Failures: 0, Errors: 0, Skipped: 0, Time elapsed: 0.037 sec

Results :

Tests run: 5, Failures: 0, Errors: 0, Skipped: 0

[INFO] [jar:jar {execution: default-jar}]
[INFO] Building jar: /zonestorage/hudson_solaris/home/hudson/hudson-slave/workspace/Cayenne-doc/trunk/build-tools/maven-cayenne-doc-plugin/target/maven-cayenne-doc-plugin-3.1-SNAPSHOT.jar
[INFO] [plugin:addPluginArtifactMetadata {execution: default-addPluginArtifactMetadata}]
[INFO] [install:install {execution: default-install}]
[INFO] Installing /zonestorage/hudson_solaris/home/hudson/hudson-slave/workspace/Cayenne-doc/trunk/build-tools/maven-cayenne-doc-plugin/target/maven-cayenne-doc-plugin-3.1-SNAPSHOT.jar to /export/home/hudson/.m2/repository/org/apache/cayenne/build-tools/maven-cayenne-doc-plugin/3.1-SNAPSHOT/maven-cayenne-doc-plugin-3.1-SNAPSHOT.jar
[INFO] Preparing javadoc:javadoc
[INFO] No goals needed for project - skipping
[INFO] [javadoc:javadoc {execution: default-cli}]
[WARNING] Source files encoding has not been set, using platform encoding ISO646-US, i.e. build is platform dependent!
[INFO] 
Loading source files for package org.apache.cayenne.maven.plugin.confluence...
Constructing Javadoc information...
Standard Doclet version 1.6.0_06
Building tree for all the packages and classes...
Generating /zonestorage/hudson_solaris/home/hudson/hudson-slave/workspace/Cayenne-doc/trunk/build-tools/maven-cayenne-doc-plugin/target/site/apidocs/org/apache/cayenne/maven/plugin/confluence//ConfluenceExportMojo.html...
Generating /zonestorage/hudson_solaris/home/hudson/hudson-slave/workspace/Cayenne-doc/trunk/build-tools/maven-cayenne-doc-plugin/target/site/apidocs/org/apache/cayenne/maven/plugin/confluence//DocGenerator.html...
Generating /zonestorage/hudson_solaris/home/hudson/hudson-slave/workspace/Cayenne-doc/trunk/build-tools/maven-cayenne-doc-plugin/target/site/apidocs/org/apache/cayenne/maven/plugin/confluence//DocPage.html...
Generating /zonestorage/hudson_solaris/home/hudson/hudson-slave/workspace/Cayenne-doc/trunk/build-tools/maven-cayenne-doc-plugin/target/site/apidocs/org/apache/cayenne/maven/plugin/confluence//DocPageRenderer.html...
Generating /zonestorage/hudson_solaris/home/hudson/hudson-slave/workspace/Cayenne-doc/trunk/build-tools/maven-cayenne-doc-plugin/target/site/apidocs/org/apache/cayenne/maven/plugin/confluence//package-frame.html...
Generating /zonestorage/hudson_solaris/home/hudson/hudson-slave/workspace/Cayenne-doc/trunk/build-tools/maven-cayenne-doc-plugin/target/site/apidocs/org/apache/cayenne/maven/plugin/confluence//package-summary.html...
Generating /zonestorage/hudson_solaris/home/hudson/hudson-slave/workspace/Cayenne-doc/trunk/build-tools/maven-cayenne-doc-plugin/target/site/apidocs/org/apache/cayenne/maven/plugin/confluence//package-tree.html...
Generating /zonestorage/hudson_solaris/home/hudson/hudson-slave/workspace/Cayenne-doc/trunk/build-tools/maven-cayenne-doc-plugin/target/site/apidocs/constant-values.html...
Generating /zonestorage/hudson_solaris/home/hudson/hudson-slave/workspace/Cayenne-doc/trunk/build-tools/maven-cayenne-doc-plugin/target/site/apidocs/org/apache/cayenne/maven/plugin/confluence//class-use/DocGenerator.html...
Generating /zonestorage/hudson_solaris/home/hudson/hudson-slave/workspace/Cayenne-doc/trunk/build-tools/maven-cayenne-doc-plugin/target/site/apidocs/org/apache/cayenne/maven/plugin/confluence//class-use/ConfluenceExportMojo.html...
Generating /zonestorage/hudson_solaris/home/hudson/hudson-slave/workspace/Cayenne-doc/trunk/build-tools/maven-cayenne-doc-plugin/target/site/apidocs/org/apache/cayenne/maven/plugin/confluence//class-use/DocPageRenderer.html...
Generating /zonestorage/hudson_solaris/home/hudson/hudson-slave/workspace/Cayenne-doc/trunk/build-tools/maven-cayenne-doc-plugin/target/site/apidocs/org/apache/cayenne/maven/plugin/confluence//class-use/DocPage.html...
Generating /zonestorage/hudson_solaris/home/hudson/hudson-slave/workspace/Cayenne-doc/trunk/build-tools/maven-cayenne-doc-plugin/target/site/apidocs/org/apache/cayenne/maven/plugin/confluence//package-use.html...
Building index for all the packages and classes...
Generating /zonestorage/hudson_solaris/home/hudson/hudson-slave/workspace/Cayenne-doc/trunk/build-tools/maven-cayenne-doc-plugin/target/site/apidocs/overview-tree.html...
Generating /zonestorage/hudson_solaris/home/hudson/hudson-slave/workspace/Cayenne-doc/trunk/build-tools/maven-cayenne-doc-plugin/target/site/apidocs/index-all.html...
Generating /zonestorage/hudson_solaris/home/hudson/hudson-slave/workspace/Cayenne-doc/trunk/build-tools/maven-cayenne-doc-plugin/target/site/apidocs/deprecated-list.html...
Building index for all classes...
Generating /zonestorage/hudson_solaris/home/hudson/hudson-slave/workspace/Cayenne-doc/trunk/build-tools/maven-cayenne-doc-plugin/target/site/apidocs/allclasses-frame.html...
Generating /zonestorage/hudson_solaris/home/hudson/hudson-slave/workspace/Cayenne-doc/trunk/build-tools/maven-cayenne-doc-plugin/target/site/apidocs/allclasses-noframe.html...
Generating /zonestorage/hudson_solaris/home/hudson/hudson-slave/workspace/Cayenne-doc/trunk/build-tools/maven-cayenne-doc-plugin/target/site/apidocs/index.html...
Generating /zonestorage/hudson_solaris/home/hudson/hudson-slave/workspace/Cayenne-doc/trunk/build-tools/maven-cayenne-doc-plugin/target/site/apidocs/help-doc.html...
Generating /zonestorage/hudson_solaris/home/hudson/hudson-slave/workspace/Cayenne-doc/trunk/build-tools/maven-cayenne-doc-plugin/target/site/apidocs/stylesheet.css...
1 warning
[WARNING] Javadoc Warnings
[WARNING] /zonestorage/hudson_solaris/home/hudson/hudson-slave/workspace/Cayenne-doc/trunk/build-tools/maven-cayenne-doc-plugin/src/main/java/org/apache/cayenne/maven/plugin/confluence/ConfluenceExportMojo.java:34: warning - @goal is an unknown tag.
[INFO] [checkstyle:checkstyle {execution: default-cli}]
[WARNING] File encoding has not been set, using platform encoding ISO646-US, i.e. build is platform dependent!
[INFO] 
[INFO] There are 480 checkstyle errors.
[WARNING] Unable to locate Source XRef to link to - DISABLED
[INFO] Preparing findbugs:findbugs
[INFO] [plugin:descriptor {execution: default-descriptor}]
[INFO] Using 2 extractors.
[INFO] Applying extractor for language: java
[INFO] Extractor for language: java found 1 mojo descriptors.
[INFO] Applying extractor for language: bsh
[INFO] Extractor for language: bsh found 0 mojo descriptors.
[INFO] [resources:resources {execution: default-resources}]
[INFO] Using 'UTF-8' encoding to copy filtered resources.
[INFO] Copying 1 resource
[INFO] [compiler:compile {execution: default-compile}]
[INFO] Nothing to compile - all classes are up to date
[INFO] [findbugs:findbugs {execution: default-cli}]
[INFO] Locale is en
     [java] The following classes needed for analysis were missing:
     [java]   org.apache.commons.collections.ExtendedProperties
     [java] Warnings generated: 5
     [java] Missing classes: 1
[INFO] [clover2:setup {execution: default-cli}]
[INFO] Clover Version 2.6.3, built on November 20 2009 (build-778)
[INFO] Loaded from: /export/home/hudson/.m2/repository/com/cenqua/clover/clover/2.6.3/clover-2.6.3.jar
[INFO] Clover: Open Source License registered to Apache.
[INFO] Creating new database at '/zonestorage/hudson_solaris/home/hudson/hudson-slave/workspace/Cayenne-doc/trunk/build-tools/maven-cayenne-doc-plugin/target/clover/clover.db'.
[INFO] Processing files at 1.6 source level.
[INFO] Clover all over. Instrumented 6 files (1 package).
[INFO] Elapsed time = 0.076 secs. (78.947 files/sec, 12,092.105 srclines/sec)
[INFO] Clover Version 2.6.3, built on November 20 2009 (build-778)
[INFO] Loaded from: /export/home/hudson/.m2/repository/com/cenqua/clover/clover/2.6.3/clover-2.6.3.jar
[INFO] Clover: Open Source License registered to Apache.
[INFO] Updating existing database at '/zonestorage/hudson_solaris/home/hudson/hudson-slave/workspace/Cayenne-doc/trunk/build-tools/maven-cayenne-doc-plugin/target/clover/clover.db'.
[INFO] Processing files at 1.6 source level.
[INFO] Clover all over. Instrumented 1 file (1 package).
[INFO] 5 test methods detected.
[INFO] Elapsed time = 0.017 secs. (58.824 files/sec, 8,705.882 srclines/sec)
[INFO] [plugin:descriptor {execution: default-descriptor}]
[INFO] Using 2 extractors.
[INFO] Applying extractor for language: java
[INFO] Extractor for language: java found 1 mojo descriptors.
[INFO] Applying extractor for language: bsh
[INFO] Extractor for language: bsh found 0 mojo descriptors.
[INFO] [resources:resources {execution: default-resources}]
[INFO] Using 'UTF-8' encoding to copy filtered resources.
[INFO] Copying 1 resource
[INFO] [compiler:compile {execution: default-compile}]
[INFO] Compiling 6 source files to /zonestorage/hudson_solaris/home/hudson/hudson-slave/workspace/Cayenne-doc/trunk/build-tools/maven-cayenne-doc-plugin/target/classes
[INFO] [resources:testResources {execution: default-testResources}]
[INFO] Using 'UTF-8' encoding to copy filtered resources.
[INFO] skip non existing resourceDirectory /zonestorage/hudson_solaris/home/hudson/hudson-slave/workspace/Cayenne-doc/trunk/build-tools/maven-cayenne-doc-plugin/src/test/resources
[INFO] [compiler:testCompile {execution: default-testCompile}]
[INFO] Compiling 1 source file to /zonestorage/hudson_solaris/home/hudson/hudson-slave/workspace/Cayenne-doc/trunk/build-tools/maven-cayenne-doc-plugin/target/test-classes
[INFO] [surefire:test {execution: default-test}]
[INFO] Surefire report directory: /zonestorage/hudson_solaris/home/hudson/hudson-slave/workspace/Cayenne-doc/trunk/build-tools/maven-cayenne-doc-plugin/target/surefire-reports

-------------------------------------------------------
 T E S T S
-------------------------------------------------------
Running org.apache.cayenne.maven.plugin.confluence.DocPageTest
Tests run: 5, Failures: 0, Errors: 0, Skipped: 0, Time elapsed: 0.132 sec

Results :

Tests run: 5, Failures: 0, Errors: 0, Skipped: 0

[INFO] ------------------------------------------------------------------------
[INFO] Building Cayenne Build Tools Parent
[INFO]    task-segment: [clean, install, javadoc:javadoc, checkstyle:checkstyle, findbugs:findbugs, clover2:setup, test]
[INFO] ------------------------------------------------------------------------
[INFO] [clean:clean {execution: default-clean}]
[INFO] Deleting directory /zonestorage/hudson_solaris/home/hudson/hudson-slave/workspace/Cayenne-doc/trunk/build-tools/target
[INFO] [site:attach-descriptor {execution: default-attach-descriptor}]
[INFO] [install:install {execution: default-install}]
[INFO] Installing /zonestorage/hudson_solaris/home/hudson/hudson-slave/workspace/Cayenne-doc/trunk/build-tools/pom.xml to /export/home/hudson/.m2/repository/org/apache/cayenne/parents/cayenne-build-tools/3.1-SNAPSHOT/cayenne-build-tools-3.1-SNAPSHOT.pom
[INFO] Preparing javadoc:javadoc
[INFO] No goals needed for project - skipping
[INFO] [javadoc:javadoc {execution: default-cli}]
[INFO] [checkstyle:checkstyle {execution: default-cli}]
[INFO] Source directory does not exist - skipping report.
[INFO] Preparing findbugs:findbugs
[INFO] No goals needed for project - skipping
[INFO] [findbugs:findbugs {execution: default-cli}]
[INFO] [clover2:setup {execution: default-cli}]
[WARNING] The reported language of this project is none, attempting to instrument sources anyway.
[INFO] No Clover instrumentation done on source files in: [/zonestorage/hudson_solaris/home/hudson/hudson-slave/workspace/Cayenne-doc/trunk/build-tools/src/main/java] as no matching sources files found
[INFO] No Clover instrumentation done on source files in: [/zonestorage/hudson_solaris/home/hudson/hudson-slave/workspace/Cayenne-doc/trunk/build-tools/src/test/java] as no matching sources files found
[INFO] No goals needed for project - skipping
[INFO] ------------------------------------------------------------------------
[INFO] Building Cayenne License and Notice Bundle
[INFO]    task-segment: [clean, install, javadoc:javadoc, checkstyle:checkstyle, findbugs:findbugs, clover2:setup, test]
[INFO] ------------------------------------------------------------------------
[INFO] artifact org.apache.cayenne.build-tools:maven-cayenne-build-plugin: checking for updates from Maven Central Repo
[INFO] [clean:clean {execution: default-clean}]
[INFO] [cayenne-build:date {execution: date}]
[CLOVER] FATAL ERROR: Clover could not be initialised. Are you sure you have Clover in the runtime classpath? (class java.lang.NoClassDefFoundError:com_cenqua_clover/CloverVersionInfo)
[FATAL ERROR] org.apache.cayenne.maven.plugin.date.DateMojo#execute() caused a linkage error (java.lang.NoClassDefFoundError) and may be out-of-date. Check the realms:
[FATAL ERROR] Plugin realm = app0.child-container[org.apache.cayenne.build-tools:maven-cayenne-build-plugin:3.1-SNAPSHOT]
urls[0] = file:/zonestorage/hudson_solaris/home/hudson/hudson-slave/workspace/Cayenne-doc/trunk/build-tools/maven-cayenne-build-plugin/target/classes/
urls[1] = file:/export/home/hudson/.m2/repository/org/apache/maven/maven-archiver/2.2/maven-archiver-2.2.jar
urls[2] = file:/export/home/hudson/.m2/repository/org/codehaus/plexus/plexus-utils/1.1/plexus-utils-1.1.jar
urls[3] = file:/export/home/hudson/.m2/repository/org/codehaus/plexus/plexus-archiver/1.0-alpha-7/plexus-archiver-1.0-alpha-7.jar
urls[4] = file:/export/home/hudson/.m2/repository/velocity/velocity/1.4/velocity-1.4.jar
urls[5] = file:/export/home/hudson/.m2/repository/velocity/velocity-dep/1.4/velocity-dep-1.4.jar
urls[6] = file:/export/home/hudson/.m2/repository/org/scopemvc/scopemvc/1.0.1/scopemvc-1.0.1.jar
urls[7] = file:/export/home/hudson/.m2/repository/foundrylogic/vpp/vpp/2.2.1/vpp-2.2.1.jar
urls[8] = file:/export/home/hudson/.m2/repository/jgoodies/forms/1.0.5/forms-1.0.5.jar
urls[9] = file:/export/home/hudson/.m2/repository/jgoodies/looks/1.3.1/looks-1.3.1.jar
[FATAL ERROR] Container realm = plexus.core
urls[0] = file:/home/hudson/tools/maven/apache-maven-2.2.1/lib/maven-2.2.1-uber.jar
[INFO] ------------------------------------------------------------------------
[ERROR] FATAL ERROR
[INFO] ------------------------------------------------------------------------
[INFO] com_cenqua_clover/CoverageRecorder
[INFO] ------------------------------------------------------------------------
[INFO] Trace
java.lang.NoClassDefFoundError: com_cenqua_clover/CoverageRecorder
	at org.apache.cayenne.maven.plugin.date.DateMojo.execute(DateMojo.java:72)
	at org.apache.maven.plugin.DefaultPluginManager.executeMojo(DefaultPluginManager.java:490)
	at org.apache.maven.lifecycle.DefaultLifecycleExecutor.executeGoals(DefaultLifecycleExecutor.java:694)
	at org.apache.maven.lifecycle.DefaultLifecycleExecutor.executeGoalWithLifecycle(DefaultLifecycleExecutor.java:556)
	at org.apache.maven.lifecycle.DefaultLifecycleExecutor.executeGoal(DefaultLifecycleExecutor.java:535)
	at org.apache.maven.lifecycle.DefaultLifecycleExecutor.executeGoalAndHandleFailures(DefaultLifecycleExecutor.java:387)
	at org.apache.maven.lifecycle.DefaultLifecycleExecutor.executeTaskSegments(DefaultLifecycleExecutor.java:348)
	at org.apache.maven.lifecycle.DefaultLifecycleExecutor.execute(DefaultLifecycleExecutor.java:180)
	at org.apache.maven.DefaultMaven.doExecute(DefaultMaven.java:328)
	at org.apache.maven.DefaultMaven.execute(DefaultMaven.java:138)
	at org.apache.maven.cli.MavenCli.main(MavenCli.java:362)
	at org.apache.maven.cli.compat.CompatibleMain.main(CompatibleMain.java:60)
	at sun.reflect.NativeMethodAccessorImpl.invoke0(Native Method)
	at sun.reflect.NativeMethodAccessorImpl.invoke(NativeMethodAccessorImpl.java:39)
	at sun.reflect.DelegatingMethodAccessorImpl.invoke(DelegatingMethodAccessorImpl.java:25)
	at java.lang.reflect.Method.invoke(Method.java:597)
	at org.codehaus.classworlds.Launcher.launchEnhanced(Launcher.java:315)
	at org.codehaus.classworlds.Launcher.launch(Launcher.java:255)
	at org.codehaus.classworlds.Launcher.mainWithExitCode(Launcher.java:430)
	at org.codehaus.classworlds.Launcher.main(Launcher.java:375)
[INFO] ------------------------------------------------------------------------
[INFO] Total time: 1 minute 11 seconds
[INFO] Finished at: Wed Aug 25 00:43:41 GMT+00:00 2010
[INFO] Final Memory: 84M/215M
[INFO] ------------------------------------------------------------------------
Publishing Javadoc
Publishing Clover coverage report...
No Clover report will be published due to a Build Failure


Build failed in Hudson: Cayenne-doc #135

Posted by Apache Hudson Server <hu...@hudson.apache.org>.
See <https://hudson.apache.org/hudson/job/Cayenne-doc/135/changes>

Changes:

[aadamchik] renaming cayenne-di-stack to cayenne-runtime-itest

the new name is not ideal (mainly because integration test scope is not well defined yet),
but the old one was too close to cayenne-di, that caused confusion a few times

------------------------------------------
[...truncated 4599 lines...]
[INFO] Loaded from: /home/hudson/.m2/repository/com/cenqua/clover/clover/2.6.3/clover-2.6.3.jar
[INFO] Clover: Open Source License registered to Apache.
[INFO] Creating new database at '<https://hudson.apache.org/hudson/job/Cayenne-doc/ws/trunk/build-tools/maven-cayenne-build-plugin/target/clover/clover.db'.>
[INFO] Processing files at 1.6 source level.
[INFO] Clover all over. Instrumented 6 files (3 packages).
[INFO] Elapsed time = 0.04 secs. (150 files/sec, 19,725 srclines/sec)
[INFO] No Clover instrumentation done on source files in: [<https://hudson.apache.org/hudson/job/Cayenne-doc/ws/trunk/build-tools/maven-cayenne-build-plugin/src/test/java]> as no matching sources files found
[INFO] [plugin:descriptor {execution: default-descriptor}]
[INFO] Using 2 extractors.
[INFO] Applying extractor for language: java
[INFO] Extractor for language: java found 3 mojo descriptors.
[INFO] Applying extractor for language: bsh
[INFO] Extractor for language: bsh found 0 mojo descriptors.
[INFO] [resources:resources {execution: default-resources}]
[INFO] Using 'UTF-8' encoding to copy filtered resources.
[INFO] skip non existing resourceDirectory <https://hudson.apache.org/hudson/job/Cayenne-doc/ws/trunk/build-tools/maven-cayenne-build-plugin/src/main/resources>
[INFO] [compiler:compile {execution: default-compile}]
[INFO] Compiling 6 source files to <https://hudson.apache.org/hudson/job/Cayenne-doc/ws/trunk/build-tools/maven-cayenne-build-plugin/target/classes>
[INFO] [resources:testResources {execution: default-testResources}]
[INFO] Using 'UTF-8' encoding to copy filtered resources.
[INFO] skip non existing resourceDirectory <https://hudson.apache.org/hudson/job/Cayenne-doc/ws/trunk/build-tools/maven-cayenne-build-plugin/src/test/resources>
[INFO] [compiler:testCompile {execution: default-testCompile}]
[INFO] No sources to compile
[INFO] [surefire:test {execution: default-test}]
[INFO] No tests to run.
[INFO] ------------------------------------------------------------------------
[INFO] Building Cayenne Internal Documentation Build Plugin
[INFO]    task-segment: [clean, install, javadoc:javadoc, checkstyle:checkstyle, findbugs:findbugs, clover2:setup, test]
[INFO] ------------------------------------------------------------------------
[INFO] [clean:clean {execution: default-clean}]
Downloading: http://objectstyle.org/maven2/com/atlassian/confluence/confluence-soap/2.0/confluence-soap-2.0.pom
[INFO] Unable to find resource 'com.atlassian.confluence:confluence-soap:pom:2.0' in repository objectstyle (http://objectstyle.org/maven2)
Downloading: http://repo1.maven.org/maven2/com/atlassian/confluence/confluence-soap/2.0/confluence-soap-2.0.pom
[INFO] Unable to find resource 'com.atlassian.confluence:confluence-soap:pom:2.0' in repository central (http://repo1.maven.org/maven2)
[INFO] [plugin:descriptor {execution: default-descriptor}]
[INFO] Using 2 extractors.
[INFO] Applying extractor for language: java
[INFO] Extractor for language: java found 1 mojo descriptors.
[INFO] Applying extractor for language: bsh
[INFO] Extractor for language: bsh found 0 mojo descriptors.
[INFO] [resources:resources {execution: default-resources}]
[INFO] Using 'UTF-8' encoding to copy filtered resources.
[INFO] Copying 1 resource
[INFO] [compiler:compile {execution: default-compile}]
[INFO] Compiling 6 source files to <https://hudson.apache.org/hudson/job/Cayenne-doc/ws/trunk/build-tools/maven-cayenne-doc-plugin/target/classes>
[INFO] [resources:testResources {execution: default-testResources}]
[INFO] Using 'UTF-8' encoding to copy filtered resources.
[INFO] skip non existing resourceDirectory <https://hudson.apache.org/hudson/job/Cayenne-doc/ws/trunk/build-tools/maven-cayenne-doc-plugin/src/test/resources>
[INFO] [compiler:testCompile {execution: default-testCompile}]
[INFO] Compiling 1 source file to <https://hudson.apache.org/hudson/job/Cayenne-doc/ws/trunk/build-tools/maven-cayenne-doc-plugin/target/test-classes>
[INFO] [surefire:test {execution: default-test}]
[INFO] Surefire report directory: <https://hudson.apache.org/hudson/job/Cayenne-doc/ws/trunk/build-tools/maven-cayenne-doc-plugin/target/surefire-reports>

-------------------------------------------------------
 T E S T S
-------------------------------------------------------
Running org.apache.cayenne.maven.plugin.confluence.DocPageTest
Tests run: 5, Failures: 0, Errors: 0, Skipped: 0, Time elapsed: 0.03 sec

Results :

Tests run: 5, Failures: 0, Errors: 0, Skipped: 0

[INFO] [jar:jar {execution: default-jar}]
[INFO] Building jar: <https://hudson.apache.org/hudson/job/Cayenne-doc/ws/trunk/build-tools/maven-cayenne-doc-plugin/target/maven-cayenne-doc-plugin-3.1-SNAPSHOT.jar>
[INFO] [plugin:addPluginArtifactMetadata {execution: default-addPluginArtifactMetadata}]
[INFO] [install:install {execution: default-install}]
[INFO] Installing <https://hudson.apache.org/hudson/job/Cayenne-doc/ws/trunk/build-tools/maven-cayenne-doc-plugin/target/maven-cayenne-doc-plugin-3.1-SNAPSHOT.jar> to /home/hudson/.m2/repository/org/apache/cayenne/build-tools/maven-cayenne-doc-plugin/3.1-SNAPSHOT/maven-cayenne-doc-plugin-3.1-SNAPSHOT.jar
[INFO] Preparing javadoc:javadoc
[INFO] No goals needed for project - skipping
[INFO] [javadoc:javadoc {execution: default-cli}]
[WARNING] Source files encoding has not been set, using platform encoding UTF-8, i.e. build is platform dependent!
[INFO] 
Loading source files for package org.apache.cayenne.maven.plugin.confluence...
Constructing Javadoc information...
Standard Doclet version 1.6.0_20
Building tree for all the packages and classes...
Generating <https://hudson.apache.org/hudson/job/Cayenne-doc/ws/trunk/build-tools/maven-cayenne-doc-plugin/target/site/apidocs/org/apache/cayenne/maven/plugin/confluence//ConfluenceExportMojo.html...>
Generating <https://hudson.apache.org/hudson/job/Cayenne-doc/ws/trunk/build-tools/maven-cayenne-doc-plugin/target/site/apidocs/org/apache/cayenne/maven/plugin/confluence//DocGenerator.html...>
Generating <https://hudson.apache.org/hudson/job/Cayenne-doc/ws/trunk/build-tools/maven-cayenne-doc-plugin/target/site/apidocs/org/apache/cayenne/maven/plugin/confluence//DocPage.html...>
Generating <https://hudson.apache.org/hudson/job/Cayenne-doc/ws/trunk/build-tools/maven-cayenne-doc-plugin/target/site/apidocs/org/apache/cayenne/maven/plugin/confluence//DocPageRenderer.html...>
Generating <https://hudson.apache.org/hudson/job/Cayenne-doc/ws/trunk/build-tools/maven-cayenne-doc-plugin/target/site/apidocs/org/apache/cayenne/maven/plugin/confluence//package-frame.html...>
Generating <https://hudson.apache.org/hudson/job/Cayenne-doc/ws/trunk/build-tools/maven-cayenne-doc-plugin/target/site/apidocs/org/apache/cayenne/maven/plugin/confluence//package-summary.html...>
Generating <https://hudson.apache.org/hudson/job/Cayenne-doc/ws/trunk/build-tools/maven-cayenne-doc-plugin/target/site/apidocs/org/apache/cayenne/maven/plugin/confluence//package-tree.html...>
Generating <https://hudson.apache.org/hudson/job/Cayenne-doc/ws/trunk/build-tools/maven-cayenne-doc-plugin/target/site/apidocs/constant-values.html...>
Generating <https://hudson.apache.org/hudson/job/Cayenne-doc/ws/trunk/build-tools/maven-cayenne-doc-plugin/target/site/apidocs/org/apache/cayenne/maven/plugin/confluence//class-use/DocPage.html...>
Generating <https://hudson.apache.org/hudson/job/Cayenne-doc/ws/trunk/build-tools/maven-cayenne-doc-plugin/target/site/apidocs/org/apache/cayenne/maven/plugin/confluence//class-use/DocGenerator.html...>
Generating <https://hudson.apache.org/hudson/job/Cayenne-doc/ws/trunk/build-tools/maven-cayenne-doc-plugin/target/site/apidocs/org/apache/cayenne/maven/plugin/confluence//class-use/ConfluenceExportMojo.html...>
Generating <https://hudson.apache.org/hudson/job/Cayenne-doc/ws/trunk/build-tools/maven-cayenne-doc-plugin/target/site/apidocs/org/apache/cayenne/maven/plugin/confluence//class-use/DocPageRenderer.html...>
Generating <https://hudson.apache.org/hudson/job/Cayenne-doc/ws/trunk/build-tools/maven-cayenne-doc-plugin/target/site/apidocs/org/apache/cayenne/maven/plugin/confluence//package-use.html...>
Building index for all the packages and classes...
Generating <https://hudson.apache.org/hudson/job/Cayenne-doc/ws/trunk/build-tools/maven-cayenne-doc-plugin/target/site/apidocs/overview-tree.html...>
Generating <https://hudson.apache.org/hudson/job/Cayenne-doc/ws/trunk/build-tools/maven-cayenne-doc-plugin/target/site/apidocs/index-all.html...>
Generating <https://hudson.apache.org/hudson/job/Cayenne-doc/ws/trunk/build-tools/maven-cayenne-doc-plugin/target/site/apidocs/deprecated-list.html...>
Building index for all classes...
Generating <https://hudson.apache.org/hudson/job/Cayenne-doc/ws/trunk/build-tools/maven-cayenne-doc-plugin/target/site/apidocs/allclasses-frame.html...>
Generating <https://hudson.apache.org/hudson/job/Cayenne-doc/ws/trunk/build-tools/maven-cayenne-doc-plugin/target/site/apidocs/allclasses-noframe.html...>
Generating <https://hudson.apache.org/hudson/job/Cayenne-doc/ws/trunk/build-tools/maven-cayenne-doc-plugin/target/site/apidocs/index.html...>
Generating <https://hudson.apache.org/hudson/job/Cayenne-doc/ws/trunk/build-tools/maven-cayenne-doc-plugin/target/site/apidocs/help-doc.html...>
Generating <https://hudson.apache.org/hudson/job/Cayenne-doc/ws/trunk/build-tools/maven-cayenne-doc-plugin/target/site/apidocs/stylesheet.css...>
1 warning
[WARNING] Javadoc Warnings
[WARNING] <https://hudson.apache.org/hudson/job/Cayenne-doc/ws/trunk/build-tools/maven-cayenne-doc-plugin/src/main/java/org/apache/cayenne/maven/plugin/confluence/ConfluenceExportMojo.java>:34: warning - @goal is an unknown tag.
[INFO] [checkstyle:checkstyle {execution: default-cli}]
[WARNING] File encoding has not been set, using platform encoding UTF-8, i.e. build is platform dependent!
[INFO] 
[INFO] There are 480 checkstyle errors.
[WARNING] Unable to locate Source XRef to link to - DISABLED
[INFO] Preparing findbugs:findbugs
[INFO] [plugin:descriptor {execution: default-descriptor}]
[INFO] Using 2 extractors.
[INFO] Applying extractor for language: java
[INFO] Extractor for language: java found 1 mojo descriptors.
[INFO] Applying extractor for language: bsh
[INFO] Extractor for language: bsh found 0 mojo descriptors.
[INFO] [resources:resources {execution: default-resources}]
[INFO] Using 'UTF-8' encoding to copy filtered resources.
[INFO] Copying 1 resource
[INFO] [compiler:compile {execution: default-compile}]
[INFO] Nothing to compile - all classes are up to date
[INFO] [findbugs:findbugs {execution: default-cli}]
[INFO] Locale is en
     [java] The following classes needed for analysis were missing:
     [java]   org.apache.commons.collections.ExtendedProperties
     [java] Warnings generated: 5
     [java] Missing classes: 1
[INFO] [clover2:setup {execution: default-cli}]
[INFO] Clover Version 2.6.3, built on November 20 2009 (build-778)
[INFO] Loaded from: /home/hudson/.m2/repository/com/cenqua/clover/clover/2.6.3/clover-2.6.3.jar
[INFO] Clover: Open Source License registered to Apache.
[INFO] Creating new database at '<https://hudson.apache.org/hudson/job/Cayenne-doc/ws/trunk/build-tools/maven-cayenne-doc-plugin/target/clover/clover.db'.>
[INFO] Processing files at 1.6 source level.
[INFO] Clover all over. Instrumented 6 files (1 package).
[INFO] Elapsed time = 0.045 secs. (133.333 files/sec, 20,422.221 srclines/sec)
[INFO] Clover Version 2.6.3, built on November 20 2009 (build-778)
[INFO] Loaded from: /home/hudson/.m2/repository/com/cenqua/clover/clover/2.6.3/clover-2.6.3.jar
[INFO] Clover: Open Source License registered to Apache.
[INFO] Updating existing database at '<https://hudson.apache.org/hudson/job/Cayenne-doc/ws/trunk/build-tools/maven-cayenne-doc-plugin/target/clover/clover.db'.>
[INFO] Processing files at 1.6 source level.
[INFO] Clover all over. Instrumented 1 file (1 package).
[INFO] 5 test methods detected.
[INFO] Elapsed time = 0.011 secs. (90.909 files/sec, 13,454.546 srclines/sec)
[INFO] [plugin:descriptor {execution: default-descriptor}]
[INFO] Using 2 extractors.
[INFO] Applying extractor for language: java
[INFO] Extractor for language: java found 1 mojo descriptors.
[INFO] Applying extractor for language: bsh
[INFO] Extractor for language: bsh found 0 mojo descriptors.
[INFO] [resources:resources {execution: default-resources}]
[INFO] Using 'UTF-8' encoding to copy filtered resources.
[INFO] Copying 1 resource
[INFO] [compiler:compile {execution: default-compile}]
[INFO] Compiling 6 source files to <https://hudson.apache.org/hudson/job/Cayenne-doc/ws/trunk/build-tools/maven-cayenne-doc-plugin/target/classes>
[INFO] [resources:testResources {execution: default-testResources}]
[INFO] Using 'UTF-8' encoding to copy filtered resources.
[INFO] skip non existing resourceDirectory <https://hudson.apache.org/hudson/job/Cayenne-doc/ws/trunk/build-tools/maven-cayenne-doc-plugin/src/test/resources>
[INFO] [compiler:testCompile {execution: default-testCompile}]
[INFO] Compiling 1 source file to <https://hudson.apache.org/hudson/job/Cayenne-doc/ws/trunk/build-tools/maven-cayenne-doc-plugin/target/test-classes>
[INFO] [surefire:test {execution: default-test}]
[INFO] Surefire report directory: <https://hudson.apache.org/hudson/job/Cayenne-doc/ws/trunk/build-tools/maven-cayenne-doc-plugin/target/surefire-reports>

-------------------------------------------------------
 T E S T S
-------------------------------------------------------
Running org.apache.cayenne.maven.plugin.confluence.DocPageTest
Tests run: 5, Failures: 0, Errors: 0, Skipped: 0, Time elapsed: 0.091 sec

Results :

Tests run: 5, Failures: 0, Errors: 0, Skipped: 0

[INFO] ------------------------------------------------------------------------
[INFO] Building Cayenne Build Tools Parent
[INFO]    task-segment: [clean, install, javadoc:javadoc, checkstyle:checkstyle, findbugs:findbugs, clover2:setup, test]
[INFO] ------------------------------------------------------------------------
[INFO] [clean:clean {execution: default-clean}]
[INFO] [site:attach-descriptor {execution: default-attach-descriptor}]
[INFO] [install:install {execution: default-install}]
[INFO] Installing <https://hudson.apache.org/hudson/job/Cayenne-doc/ws/trunk/build-tools/pom.xml> to /home/hudson/.m2/repository/org/apache/cayenne/parents/cayenne-build-tools/3.1-SNAPSHOT/cayenne-build-tools-3.1-SNAPSHOT.pom
[INFO] Preparing javadoc:javadoc
[INFO] No goals needed for project - skipping
[INFO] [javadoc:javadoc {execution: default-cli}]
[INFO] [checkstyle:checkstyle {execution: default-cli}]
[INFO] Source directory does not exist - skipping report.
[INFO] Preparing findbugs:findbugs
[INFO] No goals needed for project - skipping
[INFO] [findbugs:findbugs {execution: default-cli}]
[INFO] [clover2:setup {execution: default-cli}]
[WARNING] The reported language of this project is none, attempting to instrument sources anyway.
[INFO] No Clover instrumentation done on source files in: [<https://hudson.apache.org/hudson/job/Cayenne-doc/ws/trunk/build-tools/src/main/java]> as no matching sources files found
[INFO] No Clover instrumentation done on source files in: [<https://hudson.apache.org/hudson/job/Cayenne-doc/ws/trunk/build-tools/src/test/java]> as no matching sources files found
[INFO] No goals needed for project - skipping
[INFO] ------------------------------------------------------------------------
[INFO] Building Cayenne License and Notice Bundle
[INFO]    task-segment: [clean, install, javadoc:javadoc, checkstyle:checkstyle, findbugs:findbugs, clover2:setup, test]
[INFO] ------------------------------------------------------------------------
[INFO] artifact org.apache.cayenne.build-tools:maven-cayenne-build-plugin: checking for updates from Maven Central Repo
[INFO] [clean:clean {execution: default-clean}]
[INFO] [cayenne-build:date {execution: date}]
[CLOVER] FATAL ERROR: Clover could not be initialised. Are you sure you have Clover in the runtime classpath? (class java.lang.NoClassDefFoundError:com_cenqua_clover/CloverVersionInfo)
[FATAL ERROR] org.apache.cayenne.maven.plugin.date.DateMojo#execute() caused a linkage error (java.lang.NoClassDefFoundError) and may be out-of-date. Check the realms:
[FATAL ERROR] Plugin realm = app0.child-container[org.apache.cayenne.build-tools:maven-cayenne-build-plugin:3.1-SNAPSHOT]
urls[0] = <https://hudson.apache.org/hudson/job/Cayenne-doc/ws/trunk/build-tools/maven-cayenne-build-plugin/target/classes/>
urls[1] = file:/home/hudson/.m2/repository/org/apache/maven/maven-archiver/2.2/maven-archiver-2.2.jar
urls[2] = file:/home/hudson/.m2/repository/org/codehaus/plexus/plexus-utils/1.1/plexus-utils-1.1.jar
urls[3] = file:/home/hudson/.m2/repository/org/codehaus/plexus/plexus-archiver/1.0-alpha-7/plexus-archiver-1.0-alpha-7.jar
urls[4] = file:/home/hudson/.m2/repository/velocity/velocity/1.4/velocity-1.4.jar
urls[5] = file:/home/hudson/.m2/repository/velocity/velocity-dep/1.4/velocity-dep-1.4.jar
urls[6] = file:/home/hudson/.m2/repository/org/scopemvc/scopemvc/1.0.1/scopemvc-1.0.1.jar
urls[7] = file:/home/hudson/.m2/repository/foundrylogic/vpp/vpp/2.2.1/vpp-2.2.1.jar
urls[8] = file:/home/hudson/.m2/repository/jgoodies/forms/1.0.5/forms-1.0.5.jar
urls[9] = file:/home/hudson/.m2/repository/jgoodies/looks/1.3.1/looks-1.3.1.jar
[FATAL ERROR] Container realm = plexus.core
urls[0] = file:/home/hudson/tools/maven/apache-maven-2.2.1/lib/maven-2.2.1-uber.jar
[INFO] ------------------------------------------------------------------------
[ERROR] FATAL ERROR
[INFO] ------------------------------------------------------------------------
[INFO] com_cenqua_clover/CoverageRecorder
[INFO] ------------------------------------------------------------------------
[INFO] Trace
java.lang.NoClassDefFoundError: com_cenqua_clover/CoverageRecorder
	at org.apache.cayenne.maven.plugin.date.DateMojo.execute(DateMojo.java:72)
	at org.apache.maven.plugin.DefaultPluginManager.executeMojo(DefaultPluginManager.java:490)
	at org.apache.maven.lifecycle.DefaultLifecycleExecutor.executeGoals(DefaultLifecycleExecutor.java:694)
	at org.apache.maven.lifecycle.DefaultLifecycleExecutor.executeGoalWithLifecycle(DefaultLifecycleExecutor.java:556)
	at org.apache.maven.lifecycle.DefaultLifecycleExecutor.executeGoal(DefaultLifecycleExecutor.java:535)
	at org.apache.maven.lifecycle.DefaultLifecycleExecutor.executeGoalAndHandleFailures(DefaultLifecycleExecutor.java:387)
	at org.apache.maven.lifecycle.DefaultLifecycleExecutor.executeTaskSegments(DefaultLifecycleExecutor.java:348)
	at org.apache.maven.lifecycle.DefaultLifecycleExecutor.execute(DefaultLifecycleExecutor.java:180)
	at org.apache.maven.DefaultMaven.doExecute(DefaultMaven.java:328)
	at org.apache.maven.DefaultMaven.execute(DefaultMaven.java:138)
	at org.apache.maven.cli.MavenCli.main(MavenCli.java:362)
	at org.apache.maven.cli.compat.CompatibleMain.main(CompatibleMain.java:60)
	at sun.reflect.NativeMethodAccessorImpl.invoke0(Native Method)
	at sun.reflect.NativeMethodAccessorImpl.invoke(NativeMethodAccessorImpl.java:39)
	at sun.reflect.DelegatingMethodAccessorImpl.invoke(DelegatingMethodAccessorImpl.java:25)
	at java.lang.reflect.Method.invoke(Method.java:597)
	at org.codehaus.classworlds.Launcher.launchEnhanced(Launcher.java:315)
	at org.codehaus.classworlds.Launcher.launch(Launcher.java:255)
	at org.codehaus.classworlds.Launcher.mainWithExitCode(Launcher.java:430)
	at org.codehaus.classworlds.Launcher.main(Launcher.java:375)
[INFO] ------------------------------------------------------------------------
[INFO] Total time: 53 seconds
[INFO] Finished at: Fri Aug 27 00:58:19 UTC 2010
[INFO] Final Memory: 87M/432M
[INFO] ------------------------------------------------------------------------
Publishing Javadoc
Publishing Clover coverage report...
No Clover report will be published due to a Build Failure


Re: Build failed in Hudson: Cayenne-doc #134

Posted by Aristedes Maniatis <ar...@maniatis.org>.
On 26/08/10 3:28 PM, Apache Hudson Server wrote:
> [CLOVER] FATAL ERROR: Clover could not be initialised. Are you sure you have Clover in the runtime classpath? (class java.lang.NoClassDefFoundError:com_cenqua_clover/CloverVersionInfo)

I'll look into this. I suspect this might be related to the move of Hudson to a new server.

Ari

-- 
-------------------------->
Aristedes Maniatis
GPG fingerprint CBFB 84B4 738D 4E87 5E5C  5EFA EF6A 7D2E 3E49 102A

Build failed in Hudson: Cayenne-doc #134

Posted by Apache Hudson Server <hu...@hudson.apache.org>.
See <https://hudson.apache.org/hudson/job/Cayenne-doc/134/changes>

Changes:

[aadamchik] fixing references to the version when the escape char API was added

------------------------------------------
[...truncated 299 lines...]
[INFO] Creating new database at '/zonestorage/hudson_solaris/home/hudson/hudson-slave/workspace/Cayenne-doc/trunk/build-tools/maven-cayenne-build-plugin/target/clover/clover.db'.
[INFO] Processing files at 1.6 source level.
[INFO] Clover all over. Instrumented 6 files (3 packages).
[INFO] Elapsed time = 0.07 secs. (85.714 files/sec, 11,271.429 srclines/sec)
[INFO] No Clover instrumentation done on source files in: [/zonestorage/hudson_solaris/home/hudson/hudson-slave/workspace/Cayenne-doc/trunk/build-tools/maven-cayenne-build-plugin/src/test/java] as no matching sources files found
[INFO] [plugin:descriptor {execution: default-descriptor}]
[INFO] Using 2 extractors.
[INFO] Applying extractor for language: java
[INFO] Extractor for language: java found 3 mojo descriptors.
[INFO] Applying extractor for language: bsh
[INFO] Extractor for language: bsh found 0 mojo descriptors.
[INFO] [resources:resources {execution: default-resources}]
[INFO] Using 'UTF-8' encoding to copy filtered resources.
[INFO] skip non existing resourceDirectory /zonestorage/hudson_solaris/home/hudson/hudson-slave/workspace/Cayenne-doc/trunk/build-tools/maven-cayenne-build-plugin/src/main/resources
[INFO] [compiler:compile {execution: default-compile}]
[INFO] Compiling 6 source files to /zonestorage/hudson_solaris/home/hudson/hudson-slave/workspace/Cayenne-doc/trunk/build-tools/maven-cayenne-build-plugin/target/classes
[INFO] [resources:testResources {execution: default-testResources}]
[INFO] Using 'UTF-8' encoding to copy filtered resources.
[INFO] skip non existing resourceDirectory /zonestorage/hudson_solaris/home/hudson/hudson-slave/workspace/Cayenne-doc/trunk/build-tools/maven-cayenne-build-plugin/src/test/resources
[INFO] [compiler:testCompile {execution: default-testCompile}]
[INFO] No sources to compile
[INFO] [surefire:test {execution: default-test}]
[INFO] No tests to run.
[INFO] ------------------------------------------------------------------------
[INFO] Building Cayenne Internal Documentation Build Plugin
[INFO]    task-segment: [clean, install, javadoc:javadoc, checkstyle:checkstyle, findbugs:findbugs, clover2:setup, test]
[INFO] ------------------------------------------------------------------------
[INFO] [clean:clean {execution: default-clean}]
[INFO] Deleting directory /zonestorage/hudson_solaris/home/hudson/hudson-slave/workspace/Cayenne-doc/trunk/build-tools/maven-cayenne-doc-plugin/target
Downloading: http://objectstyle.org/maven2/com/atlassian/confluence/confluence-soap/2.0/confluence-soap-2.0.pom
[INFO] Unable to find resource 'com.atlassian.confluence:confluence-soap:pom:2.0' in repository objectstyle (http://objectstyle.org/maven2)
Downloading: http://repo1.maven.org/maven2/com/atlassian/confluence/confluence-soap/2.0/confluence-soap-2.0.pom
[INFO] Unable to find resource 'com.atlassian.confluence:confluence-soap:pom:2.0' in repository central (http://repo1.maven.org/maven2)
[INFO] [plugin:descriptor {execution: default-descriptor}]
[INFO] Using 2 extractors.
[INFO] Applying extractor for language: java
[INFO] Extractor for language: java found 1 mojo descriptors.
[INFO] Applying extractor for language: bsh
[INFO] Extractor for language: bsh found 0 mojo descriptors.
[INFO] [resources:resources {execution: default-resources}]
[INFO] Using 'UTF-8' encoding to copy filtered resources.
[INFO] Copying 1 resource
[INFO] [compiler:compile {execution: default-compile}]
[INFO] Compiling 6 source files to /zonestorage/hudson_solaris/home/hudson/hudson-slave/workspace/Cayenne-doc/trunk/build-tools/maven-cayenne-doc-plugin/target/classes
[INFO] [resources:testResources {execution: default-testResources}]
[INFO] Using 'UTF-8' encoding to copy filtered resources.
[INFO] skip non existing resourceDirectory /zonestorage/hudson_solaris/home/hudson/hudson-slave/workspace/Cayenne-doc/trunk/build-tools/maven-cayenne-doc-plugin/src/test/resources
[INFO] [compiler:testCompile {execution: default-testCompile}]
[INFO] Compiling 1 source file to /zonestorage/hudson_solaris/home/hudson/hudson-slave/workspace/Cayenne-doc/trunk/build-tools/maven-cayenne-doc-plugin/target/test-classes
[INFO] [surefire:test {execution: default-test}]
[INFO] Surefire report directory: /zonestorage/hudson_solaris/home/hudson/hudson-slave/workspace/Cayenne-doc/trunk/build-tools/maven-cayenne-doc-plugin/target/surefire-reports

-------------------------------------------------------
 T E S T S
-------------------------------------------------------
Running org.apache.cayenne.maven.plugin.confluence.DocPageTest
Tests run: 5, Failures: 0, Errors: 0, Skipped: 0, Time elapsed: 0.161 sec

Results :

Tests run: 5, Failures: 0, Errors: 0, Skipped: 0

[INFO] [jar:jar {execution: default-jar}]
[INFO] Building jar: /zonestorage/hudson_solaris/home/hudson/hudson-slave/workspace/Cayenne-doc/trunk/build-tools/maven-cayenne-doc-plugin/target/maven-cayenne-doc-plugin-3.1-SNAPSHOT.jar
[INFO] [plugin:addPluginArtifactMetadata {execution: default-addPluginArtifactMetadata}]
[INFO] [install:install {execution: default-install}]
[INFO] Installing /zonestorage/hudson_solaris/home/hudson/hudson-slave/workspace/Cayenne-doc/trunk/build-tools/maven-cayenne-doc-plugin/target/maven-cayenne-doc-plugin-3.1-SNAPSHOT.jar to /export/home/hudson/.m2/repository/org/apache/cayenne/build-tools/maven-cayenne-doc-plugin/3.1-SNAPSHOT/maven-cayenne-doc-plugin-3.1-SNAPSHOT.jar
[INFO] Preparing javadoc:javadoc
[INFO] No goals needed for project - skipping
[INFO] [javadoc:javadoc {execution: default-cli}]
[WARNING] Source files encoding has not been set, using platform encoding ISO646-US, i.e. build is platform dependent!
[INFO] 
Loading source files for package org.apache.cayenne.maven.plugin.confluence...
Constructing Javadoc information...
Standard Doclet version 1.6.0_06
Building tree for all the packages and classes...
Generating /zonestorage/hudson_solaris/home/hudson/hudson-slave/workspace/Cayenne-doc/trunk/build-tools/maven-cayenne-doc-plugin/target/site/apidocs/org/apache/cayenne/maven/plugin/confluence//ConfluenceExportMojo.html...
Generating /zonestorage/hudson_solaris/home/hudson/hudson-slave/workspace/Cayenne-doc/trunk/build-tools/maven-cayenne-doc-plugin/target/site/apidocs/org/apache/cayenne/maven/plugin/confluence//DocGenerator.html...
Generating /zonestorage/hudson_solaris/home/hudson/hudson-slave/workspace/Cayenne-doc/trunk/build-tools/maven-cayenne-doc-plugin/target/site/apidocs/org/apache/cayenne/maven/plugin/confluence//DocPage.html...
Generating /zonestorage/hudson_solaris/home/hudson/hudson-slave/workspace/Cayenne-doc/trunk/build-tools/maven-cayenne-doc-plugin/target/site/apidocs/org/apache/cayenne/maven/plugin/confluence//DocPageRenderer.html...
Generating /zonestorage/hudson_solaris/home/hudson/hudson-slave/workspace/Cayenne-doc/trunk/build-tools/maven-cayenne-doc-plugin/target/site/apidocs/org/apache/cayenne/maven/plugin/confluence//package-frame.html...
Generating /zonestorage/hudson_solaris/home/hudson/hudson-slave/workspace/Cayenne-doc/trunk/build-tools/maven-cayenne-doc-plugin/target/site/apidocs/org/apache/cayenne/maven/plugin/confluence//package-summary.html...
Generating /zonestorage/hudson_solaris/home/hudson/hudson-slave/workspace/Cayenne-doc/trunk/build-tools/maven-cayenne-doc-plugin/target/site/apidocs/org/apache/cayenne/maven/plugin/confluence//package-tree.html...
Generating /zonestorage/hudson_solaris/home/hudson/hudson-slave/workspace/Cayenne-doc/trunk/build-tools/maven-cayenne-doc-plugin/target/site/apidocs/constant-values.html...
Generating /zonestorage/hudson_solaris/home/hudson/hudson-slave/workspace/Cayenne-doc/trunk/build-tools/maven-cayenne-doc-plugin/target/site/apidocs/org/apache/cayenne/maven/plugin/confluence//class-use/DocGenerator.html...
Generating /zonestorage/hudson_solaris/home/hudson/hudson-slave/workspace/Cayenne-doc/trunk/build-tools/maven-cayenne-doc-plugin/target/site/apidocs/org/apache/cayenne/maven/plugin/confluence//class-use/ConfluenceExportMojo.html...
Generating /zonestorage/hudson_solaris/home/hudson/hudson-slave/workspace/Cayenne-doc/trunk/build-tools/maven-cayenne-doc-plugin/target/site/apidocs/org/apache/cayenne/maven/plugin/confluence//class-use/DocPage.html...
Generating /zonestorage/hudson_solaris/home/hudson/hudson-slave/workspace/Cayenne-doc/trunk/build-tools/maven-cayenne-doc-plugin/target/site/apidocs/org/apache/cayenne/maven/plugin/confluence//class-use/DocPageRenderer.html...
Generating /zonestorage/hudson_solaris/home/hudson/hudson-slave/workspace/Cayenne-doc/trunk/build-tools/maven-cayenne-doc-plugin/target/site/apidocs/org/apache/cayenne/maven/plugin/confluence//package-use.html...
Building index for all the packages and classes...
Generating /zonestorage/hudson_solaris/home/hudson/hudson-slave/workspace/Cayenne-doc/trunk/build-tools/maven-cayenne-doc-plugin/target/site/apidocs/overview-tree.html...
Generating /zonestorage/hudson_solaris/home/hudson/hudson-slave/workspace/Cayenne-doc/trunk/build-tools/maven-cayenne-doc-plugin/target/site/apidocs/index-all.html...
Generating /zonestorage/hudson_solaris/home/hudson/hudson-slave/workspace/Cayenne-doc/trunk/build-tools/maven-cayenne-doc-plugin/target/site/apidocs/deprecated-list.html...
Building index for all classes...
Generating /zonestorage/hudson_solaris/home/hudson/hudson-slave/workspace/Cayenne-doc/trunk/build-tools/maven-cayenne-doc-plugin/target/site/apidocs/allclasses-frame.html...
Generating /zonestorage/hudson_solaris/home/hudson/hudson-slave/workspace/Cayenne-doc/trunk/build-tools/maven-cayenne-doc-plugin/target/site/apidocs/allclasses-noframe.html...
Generating /zonestorage/hudson_solaris/home/hudson/hudson-slave/workspace/Cayenne-doc/trunk/build-tools/maven-cayenne-doc-plugin/target/site/apidocs/index.html...
Generating /zonestorage/hudson_solaris/home/hudson/hudson-slave/workspace/Cayenne-doc/trunk/build-tools/maven-cayenne-doc-plugin/target/site/apidocs/help-doc.html...
Generating /zonestorage/hudson_solaris/home/hudson/hudson-slave/workspace/Cayenne-doc/trunk/build-tools/maven-cayenne-doc-plugin/target/site/apidocs/stylesheet.css...
1 warning
[WARNING] Javadoc Warnings
[WARNING] /zonestorage/hudson_solaris/home/hudson/hudson-slave/workspace/Cayenne-doc/trunk/build-tools/maven-cayenne-doc-plugin/src/main/java/org/apache/cayenne/maven/plugin/confluence/ConfluenceExportMojo.java:34: warning - @goal is an unknown tag.
[INFO] [checkstyle:checkstyle {execution: default-cli}]
[WARNING] File encoding has not been set, using platform encoding ISO646-US, i.e. build is platform dependent!
[INFO] 
[INFO] There are 480 checkstyle errors.
[WARNING] Unable to locate Source XRef to link to - DISABLED
[INFO] Preparing findbugs:findbugs
[INFO] [plugin:descriptor {execution: default-descriptor}]
[INFO] Using 2 extractors.
[INFO] Applying extractor for language: java
[INFO] Extractor for language: java found 1 mojo descriptors.
[INFO] Applying extractor for language: bsh
[INFO] Extractor for language: bsh found 0 mojo descriptors.
[INFO] [resources:resources {execution: default-resources}]
[INFO] Using 'UTF-8' encoding to copy filtered resources.
[INFO] Copying 1 resource
[INFO] [compiler:compile {execution: default-compile}]
[INFO] Nothing to compile - all classes are up to date
[INFO] [findbugs:findbugs {execution: default-cli}]
[INFO] Locale is en
     [java] The following classes needed for analysis were missing:
     [java]   org.apache.commons.collections.ExtendedProperties
     [java] Warnings generated: 5
     [java] Missing classes: 1
[INFO] [clover2:setup {execution: default-cli}]
[INFO] Clover Version 2.6.3, built on November 20 2009 (build-778)
[INFO] Loaded from: /export/home/hudson/.m2/repository/com/cenqua/clover/clover/2.6.3/clover-2.6.3.jar
[INFO] Clover: Open Source License registered to Apache.
[INFO] Creating new database at '/zonestorage/hudson_solaris/home/hudson/hudson-slave/workspace/Cayenne-doc/trunk/build-tools/maven-cayenne-doc-plugin/target/clover/clover.db'.
[INFO] Processing files at 1.6 source level.
[INFO] Clover all over. Instrumented 6 files (1 package).
[INFO] Elapsed time = 0.139 secs. (43.165 files/sec, 6,611.511 srclines/sec)
[INFO] Clover Version 2.6.3, built on November 20 2009 (build-778)
[INFO] Loaded from: /export/home/hudson/.m2/repository/com/cenqua/clover/clover/2.6.3/clover-2.6.3.jar
[INFO] Clover: Open Source License registered to Apache.
[INFO] Updating existing database at '/zonestorage/hudson_solaris/home/hudson/hudson-slave/workspace/Cayenne-doc/trunk/build-tools/maven-cayenne-doc-plugin/target/clover/clover.db'.
[INFO] Processing files at 1.6 source level.
[INFO] Clover all over. Instrumented 1 file (1 package).
[INFO] 5 test methods detected.
[INFO] Elapsed time = 0.016 secs. (62.5 files/sec, 9,250 srclines/sec)
[INFO] [plugin:descriptor {execution: default-descriptor}]
[INFO] Using 2 extractors.
[INFO] Applying extractor for language: java
[INFO] Extractor for language: java found 1 mojo descriptors.
[INFO] Applying extractor for language: bsh
[INFO] Extractor for language: bsh found 0 mojo descriptors.
[INFO] [resources:resources {execution: default-resources}]
[INFO] Using 'UTF-8' encoding to copy filtered resources.
[INFO] Copying 1 resource
[INFO] [compiler:compile {execution: default-compile}]
[INFO] Compiling 6 source files to /zonestorage/hudson_solaris/home/hudson/hudson-slave/workspace/Cayenne-doc/trunk/build-tools/maven-cayenne-doc-plugin/target/classes
[INFO] [resources:testResources {execution: default-testResources}]
[INFO] Using 'UTF-8' encoding to copy filtered resources.
[INFO] skip non existing resourceDirectory /zonestorage/hudson_solaris/home/hudson/hudson-slave/workspace/Cayenne-doc/trunk/build-tools/maven-cayenne-doc-plugin/src/test/resources
[INFO] [compiler:testCompile {execution: default-testCompile}]
[INFO] Compiling 1 source file to /zonestorage/hudson_solaris/home/hudson/hudson-slave/workspace/Cayenne-doc/trunk/build-tools/maven-cayenne-doc-plugin/target/test-classes
[INFO] [surefire:test {execution: default-test}]
[INFO] Surefire report directory: /zonestorage/hudson_solaris/home/hudson/hudson-slave/workspace/Cayenne-doc/trunk/build-tools/maven-cayenne-doc-plugin/target/surefire-reports

-------------------------------------------------------
 T E S T S
-------------------------------------------------------
Running org.apache.cayenne.maven.plugin.confluence.DocPageTest
Tests run: 5, Failures: 0, Errors: 0, Skipped: 0, Time elapsed: 0.228 sec

Results :

Tests run: 5, Failures: 0, Errors: 0, Skipped: 0

[INFO] ------------------------------------------------------------------------
[INFO] Building Cayenne Build Tools Parent
[INFO]    task-segment: [clean, install, javadoc:javadoc, checkstyle:checkstyle, findbugs:findbugs, clover2:setup, test]
[INFO] ------------------------------------------------------------------------
[INFO] [clean:clean {execution: default-clean}]
[INFO] Deleting directory /zonestorage/hudson_solaris/home/hudson/hudson-slave/workspace/Cayenne-doc/trunk/build-tools/target
[INFO] [site:attach-descriptor {execution: default-attach-descriptor}]
[INFO] [install:install {execution: default-install}]
[INFO] Installing /zonestorage/hudson_solaris/home/hudson/hudson-slave/workspace/Cayenne-doc/trunk/build-tools/pom.xml to /export/home/hudson/.m2/repository/org/apache/cayenne/parents/cayenne-build-tools/3.1-SNAPSHOT/cayenne-build-tools-3.1-SNAPSHOT.pom
[INFO] Preparing javadoc:javadoc
[INFO] No goals needed for project - skipping
[INFO] [javadoc:javadoc {execution: default-cli}]
[INFO] [checkstyle:checkstyle {execution: default-cli}]
[INFO] Source directory does not exist - skipping report.
[INFO] Preparing findbugs:findbugs
[INFO] No goals needed for project - skipping
[INFO] [findbugs:findbugs {execution: default-cli}]
[INFO] [clover2:setup {execution: default-cli}]
[WARNING] The reported language of this project is none, attempting to instrument sources anyway.
[INFO] No Clover instrumentation done on source files in: [/zonestorage/hudson_solaris/home/hudson/hudson-slave/workspace/Cayenne-doc/trunk/build-tools/src/main/java] as no matching sources files found
[INFO] No Clover instrumentation done on source files in: [/zonestorage/hudson_solaris/home/hudson/hudson-slave/workspace/Cayenne-doc/trunk/build-tools/src/test/java] as no matching sources files found
[INFO] No goals needed for project - skipping
[INFO] ------------------------------------------------------------------------
[INFO] Building Cayenne License and Notice Bundle
[INFO]    task-segment: [clean, install, javadoc:javadoc, checkstyle:checkstyle, findbugs:findbugs, clover2:setup, test]
[INFO] ------------------------------------------------------------------------
[INFO] artifact org.apache.cayenne.build-tools:maven-cayenne-build-plugin: checking for updates from Maven Central Repo
[INFO] [clean:clean {execution: default-clean}]
[INFO] [cayenne-build:date {execution: date}]
[CLOVER] FATAL ERROR: Clover could not be initialised. Are you sure you have Clover in the runtime classpath? (class java.lang.NoClassDefFoundError:com_cenqua_clover/CloverVersionInfo)
[FATAL ERROR] org.apache.cayenne.maven.plugin.date.DateMojo#execute() caused a linkage error (java.lang.NoClassDefFoundError) and may be out-of-date. Check the realms:
[FATAL ERROR] Plugin realm = app0.child-container[org.apache.cayenne.build-tools:maven-cayenne-build-plugin:3.1-SNAPSHOT]
urls[0] = file:/zonestorage/hudson_solaris/home/hudson/hudson-slave/workspace/Cayenne-doc/trunk/build-tools/maven-cayenne-build-plugin/target/classes/
urls[1] = file:/export/home/hudson/.m2/repository/org/apache/maven/maven-archiver/2.2/maven-archiver-2.2.jar
urls[2] = file:/export/home/hudson/.m2/repository/org/codehaus/plexus/plexus-utils/1.1/plexus-utils-1.1.jar
urls[3] = file:/export/home/hudson/.m2/repository/org/codehaus/plexus/plexus-archiver/1.0-alpha-7/plexus-archiver-1.0-alpha-7.jar
urls[4] = file:/export/home/hudson/.m2/repository/velocity/velocity/1.4/velocity-1.4.jar
urls[5] = file:/export/home/hudson/.m2/repository/velocity/velocity-dep/1.4/velocity-dep-1.4.jar
urls[6] = file:/export/home/hudson/.m2/repository/org/scopemvc/scopemvc/1.0.1/scopemvc-1.0.1.jar
urls[7] = file:/export/home/hudson/.m2/repository/foundrylogic/vpp/vpp/2.2.1/vpp-2.2.1.jar
urls[8] = file:/export/home/hudson/.m2/repository/jgoodies/forms/1.0.5/forms-1.0.5.jar
urls[9] = file:/export/home/hudson/.m2/repository/jgoodies/looks/1.3.1/looks-1.3.1.jar
[FATAL ERROR] Container realm = plexus.core
urls[0] = file:/home/hudson/tools/maven/apache-maven-2.2.1/lib/maven-2.2.1-uber.jar
[INFO] ------------------------------------------------------------------------
[ERROR] FATAL ERROR
[INFO] ------------------------------------------------------------------------
[INFO] com_cenqua_clover/CoverageRecorder
[INFO] ------------------------------------------------------------------------
[INFO] Trace
java.lang.NoClassDefFoundError: com_cenqua_clover/CoverageRecorder
	at org.apache.cayenne.maven.plugin.date.DateMojo.execute(DateMojo.java:72)
	at org.apache.maven.plugin.DefaultPluginManager.executeMojo(DefaultPluginManager.java:490)
	at org.apache.maven.lifecycle.DefaultLifecycleExecutor.executeGoals(DefaultLifecycleExecutor.java:694)
	at org.apache.maven.lifecycle.DefaultLifecycleExecutor.executeGoalWithLifecycle(DefaultLifecycleExecutor.java:556)
	at org.apache.maven.lifecycle.DefaultLifecycleExecutor.executeGoal(DefaultLifecycleExecutor.java:535)
	at org.apache.maven.lifecycle.DefaultLifecycleExecutor.executeGoalAndHandleFailures(DefaultLifecycleExecutor.java:387)
	at org.apache.maven.lifecycle.DefaultLifecycleExecutor.executeTaskSegments(DefaultLifecycleExecutor.java:348)
	at org.apache.maven.lifecycle.DefaultLifecycleExecutor.execute(DefaultLifecycleExecutor.java:180)
	at org.apache.maven.DefaultMaven.doExecute(DefaultMaven.java:328)
	at org.apache.maven.DefaultMaven.execute(DefaultMaven.java:138)
	at org.apache.maven.cli.MavenCli.main(MavenCli.java:362)
	at org.apache.maven.cli.compat.CompatibleMain.main(CompatibleMain.java:60)
	at sun.reflect.NativeMethodAccessorImpl.invoke0(Native Method)
	at sun.reflect.NativeMethodAccessorImpl.invoke(NativeMethodAccessorImpl.java:39)
	at sun.reflect.DelegatingMethodAccessorImpl.invoke(DelegatingMethodAccessorImpl.java:25)
	at java.lang.reflect.Method.invoke(Method.java:597)
	at org.codehaus.classworlds.Launcher.launchEnhanced(Launcher.java:315)
	at org.codehaus.classworlds.Launcher.launch(Launcher.java:255)
	at org.codehaus.classworlds.Launcher.mainWithExitCode(Launcher.java:430)
	at org.codehaus.classworlds.Launcher.main(Launcher.java:375)
[INFO] ------------------------------------------------------------------------
[INFO] Total time: 1 minute 45 seconds
[INFO] Finished at: Thu Aug 26 05:28:31 GMT+00:00 2010
[INFO] Final Memory: 84M/209M
[INFO] ------------------------------------------------------------------------
Publishing Javadoc
Publishing Clover coverage report...
No Clover report will be published due to a Build Failure