You are viewing a plain text version of this content. The canonical link for it is here.
Posted to builds@solr.apache.org by Apache Jenkins Server <je...@builds.apache.org> on 2025/02/27 05:21:58 UTC
[JENKINS] Solr » Solr-Smoketest-9.x - Build # 629 - Failure!
Build: https://ci-builds.apache.org/job/Solr/job/Solr-Smoketest-9.x/629/
Log:
Started by timer
Running as SYSTEM
[EnvInject] - Loading node environment variables.
Building remotely on lucene-solr-2 (solr lucene) in workspace /home/jenkins/jenkins-slave/workspace/Solr/Solr-Smoketest-9.x
[WS-CLEANUP] Deleting project workspace...
[WS-CLEANUP] Deferred wipeout is used...
[WS-CLEANUP] Done
The recommended git tool is: NONE
No credentials specified
Cloning the remote Git repository
Cloning repository https://github.com/apache/solr.git
> git init /home/jenkins/jenkins-slave/workspace/Solr/Solr-Smoketest-9.x # timeout=10
Fetching upstream changes from https://github.com/apache/solr.git
> git --version # timeout=10
> git --version # 'git version 2.25.1'
> git fetch --tags --force --progress -- https://github.com/apache/solr.git +refs/heads/*:refs/remotes/origin/* # timeout=10
> git config remote.origin.url https://github.com/apache/solr.git # timeout=10
> git config --add remote.origin.fetch +refs/heads/*:refs/remotes/origin/* # timeout=10
Avoid second fetch
> git rev-parse origin/branch_9x^{commit} # timeout=10
Checking out Revision 3b2a3a22e344f4fce60edc2a98321b5a6b9af3ea (origin/branch_9x)
> git config core.sparsecheckout # timeout=10
> git checkout -f 3b2a3a22e344f4fce60edc2a98321b5a6b9af3ea # timeout=10
> git branch -a -v --no-abbrev # timeout=10
> git checkout -b branch_9x 3b2a3a22e344f4fce60edc2a98321b5a6b9af3ea # timeout=10
Commit message: "SOLR-17669: SolrJ getBeans: reduce memory for dynamic/wildcard Field annotated methods (#3179)"
> git rev-list --no-walk 3b2a3a22e344f4fce60edc2a98321b5a6b9af3ea # timeout=10
No emails were triggered.
provisioning config files...
copy managed file [gradle.properties] to file:/home/jenkins/jenkins-slave/workspace/Solr/Solr-Smoketest-9.x/gradle.properties
[Gradle] - Launching build.
[Solr-Smoketest-9.x] $ /home/jenkins/jenkins-slave/workspace/Solr/Solr-Smoketest-9.x/gradlew -Dversion.suffix= -Dgradle.user.home=/home/jenkins/jenkins-slave/workspace/Solr/.gradle -Porg.gradle.daemon=false -Pvalidation.git.failOnModified=false --continue clean assembleRelease
Downloading gradle-wrapper.jar from https://raw.githubusercontent.com/gradle/gradle/v8.10.2/gradle/wrapper/gradle-wrapper.jar
To honour the JVM settings for this build a single-use Daemon process will be forked. For more on this, please refer to https://docs.gradle.org/8.10/userguide/gradle_daemon.html#sec:disabling_the_daemon in the Gradle documentation.
Daemon will be stopped at the end of the build
FAILURE: Build failed with an exception.
* What went wrong:
Could not isolate parameters org.gradle.api.internal.initialization.transform.MergeInstrumentationAnalysisTransform$Parameters_Decorated@7ff7ea93 of artifact transform MergeInstrumentationAnalysisTransform
> Could not isolate value org.gradle.api.internal.initialization.transform.MergeInstrumentationAnalysisTransform$Parameters_Decorated@7ff7ea93 of type MergeInstrumentationAnalysisTransform.Parameters
> A build operation failed.
Could not read workspace metadata from /home/jenkins/jenkins-slave/workspace/Solr/.gradle/caches/8.10/transforms/3984eedd80f936d2b7c18eac5bdc591a/metadata.bin
> Could not read workspace metadata from /home/jenkins/jenkins-slave/workspace/Solr/.gradle/caches/8.10/transforms/3984eedd80f936d2b7c18eac5bdc591a/metadata.bin
* Try:
> Run with --stacktrace option to get the stack trace.
> Run with --info or --debug option to get more log output.
> Run with --scan to get full insights.
> Get more help at https://help.gradle.org.
Deprecated Gradle features were used in this build, making it incompatible with Gradle 9.0.
You can use '--warning-mode all' to show the individual deprecation warnings and determine if they come from your own scripts or plugins.
For more on this, please refer to https://docs.gradle.org/8.10/userguide/command_line_interface.html#sec:command_line_warnings in the Gradle documentation.
BUILD FAILED in 9s
Build step 'Invoke Gradle script' changed build result to FAILURE
Build step 'Invoke Gradle script' marked build as failure
Email was triggered for: Failure - Any
Sending email for trigger: Failure - Any