You are viewing a plain text version of this content. The canonical link for it is here.
Posted to builds@cassandra.apache.org by Apache Jenkins Server <je...@builds.apache.org> on 2025/01/14 06:53:37 UTC

Build complete: Cassandra-trunk #1980 [UNSTABLE] d8babd01911fc3301950df2b7ce5839b644c8a8b

-------------------------------------------------------------------------------
  Build Cassandra-trunk #1980 Still unstable
  URL: https://ci-cassandra.apache.org/job/Cassandra-trunk/1980/
  -------------------------------------------------------------------------------
  Changes:
  No changes

  -------------------------------------------------------------------------------
  Failed Tests:
  21 tests failed.
FAILED:  dtest-latest.read_repair_test.TestSpeculativeReadRepair.Tests / dtest-latest jdk11 64/64 / test_quorum_requirement_on_speculated_read
FAILED:  dtest-latest.read_repair_test.TestSpeculativeReadRepair.Tests / dtest-latest jdk11 62/64 / test_speculative_write
FAILED:  dtest-latest.replace_address_test.TestReplaceAddress.Tests / dtest-latest jdk11 11/64 / test_unsafe_replace
FAILED:  dtest-latest.sslnodetonode_test.TestNodeToNodeSSLEncryption.Tests / dtest-latest jdk17 29/64 / test_ssl_wrong_hostname_with_validation
FAILED:  dtest-latest.topology_test.TestTopology.Tests / dtest-latest jdk17 62/64 / test_resumable_decommission
FAILED:  dtest.auth_test.TestAuth.Tests / dtest jdk17 10/64 / test_system_auth_ks_is_alterable
FAILED:  dtest.replace_address_test.TestReplaceAddress.Tests / dtest jdk11 10/64 / test_fail_when_seed
FAILED:  org.apache.cassandra.net.ConnectionTest.Tests / test jdk11 5/8 / testMessageDeliveryOnReconnect-_jdk11_x86_64
FAILED:  org.apache.cassandra.transport.DriverBurnTest.Tests / test-burn jdk17 2/2 / measureLargeV4WithCompression-_jdk17_x86_64
FAILED:  dtest-latest.read_repair_test.TestSpeculativeReadRepair.Tests / dtest-latest jdk11 59/64 / test_failed_read_repair
FAILED:  dtest-latest.read_repair_test.TestSpeculativeReadRepair.Tests / dtest-latest jdk17 59/64 / test_failed_read_repair
FAILED:  org.apache.cassandra.transport.SimpleClientPerfTest.Tests / test-burn jdk11 2/2 / measureLargeWithCompression[5/v5]-_jdk11_x86_64
FAILED:  org.apache.cassandra.transport.SimpleClientPerfTest.Tests / test-burn jdk17 2/2 / measureLargeWithCompression[5/v5]-_jdk17_x86_64
FAILED:  org.apache.cassandra.transport.SimpleClientPerfTest.Tests / test-burn jdk11 2/2 / measureLargeWithCompression[6/v6-beta]-_jdk11_x86_64
FAILED:  org.apache.cassandra.transport.SimpleClientPerfTest.Tests / test-burn jdk17 2/2 / measureLargeWithCompression[6/v6-beta]-_jdk17_x86_64
FAILED:  org.apache.cassandra.transport.SimpleClientPerfTest.Tests / test-burn jdk11 2/2 / measureLarge[5/v5]-_jdk11_x86_64
FAILED:  org.apache.cassandra.transport.SimpleClientPerfTest.Tests / test-burn jdk17 2/2 / measureLarge[5/v5]-_jdk17_x86_64
FAILED:  org.apache.cassandra.transport.SimpleClientPerfTest.Tests / test-burn jdk11 2/2 / measureLarge[6/v6-beta]-_jdk11_x86_64
FAILED:  org.apache.cassandra.transport.SimpleClientPerfTest.Tests / test-burn jdk17 2/2 / measureLarge[6/v6-beta]-_jdk17_x86_64
FAILED:  dtest.compaction_test.TestCompaction.Tests / dtest jdk17 58/64 / test_compaction_throughput
FAILED:  dtest.compaction_test.TestCompaction.Tests / dtest jdk11 58/64 / test_compaction_throughput

  -------------------------------------------------------------------------------
  For complete test report and logs see https://nightlies.apache.org/cassandra/Cassandra-trunk/1980/