You are viewing a plain text version of this content. The canonical link for it is here.
Posted to yarn-dev@hadoop.apache.org by Apache Jenkins Server <je...@builds.apache.org> on 2015/01/09 14:50:37 UTC
Failed: YARN-3015 PreCommit Build #6292
Jira: https://issues.apache.org/jira/browse/YARN-3015
Build: https://builds.apache.org/job/PreCommit-YARN-Build/6292/
###################################################################################
########################## LAST 60 LINES OF THE CONSOLE ###########################
[...truncated 20 lines...]
[PreCommit-YARN-Build] $ /bin/bash /tmp/hudson4078553516462583584.sh
Running in Jenkins mode
======================================================================
======================================================================
Testing patch for YARN-3015.
======================================================================
======================================================================
HEAD is now at ae91b13 HADOOP-11470. Remove some uses of obsolete guava APIs from the hadoop codebase (Sangjin Lee via Colin P. McCabe)
Switched to branch 'trunk'
Your branch is up-to-date with 'origin/trunk'.
Current branch trunk is up to date.
YARN-3015 patch is being downloaded at Fri Jan 9 13:50:32 UTC 2015 from
http://issues.apache.org/jira/secure/attachment/12691139/YARN-3015.002.patch
cp: cannot stat '/home/jenkins/buildSupport/lib/*': No such file or directory
The patch does not appear to apply with p0 to p2
PATCH APPLICATION FAILED
{color:red}-1 overall{color}. Here are the results of testing the latest attachment
http://issues.apache.org/jira/secure/attachment/12691139/YARN-3015.002.patch
against trunk revision ae91b13.
{color:red}-1 patch{color}. The patch command could not apply the patch.
Console output: https://builds.apache.org/job/PreCommit-YARN-Build/6292//console
This message is automatically generated.
======================================================================
======================================================================
Adding comment to Jira.
======================================================================
======================================================================
Comment added.
7a6035040b13ac905b28cfdb0c47588689c70566 logged out
======================================================================
======================================================================
Finished build.
======================================================================
======================================================================
Build step 'Execute shell' marked build as failure
Archiving artifacts
[description-setter] Could not determine description.
Recording test results
Email was triggered for: Failure
Sending email for trigger: Failure
###################################################################################
############################## FAILED TESTS (if any) ##############################
No tests ran.
Failed: YARN-3026 PreCommit Build #6310
Posted by Apache Jenkins Server <je...@builds.apache.org>.
Jira: https://issues.apache.org/jira/browse/YARN-3026
Build: https://builds.apache.org/job/PreCommit-YARN-Build/6310/
###################################################################################
########################## LAST 60 LINES OF THE CONSOLE ###########################
[...truncated 3364 lines...]
{color:red}-1 overall{color}. Here are the results of testing the latest attachment
http://issues.apache.org/jira/secure/attachment/12691682/YARN-3026.1.patch
against trunk revision 5b0d060.
{color:green}+1 @author{color}. The patch does not contain any @author tags.
{color:green}+1 tests included{color}. The patch appears to include 4 new or modified test files.
{color:green}+1 javac{color}. The applied patch does not increase the total number of javac compiler warnings.
{color:green}+1 javadoc{color}. There were no new javadoc warning messages.
{color:green}+1 eclipse:eclipse{color}. The patch built with eclipse:eclipse.
{color:red}-1 findbugs{color}. The patch appears to introduce 1 new Findbugs (version 2.0.3) warnings.
{color:green}+1 release audit{color}. The applied patch does not increase the total number of release audit warnings.
{color:red}-1 core tests{color}. The patch failed these unit tests in hadoop-yarn-project/hadoop-yarn/hadoop-yarn-server/hadoop-yarn-server-resourcemanager:
org.apache.hadoop.yarn.server.resourcemanager.scheduler.capacity.TestContainerAllocation
Test results: https://builds.apache.org/job/PreCommit-YARN-Build/6310//testReport/
Findbugs warnings: https://builds.apache.org/job/PreCommit-YARN-Build/6310//artifact/patchprocess/newPatchFindbugsWarningshadoop-yarn-server-resourcemanager.html
Console output: https://builds.apache.org/job/PreCommit-YARN-Build/6310//console
This message is automatically generated.
======================================================================
======================================================================
Adding comment to Jira.
======================================================================
======================================================================
Comment added.
74a36320100c9fa05656ba2b88685c1fbc0e44a1 logged out
======================================================================
======================================================================
Finished build.
======================================================================
======================================================================
Build step 'Execute shell' marked build as failure
Archiving artifacts
Sending artifact delta relative to PreCommit-YARN-Build #6051
Archived 15 artifacts
Archive block size is 32768
Received 120 blocks and 4958177 bytes
Compression is 44.2%
Took 1.2 sec
[description-setter] Could not determine description.
Recording test results
Email was triggered for: Failure
Sending email for trigger: Failure
###################################################################################
############################## FAILED TESTS (if any) ##############################
1 tests failed.
FAILED: org.apache.hadoop.yarn.server.resourcemanager.scheduler.capacity.TestContainerAllocation.testAMContainerAllocationWhenDNSUnavailable
Error Message:
test timed out after 30000 milliseconds
Stack Trace:
java.lang.Exception: test timed out after 30000 milliseconds
at java.net.Inet4AddressImpl.lookupAllHostAddr(Native Method)
at java.net.InetAddress$1.lookupAllHostAddr(InetAddress.java:901)
at java.net.InetAddress.getAddressesFromNameService(InetAddress.java:1293)
at java.net.InetAddress.getAllByName0(InetAddress.java:1246)
at java.net.InetAddress.getAllByName(InetAddress.java:1162)
at java.net.InetAddress.getAllByName(InetAddress.java:1098)
at java.net.InetAddress.getByName(InetAddress.java:1048)
at org.apache.hadoop.net.NetUtils.normalizeHostName(NetUtils.java:562)
at org.apache.hadoop.yarn.server.resourcemanager.NodesListManager.isValidNode(NodesListManager.java:147)
at org.apache.hadoop.yarn.server.resourcemanager.ResourceTrackerService.nodeHeartbeat(ResourceTrackerService.java:364)
at org.apache.hadoop.yarn.server.resourcemanager.MockNM.nodeHeartbeat(MockNM.java:174)
at org.apache.hadoop.yarn.server.resourcemanager.MockNM.nodeHeartbeat(MockNM.java:132)
at org.apache.hadoop.yarn.server.resourcemanager.MockRM.launchAM(MockRM.java:659)
at org.apache.hadoop.yarn.server.resourcemanager.MockRM.launchAndRegisterAM(MockRM.java:667)
at org.apache.hadoop.yarn.server.resourcemanager.scheduler.capacity.TestContainerAllocation.testAMContainerAllocationWhenDNSUnavailable(TestContainerAllocation.java:321)
Failed: YARN-3029 PreCommit Build #6309
Posted by Apache Jenkins Server <je...@builds.apache.org>.
Jira: https://issues.apache.org/jira/browse/YARN-3029
Build: https://builds.apache.org/job/PreCommit-YARN-Build/6309/
###################################################################################
########################## LAST 60 LINES OF THE CONSOLE ###########################
[...truncated 3193 lines...]
{color:red}-1 overall{color}. Here are the results of testing the latest attachment
http://issues.apache.org/jira/secure/attachment/12691673/YARN-3029.001.patch
against trunk revision 5b0d060.
{color:green}+1 @author{color}. The patch does not contain any @author tags.
{color:red}-1 tests included{color}. The patch doesn't appear to include any new or modified tests.
Please justify why no new tests are needed for this patch.
Also please list what manual steps were performed to verify this patch.
{color:green}+1 javac{color}. The applied patch does not increase the total number of javac compiler warnings.
{color:green}+1 javadoc{color}. There were no new javadoc warning messages.
{color:green}+1 eclipse:eclipse{color}. The patch built with eclipse:eclipse.
{color:green}+1 findbugs{color}. The patch does not introduce any new Findbugs (version 2.0.3) warnings.
{color:green}+1 release audit{color}. The applied patch does not increase the total number of release audit warnings.
{color:green}+1 core tests{color}. The patch passed unit tests in hadoop-yarn-project/hadoop-yarn/hadoop-yarn-common.
Test results: https://builds.apache.org/job/PreCommit-YARN-Build/6309//testReport/
Console output: https://builds.apache.org/job/PreCommit-YARN-Build/6309//console
This message is automatically generated.
======================================================================
======================================================================
Adding comment to Jira.
======================================================================
======================================================================
Comment added.
327e26a1f876109031281af8e8a20387fde00b00 logged out
======================================================================
======================================================================
Finished build.
======================================================================
======================================================================
Build step 'Execute shell' marked build as failure
Archiving artifacts
Sending artifact delta relative to PreCommit-YARN-Build #6051
Archived 15 artifacts
Archive block size is 32768
Received 121 blocks and 4904111 bytes
Compression is 44.7%
Took 1.6 sec
[description-setter] Could not determine description.
Recording test results
Email was triggered for: Failure
Sending email for trigger: Failure
###################################################################################
############################## FAILED TESTS (if any) ##############################
All tests passed
Failed: YARN-644 PreCommit Build #6308
Posted by Apache Jenkins Server <je...@builds.apache.org>.
Jira: https://issues.apache.org/jira/browse/YARN-644
Build: https://builds.apache.org/job/PreCommit-YARN-Build/6308/
###################################################################################
########################## LAST 60 LINES OF THE CONSOLE ###########################
[...truncated 3375 lines...]
{color:green}+1 @author{color}. The patch does not contain any @author tags.
{color:red}-1 tests included{color}. The patch doesn't appear to include any new or modified tests.
Please justify why no new tests are needed for this patch.
Also please list what manual steps were performed to verify this patch.
{color:green}+1 javac{color}. The applied patch does not increase the total number of javac compiler warnings.
{color:green}+1 javadoc{color}. There were no new javadoc warning messages.
{color:green}+1 eclipse:eclipse{color}. The patch built with eclipse:eclipse.
{color:green}+1 findbugs{color}. The patch does not introduce any new Findbugs (version 2.0.3) warnings.
{color:green}+1 release audit{color}. The applied patch does not increase the total number of release audit warnings.
{color:red}-1 core tests{color}. The patch failed these unit tests in hadoop-yarn-project/hadoop-yarn/hadoop-yarn-server/hadoop-yarn-server-nodemanager:
org.apache.hadoop.yarn.server.nodemanager.containermanager.monitor.TestContainersMonitor
org.apache.hadoop.yarn.server.nodemanager.containermanager.launcher.TestContainerLaunch
org.apache.hadoop.yarn.server.nodemanager.containermanager.logaggregation.TestLogAggregationService
Test results: https://builds.apache.org/job/PreCommit-YARN-Build/6308//testReport/
Console output: https://builds.apache.org/job/PreCommit-YARN-Build/6308//console
This message is automatically generated.
======================================================================
======================================================================
Adding comment to Jira.
======================================================================
======================================================================
Comment added.
e48c1c86b352e58ae30dc42ef3a48d13218cb102 logged out
======================================================================
======================================================================
Finished build.
======================================================================
======================================================================
Build step 'Execute shell' marked build as failure
Archiving artifacts
Sending artifact delta relative to PreCommit-YARN-Build #6051
Archived 15 artifacts
Archive block size is 32768
Received 120 blocks and 4869974 bytes
Compression is 44.7%
Took 1.8 sec
[description-setter] Could not determine description.
Recording test results
Email was triggered for: Failure
Sending email for trigger: Failure
###################################################################################
############################## FAILED TESTS (if any) ##############################
7 tests failed.
FAILED: org.apache.hadoop.yarn.server.nodemanager.containermanager.launcher.TestContainerLaunch.testImmediateKill
Error Message:
Invalid NMToken
Stack Trace:
org.apache.hadoop.yarn.exceptions.YarnException: Invalid NMToken
at org.apache.hadoop.yarn.ipc.RPCUtil.getRemoteException(RPCUtil.java:45)
at org.apache.hadoop.yarn.server.nodemanager.containermanager.ContainerManagerImpl.stopContainers(ContainerManagerImpl.java:962)
at org.apache.hadoop.yarn.server.nodemanager.containermanager.launcher.TestContainerLaunch.internalKillTest(TestContainerLaunch.java:718)
at org.apache.hadoop.yarn.server.nodemanager.containermanager.launcher.TestContainerLaunch.testImmediateKill(TestContainerLaunch.java:769)
FAILED: org.apache.hadoop.yarn.server.nodemanager.containermanager.launcher.TestContainerLaunch.testContainerEnvVariables
Error Message:
Invalid NMToken
Stack Trace:
org.apache.hadoop.yarn.exceptions.YarnException: Invalid NMToken
at org.apache.hadoop.yarn.ipc.RPCUtil.getRemoteException(RPCUtil.java:45)
at org.apache.hadoop.yarn.server.nodemanager.containermanager.ContainerManagerImpl.stopContainers(ContainerManagerImpl.java:962)
at org.apache.hadoop.yarn.server.nodemanager.containermanager.launcher.TestContainerLaunch.testContainerEnvVariables(TestContainerLaunch.java:603)
FAILED: org.apache.hadoop.yarn.server.nodemanager.containermanager.launcher.TestContainerLaunch.testDelayedKill
Error Message:
Invalid NMToken
Stack Trace:
org.apache.hadoop.yarn.exceptions.YarnException: Invalid NMToken
at org.apache.hadoop.yarn.ipc.RPCUtil.getRemoteException(RPCUtil.java:45)
at org.apache.hadoop.yarn.server.nodemanager.containermanager.ContainerManagerImpl.stopContainers(ContainerManagerImpl.java:962)
at org.apache.hadoop.yarn.server.nodemanager.containermanager.launcher.TestContainerLaunch.internalKillTest(TestContainerLaunch.java:718)
at org.apache.hadoop.yarn.server.nodemanager.containermanager.launcher.TestContainerLaunch.testDelayedKill(TestContainerLaunch.java:764)
FAILED: org.apache.hadoop.yarn.server.nodemanager.containermanager.launcher.TestContainerLaunch.testKillProcessGroup
Error Message:
Invalid NMToken
Stack Trace:
org.apache.hadoop.yarn.exceptions.YarnException: Invalid NMToken
at org.apache.hadoop.yarn.ipc.RPCUtil.getRemoteException(RPCUtil.java:45)
at org.apache.hadoop.yarn.server.nodemanager.containermanager.ContainerManagerImpl.getContainerStatuses(ContainerManagerImpl.java:1020)
at org.apache.hadoop.yarn.server.nodemanager.containermanager.BaseContainerManagerTest.waitForContainerState(BaseContainerManagerTest.java:266)
at org.apache.hadoop.yarn.server.nodemanager.containermanager.BaseContainerManagerTest.waitForContainerState(BaseContainerManagerTest.java:256)
at org.apache.hadoop.yarn.server.nodemanager.containermanager.launcher.TestContainerLaunch.testKillProcessGroup(TestContainerLaunch.java:1067)
FAILED: org.apache.hadoop.yarn.server.nodemanager.containermanager.logaggregation.TestLogAggregationService.testLogAggregationForRealContainerLaunch
Error Message:
Invalid NMToken
Stack Trace:
org.apache.hadoop.yarn.exceptions.YarnException: Invalid NMToken
at org.apache.hadoop.yarn.ipc.RPCUtil.getRemoteException(RPCUtil.java:45)
at org.apache.hadoop.yarn.server.nodemanager.containermanager.ContainerManagerImpl.getContainerStatuses(ContainerManagerImpl.java:1020)
at org.apache.hadoop.yarn.server.nodemanager.containermanager.BaseContainerManagerTest.waitForContainerState(BaseContainerManagerTest.java:266)
at org.apache.hadoop.yarn.server.nodemanager.containermanager.BaseContainerManagerTest.waitForContainerState(BaseContainerManagerTest.java:256)
at org.apache.hadoop.yarn.server.nodemanager.containermanager.logaggregation.TestLogAggregationService.testLogAggregationForRealContainerLaunch(TestLogAggregationService.java:882)
FAILED: org.apache.hadoop.yarn.server.nodemanager.containermanager.logaggregation.TestLogAggregationService.testLogAggregationServiceWithInterval
Error Message:
null
Stack Trace:
java.lang.AssertionError: null
at org.junit.Assert.fail(Assert.java:86)
at org.junit.Assert.assertTrue(Assert.java:41)
at org.junit.Assert.assertTrue(Assert.java:52)
at org.apache.hadoop.yarn.server.nodemanager.containermanager.logaggregation.TestLogAggregationService.testLogAggregationService(TestLogAggregationService.java:1370)
at org.apache.hadoop.yarn.server.nodemanager.containermanager.logaggregation.TestLogAggregationService.testLogAggregationServiceWithInterval(TestLogAggregationService.java:1290)
FAILED: org.apache.hadoop.yarn.server.nodemanager.containermanager.monitor.TestContainersMonitor.testContainerKillOnMemoryOverflow
Error Message:
Invalid NMToken
Stack Trace:
org.apache.hadoop.yarn.exceptions.YarnException: Invalid NMToken
at org.apache.hadoop.yarn.ipc.RPCUtil.getRemoteException(RPCUtil.java:45)
at org.apache.hadoop.yarn.server.nodemanager.containermanager.ContainerManagerImpl.getContainerStatuses(ContainerManagerImpl.java:1020)
at org.apache.hadoop.yarn.server.nodemanager.containermanager.BaseContainerManagerTest.waitForContainerState(BaseContainerManagerTest.java:266)
at org.apache.hadoop.yarn.server.nodemanager.containermanager.monitor.TestContainersMonitor.testContainerKillOnMemoryOverflow(TestContainersMonitor.java:266)
Failed: YARN-3009 PreCommit Build #6307
Posted by Apache Jenkins Server <je...@builds.apache.org>.
Jira: https://issues.apache.org/jira/browse/YARN-3009
Build: https://builds.apache.org/job/PreCommit-YARN-Build/6307/
###################################################################################
########################## LAST 60 LINES OF THE CONSOLE ###########################
[...truncated 3106 lines...]
{color:red}-1 overall{color}. Here are the results of testing the latest attachment
http://issues.apache.org/jira/secure/attachment/12691560/YARN-3009.20150111-1.patch
against trunk revision ef3c3a8.
{color:green}+1 @author{color}. The patch does not contain any @author tags.
{color:green}+1 tests included{color}. The patch appears to include 1 new or modified test files.
{color:green}+1 javac{color}. The applied patch does not increase the total number of javac compiler warnings.
{color:green}+1 javadoc{color}. There were no new javadoc warning messages.
{color:green}+1 eclipse:eclipse{color}. The patch built with eclipse:eclipse.
{color:red}-1 findbugs{color}. The patch appears to introduce 1 new Findbugs (version 2.0.3) warnings.
{color:green}+1 release audit{color}. The applied patch does not increase the total number of release audit warnings.
{color:green}+1 core tests{color}. The patch passed unit tests in hadoop-yarn-project/hadoop-yarn/hadoop-yarn-server/hadoop-yarn-server-applicationhistoryservice.
Test results: https://builds.apache.org/job/PreCommit-YARN-Build/6307//testReport/
Findbugs warnings: https://builds.apache.org/job/PreCommit-YARN-Build/6307//artifact/patchprocess/newPatchFindbugsWarningshadoop-yarn-server-applicationhistoryservice.html
Console output: https://builds.apache.org/job/PreCommit-YARN-Build/6307//console
This message is automatically generated.
======================================================================
======================================================================
Adding comment to Jira.
======================================================================
======================================================================
Comment added.
d65a5ef7b7ef93c6e1aea4e8345987e086e975d3 logged out
======================================================================
======================================================================
Finished build.
======================================================================
======================================================================
Build step 'Execute shell' marked build as failure
Archiving artifacts
Sending artifact delta relative to PreCommit-YARN-Build #6051
Archived 15 artifacts
Archive block size is 32768
Received 123 blocks and 4634287 bytes
Compression is 46.5%
Took 1.3 sec
[description-setter] Could not determine description.
Recording test results
Email was triggered for: Failure
Sending email for trigger: Failure
###################################################################################
############################## FAILED TESTS (if any) ##############################
All tests passed
Failed: YARN-3015 PreCommit Build #6306
Posted by Apache Jenkins Server <je...@builds.apache.org>.
Jira: https://issues.apache.org/jira/browse/YARN-3015
Build: https://builds.apache.org/job/PreCommit-YARN-Build/6306/
###################################################################################
########################## LAST 60 LINES OF THE CONSOLE ###########################
[...truncated 2994 lines...]
{color:red}-1 overall{color}. Here are the results of testing the latest attachment
http://issues.apache.org/jira/secure/attachment/12691548/YARN-3015.003.patch
against trunk revision ef3c3a8.
{color:green}+1 @author{color}. The patch does not contain any @author tags.
{color:red}-1 tests included{color}. The patch doesn't appear to include any new or modified tests.
Please justify why no new tests are needed for this patch.
Also please list what manual steps were performed to verify this patch.
{color:green}+1 javac{color}. The applied patch does not increase the total number of javac compiler warnings.
{color:green}+1 javadoc{color}. There were no new javadoc warning messages.
{color:green}+1 eclipse:eclipse{color}. The patch built with eclipse:eclipse.
{color:green}+1 findbugs{color}. The patch does not introduce any new Findbugs (version 2.0.3) warnings.
{color:green}+1 release audit{color}. The applied patch does not increase the total number of release audit warnings.
{color:green}+1 core tests{color}. The patch passed unit tests in .
Test results: https://builds.apache.org/job/PreCommit-YARN-Build/6306//testReport/
Console output: https://builds.apache.org/job/PreCommit-YARN-Build/6306//console
This message is automatically generated.
======================================================================
======================================================================
Adding comment to Jira.
======================================================================
======================================================================
Comment added.
b277c8b8842ab1c1689cf4106e699d27c048456c logged out
======================================================================
======================================================================
Finished build.
======================================================================
======================================================================
Build step 'Execute shell' marked build as failure
Archiving artifacts
Sending artifact delta relative to PreCommit-YARN-Build #6051
Archived 10 artifacts
Archive block size is 32768
Received 123 blocks and 4539164 bytes
Compression is 47.0%
Took 1.6 sec
[description-setter] Could not determine description.
Recording test results
Email was triggered for: Failure
Sending email for trigger: Failure
###################################################################################
############################## FAILED TESTS (if any) ##############################
No tests ran.
Failed: YARN-3005 PreCommit Build #6305
Posted by Apache Jenkins Server <je...@builds.apache.org>.
Jira: https://issues.apache.org/jira/browse/YARN-3005
Build: https://builds.apache.org/job/PreCommit-YARN-Build/6305/
###################################################################################
########################## LAST 60 LINES OF THE CONSOLE ###########################
[...truncated 3097 lines...]
{color:red}-1 overall{color}. Here are the results of testing the latest attachment
http://issues.apache.org/jira/secure/attachment/12691547/YARN-3005.002.patch
against trunk revision ef3c3a8.
{color:green}+1 @author{color}. The patch does not contain any @author tags.
{color:red}-1 tests included{color}. The patch doesn't appear to include any new or modified tests.
Please justify why no new tests are needed for this patch.
Also please list what manual steps were performed to verify this patch.
{color:green}+1 javac{color}. The applied patch does not increase the total number of javac compiler warnings.
{color:green}+1 javadoc{color}. There were no new javadoc warning messages.
{color:green}+1 eclipse:eclipse{color}. The patch built with eclipse:eclipse.
{color:green}+1 findbugs{color}. The patch does not introduce any new Findbugs (version 2.0.3) warnings.
{color:green}+1 release audit{color}. The applied patch does not increase the total number of release audit warnings.
{color:green}+1 core tests{color}. The patch passed unit tests in hadoop-yarn-project/hadoop-yarn/hadoop-yarn-registry.
Test results: https://builds.apache.org/job/PreCommit-YARN-Build/6305//testReport/
Console output: https://builds.apache.org/job/PreCommit-YARN-Build/6305//console
This message is automatically generated.
======================================================================
======================================================================
Adding comment to Jira.
======================================================================
======================================================================
Comment added.
9d10420502c98e7c76c60404fb045e3ea44ecba8 logged out
======================================================================
======================================================================
Finished build.
======================================================================
======================================================================
Build step 'Execute shell' marked build as failure
Archiving artifacts
Sending artifact delta relative to PreCommit-YARN-Build #6051
Archived 15 artifacts
Archive block size is 32768
Received 123 blocks and 4608208 bytes
Compression is 46.7%
Took 1.9 sec
[description-setter] Could not determine description.
Recording test results
Email was triggered for: Failure
Sending email for trigger: Failure
###################################################################################
############################## FAILED TESTS (if any) ##############################
All tests passed
Failed: YARN-3011 PreCommit Build #6304
Posted by Apache Jenkins Server <je...@builds.apache.org>.
Jira: https://issues.apache.org/jira/browse/YARN-3011
Build: https://builds.apache.org/job/PreCommit-YARN-Build/6304/
###################################################################################
########################## LAST 60 LINES OF THE CONSOLE ###########################
[...truncated 3309 lines...]
{color:red}-1 overall{color}. Here are the results of testing the latest attachment
http://issues.apache.org/jira/secure/attachment/12691543/YARN-3011.001.patch
against trunk revision ef3c3a8.
{color:green}+1 @author{color}. The patch does not contain any @author tags.
{color:green}+1 tests included{color}. The patch appears to include 1 new or modified test files.
{color:green}+1 javac{color}. The applied patch does not increase the total number of javac compiler warnings.
{color:green}+1 javadoc{color}. There were no new javadoc warning messages.
{color:green}+1 eclipse:eclipse{color}. The patch built with eclipse:eclipse.
{color:green}+1 findbugs{color}. The patch does not introduce any new Findbugs (version 2.0.3) warnings.
{color:green}+1 release audit{color}. The applied patch does not increase the total number of release audit warnings.
{color:green}+1 core tests{color}. The patch passed unit tests in hadoop-yarn-project/hadoop-yarn/hadoop-yarn-server/hadoop-yarn-server-nodemanager.
Test results: https://builds.apache.org/job/PreCommit-YARN-Build/6304//testReport/
Console output: https://builds.apache.org/job/PreCommit-YARN-Build/6304//console
This message is automatically generated.
======================================================================
======================================================================
Adding comment to Jira.
======================================================================
======================================================================
Comment added.
045dd66c332591a5492ea7984cca39ee55bb3c46 logged out
======================================================================
======================================================================
Finished build.
======================================================================
======================================================================
Build step 'Execute shell' marked build as failure
Archiving artifacts
Sending artifact delta relative to PreCommit-YARN-Build #6051
Archived 15 artifacts
Archive block size is 32768
Received 123 blocks and 4763557 bytes
Compression is 45.8%
Took 1.6 sec
[description-setter] Could not determine description.
Recording test results
Email was triggered for: Failure
Sending email for trigger: Failure
###################################################################################
############################## FAILED TESTS (if any) ##############################
All tests passed
Failed: YARN-2932 PreCommit Build #6303
Posted by Apache Jenkins Server <je...@builds.apache.org>.
Jira: https://issues.apache.org/jira/browse/YARN-2932
Build: https://builds.apache.org/job/PreCommit-YARN-Build/6303/
###################################################################################
########################## LAST 60 LINES OF THE CONSOLE ###########################
[...truncated 23 lines...]
======================================================================
======================================================================
Testing patch for YARN-2932.
======================================================================
======================================================================
HEAD is now at ef3c3a8 HDFS-7596. NameNode should prune dead storages from storageMap. Contributed by Arpit Agarwal.
Previous HEAD position was ef3c3a8... HDFS-7596. NameNode should prune dead storages from storageMap. Contributed by Arpit Agarwal.
Switched to branch 'trunk'
Your branch is behind 'origin/trunk' by 2 commits, and can be fast-forwarded.
(use "git pull" to update your local branch)
First, rewinding head to replay your work on top of it...
Fast-forwarded trunk to ef3c3a832c2f0c1e5ccdda2ff8ef84902912955f.
YARN-2932 patch is being downloaded at Sat Jan 10 20:30:29 UTC 2015 from
http://issues.apache.org/jira/secure/attachment/12691517/YARN-2932.v2.txt
cp: cannot stat '/home/jenkins/buildSupport/lib/*': No such file or directory
The patch does not appear to apply with p0 to p2
PATCH APPLICATION FAILED
{color:red}-1 overall{color}. Here are the results of testing the latest attachment
http://issues.apache.org/jira/secure/attachment/12691517/YARN-2932.v2.txt
against trunk revision ef3c3a8.
{color:red}-1 patch{color}. The patch command could not apply the patch.
Console output: https://builds.apache.org/job/PreCommit-YARN-Build/6303//console
This message is automatically generated.
======================================================================
======================================================================
Adding comment to Jira.
======================================================================
======================================================================
Comment added.
74b4f45c018a098548d66693577e22fa2fb80ce2 logged out
======================================================================
======================================================================
Finished build.
======================================================================
======================================================================
Build step 'Execute shell' marked build as failure
Archiving artifacts
[description-setter] Could not determine description.
Recording test results
Email was triggered for: Failure
Sending email for trigger: Failure
###################################################################################
############################## FAILED TESTS (if any) ##############################
No tests ran.
Failed: YARN-2637 PreCommit Build #6302
Posted by Apache Jenkins Server <je...@builds.apache.org>.
Jira: https://issues.apache.org/jira/browse/YARN-2637
Build: https://builds.apache.org/job/PreCommit-YARN-Build/6302/
###################################################################################
########################## LAST 60 LINES OF THE CONSOLE ###########################
[...truncated 3312 lines...]
{color:red}-1 overall{color}. Here are the results of testing the latest attachment
http://issues.apache.org/jira/secure/attachment/12691482/YARN-2637.39.patch
against trunk revision a260406.
{color:green}+1 @author{color}. The patch does not contain any @author tags.
{color:green}+1 tests included{color}. The patch appears to include 9 new or modified test files.
{color:green}+1 javac{color}. The applied patch does not increase the total number of javac compiler warnings.
{color:green}+1 javadoc{color}. There were no new javadoc warning messages.
{color:green}+1 eclipse:eclipse{color}. The patch built with eclipse:eclipse.
{color:red}-1 findbugs{color}. The patch appears to introduce 1 new Findbugs (version 2.0.3) warnings.
{color:green}+1 release audit{color}. The applied patch does not increase the total number of release audit warnings.
{color:green}+1 core tests{color}. The patch passed unit tests in hadoop-yarn-project/hadoop-yarn/hadoop-yarn-server/hadoop-yarn-server-resourcemanager.
Test results: https://builds.apache.org/job/PreCommit-YARN-Build/6302//testReport/
Findbugs warnings: https://builds.apache.org/job/PreCommit-YARN-Build/6302//artifact/patchprocess/newPatchFindbugsWarningshadoop-yarn-server-resourcemanager.html
Console output: https://builds.apache.org/job/PreCommit-YARN-Build/6302//console
This message is automatically generated.
======================================================================
======================================================================
Adding comment to Jira.
======================================================================
======================================================================
Comment added.
ab19f2fc5e42472454ee9109736984ab0d90348c logged out
======================================================================
======================================================================
Finished build.
======================================================================
======================================================================
Build step 'Execute shell' marked build as failure
Archiving artifacts
Sending artifact delta relative to PreCommit-YARN-Build #6051
Archived 15 artifacts
Archive block size is 32768
Received 123 blocks and 4853040 bytes
Compression is 45.4%
Took 1.9 sec
[description-setter] Could not determine description.
Recording test results
Email was triggered for: Failure
Sending email for trigger: Failure
###################################################################################
############################## FAILED TESTS (if any) ##############################
All tests passed
Failed: YARN-3005 PreCommit Build #6301
Posted by Apache Jenkins Server <je...@builds.apache.org>.
Jira: https://issues.apache.org/jira/browse/YARN-3005
Build: https://builds.apache.org/job/PreCommit-YARN-Build/6301/
###################################################################################
########################## LAST 60 LINES OF THE CONSOLE ###########################
[...truncated 3100 lines...]
{color:red}-1 overall{color}. Here are the results of testing the latest attachment
http://issues.apache.org/jira/secure/attachment/12691480/YARN-3005.001.patch
against trunk revision a260406.
{color:green}+1 @author{color}. The patch does not contain any @author tags.
{color:red}-1 tests included{color}. The patch doesn't appear to include any new or modified tests.
Please justify why no new tests are needed for this patch.
Also please list what manual steps were performed to verify this patch.
{color:green}+1 javac{color}. The applied patch does not increase the total number of javac compiler warnings.
{color:green}+1 javadoc{color}. There were no new javadoc warning messages.
{color:green}+1 eclipse:eclipse{color}. The patch built with eclipse:eclipse.
{color:green}+1 findbugs{color}. The patch does not introduce any new Findbugs (version 2.0.3) warnings.
{color:green}+1 release audit{color}. The applied patch does not increase the total number of release audit warnings.
{color:green}+1 core tests{color}. The patch passed unit tests in hadoop-yarn-project/hadoop-yarn/hadoop-yarn-registry.
Test results: https://builds.apache.org/job/PreCommit-YARN-Build/6301//testReport/
Console output: https://builds.apache.org/job/PreCommit-YARN-Build/6301//console
This message is automatically generated.
======================================================================
======================================================================
Adding comment to Jira.
======================================================================
======================================================================
Comment added.
3711f59a4874ba699a7ea288ca459b5a65eadb3b logged out
======================================================================
======================================================================
Finished build.
======================================================================
======================================================================
Build step 'Execute shell' marked build as failure
Archiving artifacts
Sending artifact delta relative to PreCommit-YARN-Build #6051
Archived 15 artifacts
Archive block size is 32768
Received 123 blocks and 4608010 bytes
Compression is 46.7%
Took 1.2 sec
[description-setter] Could not determine description.
Recording test results
Email was triggered for: Failure
Sending email for trigger: Failure
###################################################################################
############################## FAILED TESTS (if any) ##############################
All tests passed
Failed: YARN-2807 PreCommit Build #6300
Posted by Apache Jenkins Server <je...@builds.apache.org>.
Jira: https://issues.apache.org/jira/browse/YARN-2807
Build: https://builds.apache.org/job/PreCommit-YARN-Build/6300/
###################################################################################
########################## LAST 60 LINES OF THE CONSOLE ###########################
[...truncated 4233 lines...]
{color:red}-1 overall{color}. Here are the results of testing the latest attachment
http://issues.apache.org/jira/secure/attachment/12691473/YARN-2807.4.patch
against trunk revision a260406.
{color:green}+1 @author{color}. The patch does not contain any @author tags.
{color:green}+0 tests included{color}. The patch appears to be a documentation patch that doesn't require tests.
{color:green}+1 javac{color}. The applied patch does not increase the total number of javac compiler warnings.
{color:green}+1 javadoc{color}. There were no new javadoc warning messages.
{color:green}+1 eclipse:eclipse{color}. The patch built with eclipse:eclipse.
{color:green}+1 findbugs{color}. The patch does not introduce any new Findbugs (version 2.0.3) warnings.
{color:green}+1 release audit{color}. The applied patch does not increase the total number of release audit warnings.
{color:green}+1 core tests{color}. The patch passed unit tests in hadoop-common-project/hadoop-common.
Test results: https://builds.apache.org/job/PreCommit-YARN-Build/6300//testReport/
Console output: https://builds.apache.org/job/PreCommit-YARN-Build/6300//console
This message is automatically generated.
======================================================================
======================================================================
Adding comment to Jira.
======================================================================
======================================================================
Comment added.
3dc3619099c930ad230293030735a6f38f53d810 logged out
======================================================================
======================================================================
Finished build.
======================================================================
======================================================================
Build step 'Execute shell' marked build as failure
Archiving artifacts
Sending artifact delta relative to PreCommit-YARN-Build #6051
Archived 15 artifacts
Archive block size is 32768
Received 31 blocks and 8378117 bytes
Compression is 10.8%
Took 1.7 sec
[description-setter] Could not determine description.
Recording test results
Email was triggered for: Failure
Sending email for trigger: Failure
###################################################################################
############################## FAILED TESTS (if any) ##############################
All tests passed
Failed: YARN-2807 PreCommit Build #6299
Posted by Apache Jenkins Server <je...@builds.apache.org>.
Jira: https://issues.apache.org/jira/browse/YARN-2807
Build: https://builds.apache.org/job/PreCommit-YARN-Build/6299/
###################################################################################
########################## LAST 60 LINES OF THE CONSOLE ###########################
[...truncated 3022 lines...]
awk: cannot open /home/jenkins/jenkins-slave/workspace/PreCommit-YARN-Build/../patchprocess/testrun_hadoop-common.txt (No such file or directory)
/home/jenkins/jenkins-slave/workspace/PreCommit-YARN-Build
{color:red}-1 overall{color}. Here are the results of testing the latest attachment
http://issues.apache.org/jira/secure/attachment/12691468/YARN-2807.4.patch
against trunk revision a260406.
{color:green}+1 @author{color}. The patch does not contain any @author tags.
{color:green}+0 tests included{color}. The patch appears to be a documentation patch that doesn't require tests.
{color:green}+1 javac{color}. The applied patch does not increase the total number of javac compiler warnings.
{color:green}+1 javadoc{color}. There were no new javadoc warning messages.
{color:green}+1 eclipse:eclipse{color}. The patch built with eclipse:eclipse.
{color:green}+1 findbugs{color}. The patch does not introduce any new Findbugs (version 2.0.3) warnings.
{color:green}+1 release audit{color}. The applied patch does not increase the total number of release audit warnings.
{color:red}-1 core tests{color}. The patch failed these unit tests in hadoop-common-project/hadoop-common:
org.apache.hadoop.ha.TestZKFailoverControllerStress
org.apache.hadoop.metrics2.impl.TestMetricsSystemImpl
Test results: https://builds.apache.org/job/PreCommit-YARN-Build/6299//testReport/
Console output: https://builds.apache.org/job/PreCommit-YARN-Build/6299//console
This message is automatically generated.
======================================================================
======================================================================
Adding comment to Jira.
======================================================================
======================================================================
Comment added.
a57689d55b88a8da81ea42c402c3ca1a3fdc720f logged out
======================================================================
======================================================================
Finished build.
======================================================================
======================================================================
Build step 'Execute shell' marked build as failure
Archiving artifacts
[description-setter] Could not determine description.
Recording test results
Email was triggered for: Failure
Sending email for trigger: Failure
###################################################################################
############################## FAILED TESTS (if any) ##############################
2 tests failed.
FAILED: org.apache.hadoop.ha.TestZKFailoverControllerStress.testExpireBackAndForth
Error Message:
KeeperErrorCode = NoNode
Stack Trace:
org.apache.zookeeper.KeeperException$NoNodeException: KeeperErrorCode = NoNode
at org.apache.zookeeper.server.DataTree.getData(DataTree.java:648)
at org.apache.zookeeper.server.ZKDatabase.getData(ZKDatabase.java:371)
at org.apache.hadoop.ha.MiniZKFCCluster.expireActiveLockHolder(MiniZKFCCluster.java:199)
at org.apache.hadoop.ha.MiniZKFCCluster.expireAndVerifyFailover(MiniZKFCCluster.java:234)
at org.apache.hadoop.ha.TestZKFailoverControllerStress.testExpireBackAndForth(TestZKFailoverControllerStress.java:79)
FAILED: org.apache.hadoop.metrics2.impl.TestMetricsSystemImpl.testMultiThreadedPublish
Error Message:
Metric not collected!
Metric not collected!
Passed
Metric not collected!
Metric not collected!
Metric not collected!
Metric not collected!
Metric not collected!
Metric not collected!
Passed
Stack Trace:
java.lang.AssertionError: Metric not collected!
Metric not collected!
Passed
Metric not collected!
Metric not collected!
Metric not collected!
Metric not collected!
Metric not collected!
Metric not collected!
Passed
at org.junit.Assert.fail(Assert.java:88)
at org.junit.Assert.assertTrue(Assert.java:41)
at org.apache.hadoop.metrics2.impl.TestMetricsSystemImpl.testMultiThreadedPublish(TestMetricsSystemImpl.java:235)
Failed: YARN-3027 PreCommit Build #6298
Posted by Apache Jenkins Server <je...@builds.apache.org>.
Jira: https://issues.apache.org/jira/browse/YARN-3027
Build: https://builds.apache.org/job/PreCommit-YARN-Build/6298/
###################################################################################
########################## LAST 60 LINES OF THE CONSOLE ###########################
[...truncated 3324 lines...]
{color:red}-1 overall{color}. Here are the results of testing the latest attachment
http://issues.apache.org/jira/secure/attachment/12691462/YARN-3027.002.patch
against trunk revision 2a06101.
{color:green}+1 @author{color}. The patch does not contain any @author tags.
{color:green}+1 tests included{color}. The patch appears to include 1 new or modified test files.
{color:green}+1 javac{color}. The applied patch does not increase the total number of javac compiler warnings.
{color:green}+1 javadoc{color}. There were no new javadoc warning messages.
{color:green}+1 eclipse:eclipse{color}. The patch built with eclipse:eclipse.
{color:green}+1 findbugs{color}. The patch does not introduce any new Findbugs (version 2.0.3) warnings.
{color:green}+1 release audit{color}. The applied patch does not increase the total number of release audit warnings.
{color:red}-1 core tests{color}. The patch failed these unit tests in hadoop-yarn-project/hadoop-yarn/hadoop-yarn-server/hadoop-yarn-server-resourcemanager:
org.apache.hadoop.yarn.server.resourcemanager.TestRMRestart
Test results: https://builds.apache.org/job/PreCommit-YARN-Build/6298//testReport/
Console output: https://builds.apache.org/job/PreCommit-YARN-Build/6298//console
This message is automatically generated.
======================================================================
======================================================================
Adding comment to Jira.
======================================================================
======================================================================
Comment added.
4c2e5b4773b7199d71927bb48259c0103d68cd99 logged out
======================================================================
======================================================================
Finished build.
======================================================================
======================================================================
Build step 'Execute shell' marked build as failure
Archiving artifacts
Sending artifact delta relative to PreCommit-YARN-Build #6051
Archived 15 artifacts
Archive block size is 32768
Received 31 blocks and 7850146 bytes
Compression is 11.5%
Took 1.7 sec
[description-setter] Could not determine description.
Recording test results
Email was triggered for: Failure
Sending email for trigger: Failure
###################################################################################
############################## FAILED TESTS (if any) ##############################
1 tests failed.
REGRESSION: org.apache.hadoop.yarn.server.resourcemanager.TestRMRestart.testRMRestartGetApplicationList[1]
Error Message:
rMAppManager.logApplicationSummary(
isA(org.apache.hadoop.yarn.api.records.ApplicationId)
);
Wanted 3 times:
-> at org.apache.hadoop.yarn.server.resourcemanager.TestRMRestart.testRMRestartGetApplicationList(TestRMRestart.java:964)
But was 2 times:
-> at org.apache.hadoop.yarn.server.resourcemanager.RMAppManager.handle(RMAppManager.java:66)
Stack Trace:
org.mockito.exceptions.verification.TooLittleActualInvocations:
rMAppManager.logApplicationSummary(
isA(org.apache.hadoop.yarn.api.records.ApplicationId)
);
Wanted 3 times:
-> at org.apache.hadoop.yarn.server.resourcemanager.TestRMRestart.testRMRestartGetApplicationList(TestRMRestart.java:964)
But was 2 times:
-> at org.apache.hadoop.yarn.server.resourcemanager.RMAppManager.handle(RMAppManager.java:66)
at org.apache.hadoop.yarn.server.resourcemanager.TestRMRestart.testRMRestartGetApplicationList(TestRMRestart.java:964)
Failed: YARN-2637 PreCommit Build #6297
Posted by Apache Jenkins Server <je...@builds.apache.org>.
Jira: https://issues.apache.org/jira/browse/YARN-2637
Build: https://builds.apache.org/job/PreCommit-YARN-Build/6297/
###################################################################################
########################## LAST 60 LINES OF THE CONSOLE ###########################
[...truncated 3326 lines...]
{color:red}-1 overall{color}. Here are the results of testing the latest attachment
http://issues.apache.org/jira/secure/attachment/12691457/YARN-2637.38.patch
against trunk revision 8c3e888.
{color:green}+1 @author{color}. The patch does not contain any @author tags.
{color:green}+1 tests included{color}. The patch appears to include 9 new or modified test files.
{color:green}+1 javac{color}. The applied patch does not increase the total number of javac compiler warnings.
{color:green}+1 javadoc{color}. There were no new javadoc warning messages.
{color:green}+1 eclipse:eclipse{color}. The patch built with eclipse:eclipse.
{color:red}-1 findbugs{color}. The patch appears to introduce 1 new Findbugs (version 2.0.3) warnings.
{color:green}+1 release audit{color}. The applied patch does not increase the total number of release audit warnings.
{color:red}-1 core tests{color}. The patch failed these unit tests in hadoop-yarn-project/hadoop-yarn/hadoop-yarn-server/hadoop-yarn-server-resourcemanager:
org.apache.hadoop.yarn.server.resourcemanager.security.TestRMDelegationTokens
Test results: https://builds.apache.org/job/PreCommit-YARN-Build/6297//testReport/
Findbugs warnings: https://builds.apache.org/job/PreCommit-YARN-Build/6297//artifact/patchprocess/newPatchFindbugsWarningshadoop-yarn-server-resourcemanager.html
Console output: https://builds.apache.org/job/PreCommit-YARN-Build/6297//console
This message is automatically generated.
======================================================================
======================================================================
Adding comment to Jira.
======================================================================
======================================================================
Comment added.
a51792edf9f2b2cbe311084a75b4ba1b983c7f2d logged out
======================================================================
======================================================================
Finished build.
======================================================================
======================================================================
Build step 'Execute shell' marked build as failure
Archiving artifacts
Sending artifact delta relative to PreCommit-YARN-Build #6051
Archived 15 artifacts
Archive block size is 32768
Received 35 blocks and 7736183 bytes
Compression is 12.9%
Took 1.9 sec
[description-setter] Could not determine description.
Recording test results
Email was triggered for: Failure
Sending email for trigger: Failure
###################################################################################
############################## FAILED TESTS (if any) ##############################
1 tests failed.
REGRESSION: org.apache.hadoop.yarn.server.resourcemanager.security.TestRMDelegationTokens.testRMDTMasterKeyStateOnRollingMasterKey
Error Message:
null
Stack Trace:
java.lang.AssertionError: null
at org.junit.Assert.fail(Assert.java:86)
at org.junit.Assert.assertTrue(Assert.java:41)
at org.junit.Assert.assertTrue(Assert.java:52)
at org.apache.hadoop.yarn.server.resourcemanager.security.TestRMDelegationTokens$TestRMDelegationTokenSecretManager.checkCurrentKeyInStateStore(TestRMDelegationTokens.java:208)
at org.apache.hadoop.yarn.server.resourcemanager.security.TestRMDelegationTokens.testRMDTMasterKeyStateOnRollingMasterKey(TestRMDelegationTokens.java:112)
Failed: YARN-2956 PreCommit Build #6296
Posted by Apache Jenkins Server <je...@builds.apache.org>.
Jira: https://issues.apache.org/jira/browse/YARN-2956
Build: https://builds.apache.org/job/PreCommit-YARN-Build/6296/
###################################################################################
########################## LAST 60 LINES OF THE CONSOLE ###########################
[...truncated 3012 lines...]
{color:red}-1 overall{color}. Here are the results of testing the latest attachment
http://issues.apache.org/jira/secure/attachment/12691453/YARN-2956.2.patch
against trunk revision 8c3e888.
{color:green}+1 @author{color}. The patch does not contain any @author tags.
{color:green}+0 tests included{color}. The patch appears to be a documentation patch that doesn't require tests.
{color:green}+1 javac{color}. The applied patch does not increase the total number of javac compiler warnings.
{color:green}+1 javadoc{color}. There were no new javadoc warning messages.
{color:green}+1 eclipse:eclipse{color}. The patch built with eclipse:eclipse.
{color:green}+1 findbugs{color}. The patch does not introduce any new Findbugs (version 2.0.3) warnings.
{color:green}+1 release audit{color}. The applied patch does not increase the total number of release audit warnings.
{color:green}+1 core tests{color}. The patch passed unit tests in .
Test results: https://builds.apache.org/job/PreCommit-YARN-Build/6296//testReport/
Console output: https://builds.apache.org/job/PreCommit-YARN-Build/6296//console
This message is automatically generated.
======================================================================
======================================================================
Adding comment to Jira.
======================================================================
======================================================================
Comment added.
cf34ed0fd17940fe6c54ec5b34b5c1eaa45eaf7e logged out
======================================================================
======================================================================
Finished build.
======================================================================
======================================================================
Build step 'Execute shell' marked build as failure
Archiving artifacts
Sending artifact delta relative to PreCommit-YARN-Build #6051
Archived 10 artifacts
Archive block size is 32768
Received 125 blocks and 4473219 bytes
Compression is 47.8%
Took 1.1 sec
[description-setter] Could not determine description.
Recording test results
Email was triggered for: Failure
Sending email for trigger: Failure
###################################################################################
############################## FAILED TESTS (if any) ##############################
No tests ran.
Failed: YARN-3027 PreCommit Build #6295
Posted by Apache Jenkins Server <je...@builds.apache.org>.
Jira: https://issues.apache.org/jira/browse/YARN-3027
Build: https://builds.apache.org/job/PreCommit-YARN-Build/6295/
###################################################################################
########################## LAST 60 LINES OF THE CONSOLE ###########################
[...truncated 3302 lines...]
{color:red}-1 overall{color}. Here are the results of testing the latest attachment
http://issues.apache.org/jira/secure/attachment/12691427/YARN-3027.001.patch
against trunk revision 8c3e888.
{color:green}+1 @author{color}. The patch does not contain any @author tags.
{color:green}+1 tests included{color}. The patch appears to include 1 new or modified test files.
{color:red}-1 javac{color}. The applied patch generated 1217 javac compiler warnings (more than the trunk's current 1214 warnings).
{color:green}+1 javadoc{color}. There were no new javadoc warning messages.
{color:green}+1 eclipse:eclipse{color}. The patch built with eclipse:eclipse.
{color:green}+1 findbugs{color}. The patch does not introduce any new Findbugs (version 2.0.3) warnings.
{color:green}+1 release audit{color}. The applied patch does not increase the total number of release audit warnings.
{color:green}+1 core tests{color}. The patch passed unit tests in hadoop-yarn-project/hadoop-yarn/hadoop-yarn-server/hadoop-yarn-server-resourcemanager.
Test results: https://builds.apache.org/job/PreCommit-YARN-Build/6295//testReport/
Javac warnings: https://builds.apache.org/job/PreCommit-YARN-Build/6295//artifact/patchprocess/diffJavacWarnings.txt
Console output: https://builds.apache.org/job/PreCommit-YARN-Build/6295//console
This message is automatically generated.
======================================================================
======================================================================
Adding comment to Jira.
======================================================================
======================================================================
Comment added.
f161865c305cbc1544b4c138f4f7dcfa6a331b05 logged out
======================================================================
======================================================================
Finished build.
======================================================================
======================================================================
Build step 'Execute shell' marked build as failure
Archiving artifacts
Sending artifact delta relative to PreCommit-YARN-Build #6051
Archived 16 artifacts
Archive block size is 32768
Received 125 blocks and 4777955 bytes
Compression is 46.2%
Took 1.6 sec
[description-setter] Could not determine description.
Recording test results
Email was triggered for: Failure
Sending email for trigger: Failure
###################################################################################
############################## FAILED TESTS (if any) ##############################
All tests passed
Failed: YARN-3014 PreCommit Build #6294
Posted by Apache Jenkins Server <je...@builds.apache.org>.
Jira: https://issues.apache.org/jira/browse/YARN-3014
Build: https://builds.apache.org/job/PreCommit-YARN-Build/6294/
###################################################################################
########################## LAST 60 LINES OF THE CONSOLE ###########################
[...truncated 3518 lines...]
{color:red}-1 overall{color}. Here are the results of testing the latest attachment
http://issues.apache.org/jira/secure/attachment/12691347/YARN-3014-3.patch
against trunk revision ae91b13.
{color:green}+1 @author{color}. The patch does not contain any @author tags.
{color:green}+1 tests included{color}. The patch appears to include 1 new or modified test files.
{color:green}+1 javac{color}. The applied patch does not increase the total number of javac compiler warnings.
{color:green}+1 javadoc{color}. There were no new javadoc warning messages.
{color:green}+1 eclipse:eclipse{color}. The patch built with eclipse:eclipse.
{color:green}+1 findbugs{color}. The patch does not introduce any new Findbugs (version 2.0.3) warnings.
{color:green}+1 release audit{color}. The applied patch does not increase the total number of release audit warnings.
{color:green}+1 core tests{color}. The patch passed unit tests in hadoop-yarn-project/hadoop-yarn/hadoop-yarn-common hadoop-yarn-project/hadoop-yarn/hadoop-yarn-server/hadoop-yarn-server-resourcemanager.
Test results: https://builds.apache.org/job/PreCommit-YARN-Build/6294//testReport/
Console output: https://builds.apache.org/job/PreCommit-YARN-Build/6294//console
This message is automatically generated.
======================================================================
======================================================================
Adding comment to Jira.
======================================================================
======================================================================
Comment added.
e6c3b938257144d6595cd1117bc07439fcf3dc4e logged out
======================================================================
======================================================================
Finished build.
======================================================================
======================================================================
Build step 'Execute shell' marked build as failure
Archiving artifacts
Sending artifact delta relative to PreCommit-YARN-Build #6051
Archived 20 artifacts
Archive block size is 32768
Received 36 blocks and 7990177 bytes
Compression is 12.9%
Took 2.5 sec
[description-setter] Could not determine description.
Recording test results
Email was triggered for: Failure
Sending email for trigger: Failure
###################################################################################
############################## FAILED TESTS (if any) ##############################
All tests passed
Failed: YARN-3021 PreCommit Build #6293
Posted by Apache Jenkins Server <je...@builds.apache.org>.
Jira: https://issues.apache.org/jira/browse/YARN-3021
Build: https://builds.apache.org/job/PreCommit-YARN-Build/6293/
###################################################################################
########################## LAST 60 LINES OF THE CONSOLE ###########################
[...truncated 3306 lines...]
{color:red}-1 overall{color}. Here are the results of testing the latest attachment
http://issues.apache.org/jira/secure/attachment/12691342/YARN-3021.patch
against trunk revision ae91b13.
{color:green}+1 @author{color}. The patch does not contain any @author tags.
{color:green}+1 tests included{color}. The patch appears to include 1 new or modified test files.
{color:green}+1 javac{color}. The applied patch does not increase the total number of javac compiler warnings.
{color:green}+1 javadoc{color}. There were no new javadoc warning messages.
{color:green}+1 eclipse:eclipse{color}. The patch built with eclipse:eclipse.
{color:green}+1 findbugs{color}. The patch does not introduce any new Findbugs (version 2.0.3) warnings.
{color:green}+1 release audit{color}. The applied patch does not increase the total number of release audit warnings.
{color:red}-1 core tests{color}. The patch failed these unit tests in hadoop-yarn-project/hadoop-yarn/hadoop-yarn-server/hadoop-yarn-server-resourcemanager:
org.apache.hadoop.yarn.server.resourcemanager.security.TestRMDelegationTokens
Test results: https://builds.apache.org/job/PreCommit-YARN-Build/6293//testReport/
Console output: https://builds.apache.org/job/PreCommit-YARN-Build/6293//console
This message is automatically generated.
======================================================================
======================================================================
Adding comment to Jira.
======================================================================
======================================================================
Comment added.
5018c3e32c5328417a72890a62332d45ea89e270 logged out
======================================================================
======================================================================
Finished build.
======================================================================
======================================================================
Build step 'Execute shell' marked build as failure
Archiving artifacts
Sending artifact delta relative to PreCommit-YARN-Build #6051
Archived 15 artifacts
Archive block size is 32768
Received 124 blocks and 4807017 bytes
Compression is 45.8%
Took 2 sec
[description-setter] Could not determine description.
Recording test results
Email was triggered for: Failure
Sending email for trigger: Failure
###################################################################################
############################## FAILED TESTS (if any) ##############################
1 tests failed.
FAILED: org.apache.hadoop.yarn.server.resourcemanager.security.TestRMDelegationTokens.testRMDTMasterKeyStateOnRollingMasterKey
Error Message:
null
Stack Trace:
java.lang.AssertionError: null
at org.junit.Assert.fail(Assert.java:86)
at org.junit.Assert.assertTrue(Assert.java:41)
at org.junit.Assert.assertTrue(Assert.java:52)
at org.apache.hadoop.yarn.server.resourcemanager.security.TestRMDelegationTokens$TestRMDelegationTokenSecretManager.checkCurrentKeyInStateStore(TestRMDelegationTokens.java:208)
at org.apache.hadoop.yarn.server.resourcemanager.security.TestRMDelegationTokens.testRMDTMasterKeyStateOnRollingMasterKey(TestRMDelegationTokens.java:112)