You are viewing a plain text version of this content. The canonical link for it is here.
Posted to commits@jena.apache.org by Apache Jenkins Server <je...@builds.apache.org> on 2016/06/11 13:10:27 UTC
Build failed in Jenkins: Jena_Development_Test #2409
See <https://builds.apache.org/job/Jena_Development_Test/2409/changes>
Changes:
[andy] Remove stray junk
[andy] Alignment on output
[andy] Typo
[andy] Remove old, unnecessary workaround.
[andy] JENA-1193: Do not attempt to project vars when not at the top-level.
------------------------------------------
Started by an SCM change
[EnvInject] - Loading node environment variables.
Building remotely on ubuntu-4 (docker Ubuntu ubuntu4 ubuntu yahoo-not-h2) in workspace <https://builds.apache.org/job/Jena_Development_Test/ws/>
Cloning the remote Git repository
Cloning repository git://git.apache.org/jena.git
> git init <https://builds.apache.org/job/Jena_Development_Test/ws/> # timeout=10
Fetching upstream changes from git://git.apache.org/jena.git
> git --version # timeout=10
> git -c core.askpass=true fetch --tags --progress git://git.apache.org/jena.git +refs/heads/*:refs/remotes/origin/*
> git config remote.origin.url git://git.apache.org/jena.git # timeout=10
> git config --add remote.origin.fetch +refs/heads/*:refs/remotes/origin/* # timeout=10
> git config remote.origin.url git://git.apache.org/jena.git # timeout=10
Fetching upstream changes from git://git.apache.org/jena.git
> git -c core.askpass=true fetch --tags --progress git://git.apache.org/jena.git +refs/heads/*:refs/remotes/origin/*
> git rev-parse origin/master^{commit} # timeout=10
Checking out Revision 0f2a544a6655b948c4a171a303442c767c2754a7 (origin/master)
> git config core.sparsecheckout # timeout=10
> git checkout -f 0f2a544a6655b948c4a171a303442c767c2754a7
> git rev-list d4d2dd40b3edccbf9b58f009a4248109f54d9207 # timeout=10
Parsing POMs
Modules changed, recalculating dependency graph
Established TCP socket on 50869
maven32-agent.jar already up to date
maven32-interceptor.jar already up to date
maven3-interceptor-commons.jar already up to date
[Jena_Development_Test] $ /home/jenkins/jenkins-slave/tools/hudson.model.JDK/latest1.8/bin/java -Xrs -cp /home/jenkins/jenkins-slave/maven32-agent.jar:/home/jenkins/jenkins-slave/tools/hudson.tasks.Maven_MavenInstallation/maven-3.3.3/boot/plexus-classworlds-2.5.2.jar:/home/jenkins/jenkins-slave/tools/hudson.tasks.Maven_MavenInstallation/maven-3.3.3/conf/logging jenkins.maven3.agent.Maven32Main /home/jenkins/jenkins-slave/tools/hudson.tasks.Maven_MavenInstallation/maven-3.3.3 /home/jenkins/jenkins-slave/slave.jar /home/jenkins/jenkins-slave/maven32-interceptor.jar /home/jenkins/jenkins-slave/maven3-interceptor-commons.jar 50869
Exception in thread "main" java.lang.ClassNotFoundException: hudson.remoting.Launcher
at org.codehaus.plexus.classworlds.strategy.SelfFirstStrategy.loadClass(SelfFirstStrategy.java:50)
at org.codehaus.plexus.classworlds.realm.ClassRealm.unsynchronizedLoadClass(ClassRealm.java:271)
at org.codehaus.plexus.classworlds.realm.ClassRealm.loadClass(ClassRealm.java:247)
at org.codehaus.plexus.classworlds.realm.ClassRealm.loadClass(ClassRealm.java:239)
at jenkins.maven3.agent.Maven32Main.main(Maven32Main.java:143)
at jenkins.maven3.agent.Maven32Main.main(Maven32Main.java:74)
ERROR: Failed to parse POMs
java.io.EOFException: unexpected stream termination
at hudson.remoting.ChannelBuilder.negotiate(ChannelBuilder.java:365)
at hudson.remoting.ChannelBuilder.build(ChannelBuilder.java:310)
at hudson.slaves.Channels.forProcess(Channels.java:115)
at hudson.maven.AbstractMavenProcessFactory.newProcess(AbstractMavenProcessFactory.java:297)
at hudson.maven.ProcessCache.get(ProcessCache.java:236)
at hudson.maven.MavenModuleSetBuild$MavenModuleSetBuildExecution.doRun(MavenModuleSetBuild.java:778)
at hudson.model.AbstractBuild$AbstractBuildExecution.run(AbstractBuild.java:534)
at hudson.model.Run.execute(Run.java:1738)
at hudson.maven.MavenModuleSetBuild.run(MavenModuleSetBuild.java:531)
at hudson.model.ResourceController.execute(ResourceController.java:98)
at hudson.model.Executor.run(Executor.java:410)
Jenkins build is back to normal : Jena_Development_Test #2412
Posted by Apache Jenkins Server <je...@builds.apache.org>.
See <https://builds.apache.org/job/Jena_Development_Test/2412/changes>
Build failed in Jenkins: Jena_Development_Test #2411
Posted by Apache Jenkins Server <je...@builds.apache.org>.
See <https://builds.apache.org/job/Jena_Development_Test/2411/>
------------------------------------------
Started by user andy
[EnvInject] - Loading node environment variables.
Building remotely on ubuntu-4 (docker Ubuntu ubuntu4 ubuntu yahoo-not-h2) in workspace <https://builds.apache.org/job/Jena_Development_Test/ws/>
> git rev-parse --is-inside-work-tree # timeout=10
Fetching changes from the remote Git repository
> git config remote.origin.url git://git.apache.org/jena.git # timeout=10
Fetching upstream changes from git://git.apache.org/jena.git
> git --version # timeout=10
> git -c core.askpass=true fetch --tags --progress git://git.apache.org/jena.git +refs/heads/*:refs/remotes/origin/*
> git rev-parse origin/master^{commit} # timeout=10
Checking out Revision 0f2a544a6655b948c4a171a303442c767c2754a7 (origin/master)
> git config core.sparsecheckout # timeout=10
> git checkout -f 0f2a544a6655b948c4a171a303442c767c2754a7
> git rev-list 0f2a544a6655b948c4a171a303442c767c2754a7 # timeout=10
Parsing POMs
Modules changed, recalculating dependency graph
Established TCP socket on 38793
maven32-agent.jar already up to date
maven32-interceptor.jar already up to date
maven3-interceptor-commons.jar already up to date
[Jena_Development_Test] $ /home/jenkins/jenkins-slave/tools/hudson.model.JDK/latest1.8/bin/java -Xrs -cp /home/jenkins/jenkins-slave/maven32-agent.jar:/home/jenkins/jenkins-slave/tools/hudson.tasks.Maven_MavenInstallation/maven-3.3.3/boot/plexus-classworlds-2.5.2.jar:/home/jenkins/jenkins-slave/tools/hudson.tasks.Maven_MavenInstallation/maven-3.3.3/conf/logging jenkins.maven3.agent.Maven32Main /home/jenkins/jenkins-slave/tools/hudson.tasks.Maven_MavenInstallation/maven-3.3.3 /home/jenkins/jenkins-slave/slave.jar /home/jenkins/jenkins-slave/maven32-interceptor.jar /home/jenkins/jenkins-slave/maven3-interceptor-commons.jar 38793
Exception in thread "main" java.lang.ClassNotFoundException: hudson.remoting.Launcher
at org.codehaus.plexus.classworlds.strategy.SelfFirstStrategy.loadClass(SelfFirstStrategy.java:50)
at org.codehaus.plexus.classworlds.realm.ClassRealm.unsynchronizedLoadClass(ClassRealm.java:271)
at org.codehaus.plexus.classworlds.realm.ClassRealm.loadClass(ClassRealm.java:247)
at org.codehaus.plexus.classworlds.realm.ClassRealm.loadClass(ClassRealm.java:239)
at jenkins.maven3.agent.Maven32Main.main(Maven32Main.java:143)
at jenkins.maven3.agent.Maven32Main.main(Maven32Main.java:74)
ERROR: Failed to parse POMs
java.io.EOFException: unexpected stream termination
at hudson.remoting.ChannelBuilder.negotiate(ChannelBuilder.java:365)
at hudson.remoting.ChannelBuilder.build(ChannelBuilder.java:310)
at hudson.slaves.Channels.forProcess(Channels.java:115)
at hudson.maven.AbstractMavenProcessFactory.newProcess(AbstractMavenProcessFactory.java:297)
at hudson.maven.ProcessCache.get(ProcessCache.java:236)
at hudson.maven.MavenModuleSetBuild$MavenModuleSetBuildExecution.doRun(MavenModuleSetBuild.java:778)
at hudson.model.AbstractBuild$AbstractBuildExecution.run(AbstractBuild.java:534)
at hudson.model.Run.execute(Run.java:1738)
at hudson.maven.MavenModuleSetBuild.run(MavenModuleSetBuild.java:531)
at hudson.model.ResourceController.execute(ResourceController.java:98)
at hudson.model.Executor.run(Executor.java:410)
Build failed in Jenkins: Jena_Development_Test #2410
Posted by Apache Jenkins Server <je...@builds.apache.org>.
See <https://builds.apache.org/job/Jena_Development_Test/2410/>
------------------------------------------
Started by an SCM change
[EnvInject] - Loading node environment variables.
Building remotely on ubuntu-4 (docker Ubuntu ubuntu4 ubuntu yahoo-not-h2) in workspace <https://builds.apache.org/job/Jena_Development_Test/ws/>
> git rev-parse --is-inside-work-tree # timeout=10
Fetching changes from the remote Git repository
> git config remote.origin.url git://git.apache.org/jena.git # timeout=10
Fetching upstream changes from git://git.apache.org/jena.git
> git --version # timeout=10
> git -c core.askpass=true fetch --tags --progress git://git.apache.org/jena.git +refs/heads/*:refs/remotes/origin/*
> git rev-parse origin/master^{commit} # timeout=10
Checking out Revision 0f2a544a6655b948c4a171a303442c767c2754a7 (origin/master)
> git config core.sparsecheckout # timeout=10
> git checkout -f 0f2a544a6655b948c4a171a303442c767c2754a7
> git rev-list 0f2a544a6655b948c4a171a303442c767c2754a7 # timeout=10
Parsing POMs
Modules changed, recalculating dependency graph
Established TCP socket on 33464
maven32-agent.jar already up to date
maven32-interceptor.jar already up to date
maven3-interceptor-commons.jar already up to date
[Jena_Development_Test] $ /home/jenkins/jenkins-slave/tools/hudson.model.JDK/latest1.8/bin/java -Xrs -cp /home/jenkins/jenkins-slave/maven32-agent.jar:/home/jenkins/jenkins-slave/tools/hudson.tasks.Maven_MavenInstallation/maven-3.3.3/boot/plexus-classworlds-2.5.2.jar:/home/jenkins/jenkins-slave/tools/hudson.tasks.Maven_MavenInstallation/maven-3.3.3/conf/logging jenkins.maven3.agent.Maven32Main /home/jenkins/jenkins-slave/tools/hudson.tasks.Maven_MavenInstallation/maven-3.3.3 /home/jenkins/jenkins-slave/slave.jar /home/jenkins/jenkins-slave/maven32-interceptor.jar /home/jenkins/jenkins-slave/maven3-interceptor-commons.jar 33464
Exception in thread "main" java.lang.ClassNotFoundException: hudson.remoting.Launcher
at org.codehaus.plexus.classworlds.strategy.SelfFirstStrategy.loadClass(SelfFirstStrategy.java:50)
at org.codehaus.plexus.classworlds.realm.ClassRealm.unsynchronizedLoadClass(ClassRealm.java:271)
at org.codehaus.plexus.classworlds.realm.ClassRealm.loadClass(ClassRealm.java:247)
at org.codehaus.plexus.classworlds.realm.ClassRealm.loadClass(ClassRealm.java:239)
at jenkins.maven3.agent.Maven32Main.main(Maven32Main.java:143)
at jenkins.maven3.agent.Maven32Main.main(Maven32Main.java:74)
ERROR: Failed to parse POMs
java.io.EOFException: unexpected stream termination
at hudson.remoting.ChannelBuilder.negotiate(ChannelBuilder.java:365)
at hudson.remoting.ChannelBuilder.build(ChannelBuilder.java:310)
at hudson.slaves.Channels.forProcess(Channels.java:115)
at hudson.maven.AbstractMavenProcessFactory.newProcess(AbstractMavenProcessFactory.java:297)
at hudson.maven.ProcessCache.get(ProcessCache.java:236)
at hudson.maven.MavenModuleSetBuild$MavenModuleSetBuildExecution.doRun(MavenModuleSetBuild.java:778)
at hudson.model.AbstractBuild$AbstractBuildExecution.run(AbstractBuild.java:534)
at hudson.model.Run.execute(Run.java:1738)
at hudson.maven.MavenModuleSetBuild.run(MavenModuleSetBuild.java:531)
at hudson.model.ResourceController.execute(ResourceController.java:98)
at hudson.model.Executor.run(Executor.java:410)