You are viewing a plain text version of this content. The canonical link for it is here.
Posted to dev@zookeeper.apache.org by Apache Jenkins Server <je...@builds.apache.org> on 2015/07/08 19:41:35 UTC

Failed: ZOOKEEPER-1423 PreCommit Build #2809

Jira: https://issues.apache.org/jira/browse/ZOOKEEPER-1423
Build: https://builds.apache.org/job/PreCommit-ZOOKEEPER-Build/2809/

###################################################################################
########################## LAST 60 LINES OF THE CONSOLE ###########################
[...truncated 637 lines...]
     [exec]   against trunk revision 1689571.
     [exec] 
     [exec]     +1 @author.  The patch does not contain any @author tags.
     [exec] 
     [exec]     +1 tests included.  The patch appears to include 6 new or modified tests.
     [exec] 
     [exec]     +1 javadoc.  The javadoc tool did not generate any warning messages.
     [exec] 
     [exec]     -1 javac.  The patch appears to cause tar ant target to fail.
     [exec] 
     [exec]     -1 findbugs.  The patch appears to cause Findbugs (version 2.0.3) to fail.
     [exec] 
     [exec]     +1 release audit.  The applied patch does not increase the total number of release audit warnings.
     [exec] 
     [exec]     -1 core tests.  The patch failed core unit tests.
     [exec] 
     [exec]     +1 contrib tests.  The patch passed contrib unit tests.
     [exec] 
     [exec] Test results: https://builds.apache.org/job/PreCommit-ZOOKEEPER-Build/2809//testReport/
     [exec] Console output: https://builds.apache.org/job/PreCommit-ZOOKEEPER-Build/2809//console
     [exec] 
     [exec] This message is automatically generated.
     [exec] 
     [exec] 
     [exec] ======================================================================
     [exec] ======================================================================
     [exec]     Adding comment to Jira.
     [exec] ======================================================================
     [exec] ======================================================================
     [exec] 
     [exec] 
     [exec] Comment added.
     [exec] f6b73c4a19b680544b41ecd1a9ed3e92e651c1c6 logged out
     [exec] 
     [exec] 
     [exec] ======================================================================
     [exec] ======================================================================
     [exec]     Finished build.
     [exec] ======================================================================
     [exec] ======================================================================
     [exec] 
     [exec] 

BUILD FAILED
/home/jenkins/jenkins-slave/workspace/PreCommit-ZOOKEEPER-Build/trunk/build.xml:1783: exec returned: 3

Total time: 1 minute 9 seconds
Build step 'Execute shell' marked build as failure
Archiving artifacts
Sending artifact delta relative to PreCommit-ZOOKEEPER-Build #2808
Archived 4 artifacts
Archive block size is 32768
Received 0 blocks and 85035 bytes
Compression is 0.0%
Took 0.66 sec
Recording test results
Description set: ZOOKEEPER-1423
Email was triggered for: Failure
Sending email for trigger: Failure



###################################################################################
############################## FAILED TESTS (if any) ##############################
No tests ran.

Success: ZOOKEEPER-1423 PreCommit Build #2810

Posted by Apache Jenkins Server <je...@builds.apache.org>.
Jira: https://issues.apache.org/jira/browse/ZOOKEEPER-1423
Build: https://builds.apache.org/job/PreCommit-ZOOKEEPER-Build/2810/

###################################################################################
########################## LAST 60 LINES OF THE CONSOLE ###########################
[...truncated 376977 lines...]
     [exec] +1 overall.  Here are the results of testing the latest attachment 
     [exec]   http://issues.apache.org/jira/secure/attachment/12744356/ZOOKEEPER-1423.8.patch
     [exec]   against trunk revision 1689571.
     [exec] 
     [exec]     +1 @author.  The patch does not contain any @author tags.
     [exec] 
     [exec]     +1 tests included.  The patch appears to include 6 new or modified tests.
     [exec] 
     [exec]     +1 javadoc.  The javadoc tool did not generate any warning messages.
     [exec] 
     [exec]     +1 javac.  The applied patch does not increase the total number of javac compiler warnings.
     [exec] 
     [exec]     +1 findbugs.  The patch does not introduce any new Findbugs (version 2.0.3) warnings.
     [exec] 
     [exec]     +1 release audit.  The applied patch does not increase the total number of release audit warnings.
     [exec] 
     [exec]     +1 core tests.  The patch passed core unit tests.
     [exec] 
     [exec]     +1 contrib tests.  The patch passed contrib unit tests.
     [exec] 
     [exec] Test results: https://builds.apache.org/job/PreCommit-ZOOKEEPER-Build/2810//testReport/
     [exec] Findbugs warnings: https://builds.apache.org/job/PreCommit-ZOOKEEPER-Build/2810//artifact/trunk/build/test/findbugs/newPatchFindbugsWarnings.html
     [exec] Console output: https://builds.apache.org/job/PreCommit-ZOOKEEPER-Build/2810//console
     [exec] 
     [exec] This message is automatically generated.
     [exec] 
     [exec] 
     [exec] ======================================================================
     [exec] ======================================================================
     [exec]     Adding comment to Jira.
     [exec] ======================================================================
     [exec] ======================================================================
     [exec] 
     [exec] 
     [exec] Comment added.
     [exec] 737d68b4e0c2bbcb2c521350122b6eb64d9d170f logged out
     [exec] 
     [exec] 
     [exec] ======================================================================
     [exec] ======================================================================
     [exec]     Finished build.
     [exec] ======================================================================
     [exec] ======================================================================
     [exec] 
     [exec] 

BUILD SUCCESSFUL
Total time: 13 minutes 42 seconds
Archiving artifacts
Sending artifact delta relative to PreCommit-ZOOKEEPER-Build #2808
Archived 24 artifacts
Archive block size is 32768
Received 5 blocks and 34195784 bytes
Compression is 0.5%
Took 7.3 sec
Recording test results
Description set: ZOOKEEPER-1423
Email was triggered for: Success
Sending email for trigger: Success



###################################################################################
############################## FAILED TESTS (if any) ##############################
All tests passed